tez-dev mailing list archives

Site index · List index
Message view « Date » · « Thread »
Top « Date » · « Thread »
From Apache Jenkins Server <jenk...@builds.apache.org>
Subject Build failed in Jenkins: Tez-Build-Hadoop-2.4 #217
Date Thu, 03 Dec 2015 02:02:15 GMT
See <https://builds.apache.org/job/Tez-Build-Hadoop-2.4/217/changes>

Changes:

[sree] TEZ-2960. Tez UI: Move hardcoded url namespace to the configuration file

------------------------------------------
[...truncated 1355 lines...]
java.lang.AssertionError: null
	at org.junit.Assert.fail(Assert.java:86)
	at org.junit.Assert.assertTrue(Assert.java:41)
	at org.junit.Assert.assertTrue(Assert.java:52)
	at org.apache.tez.history.TestHistoryParser.verifyDagInfo(TestHistoryParser.java:698)
	at org.apache.tez.history.TestHistoryParser.testParserWithSuccessfulJob(TestHistoryParser.java:209)


Results :

Failed tests: 
  TestHistoryParser.testParserWithFailedJob:372->verifyDagInfo:697 null
  TestHistoryParser.testParserWithSuccessfulJob:209->verifyDagInfo:698 null

Tests run: 3, Failures: 2, Errors: 0, Skipped: 0

[INFO]                                                                         
[INFO] ------------------------------------------------------------------------
[INFO] Building tez-tools 0.8.2-SNAPSHOT
[INFO] ------------------------------------------------------------------------
[INFO] 
[INFO] --- maven-clean-plugin:2.5:clean (default-clean) @ tez-tools ---
[INFO] 
[INFO] --- buildnumber-maven-plugin:1.1:create (default) @ tez-tools ---
[INFO] Checking for local modifications: skipped.
[INFO] Updating project files from SCM: skipped.
[INFO] Executing: /bin/sh -c cd <https://builds.apache.org/job/Tez-Build-Hadoop-2.4/ws/tez-tools>
&& git rev-parse --verify HEAD
[INFO] Working directory: <https://builds.apache.org/job/Tez-Build-Hadoop-2.4/ws/tez-tools>
[INFO] Storing buildNumber: 9dce5101170893066d788e8a1a96bbc8672dc5b9 at timestamp: 1449108127572
[INFO] Executing: /bin/sh -c cd <https://builds.apache.org/job/Tez-Build-Hadoop-2.4/ws/tez-tools>
&& git rev-parse --verify HEAD
[INFO] Working directory: <https://builds.apache.org/job/Tez-Build-Hadoop-2.4/ws/tez-tools>
[INFO] Storing buildScmBranch: UNKNOWN
[INFO] 
[INFO] --- build-helper-maven-plugin:1.8:maven-version (maven-version) @ tez-tools ---
[INFO]                                                                         
[INFO] ------------------------------------------------------------------------
[INFO] Building tez-perf-analyzer 0.8.2-SNAPSHOT
[INFO] ------------------------------------------------------------------------
[INFO] 
[INFO] --- maven-clean-plugin:2.5:clean (default-clean) @ tez-perf-analyzer ---
[INFO] 
[INFO] --- buildnumber-maven-plugin:1.1:create (default) @ tez-perf-analyzer ---
[INFO] Checking for local modifications: skipped.
[INFO] Updating project files from SCM: skipped.
[INFO] Executing: /bin/sh -c cd <https://builds.apache.org/job/Tez-Build-Hadoop-2.4/ws/tez-tools/analyzers>
&& git rev-parse --verify HEAD
[INFO] Working directory: <https://builds.apache.org/job/Tez-Build-Hadoop-2.4/ws/tez-tools/analyzers>
[INFO] Storing buildNumber: 9dce5101170893066d788e8a1a96bbc8672dc5b9 at timestamp: 1449108127586
[INFO] Executing: /bin/sh -c cd <https://builds.apache.org/job/Tez-Build-Hadoop-2.4/ws/tez-tools/analyzers>
&& git rev-parse --verify HEAD
[INFO] Working directory: <https://builds.apache.org/job/Tez-Build-Hadoop-2.4/ws/tez-tools/analyzers>
[INFO] Storing buildScmBranch: UNKNOWN
[INFO] 
[INFO] --- build-helper-maven-plugin:1.8:maven-version (maven-version) @ tez-perf-analyzer
---
[INFO]                                                                         
[INFO] ------------------------------------------------------------------------
[INFO] Skipping tez-job-analyzer
[INFO] This project has been banned from the build due to previous failures.
[INFO] ------------------------------------------------------------------------
[INFO]                                                                         
[INFO] ------------------------------------------------------------------------
[INFO] Building tez-javadoc-tools 0.8.2-SNAPSHOT
[INFO] ------------------------------------------------------------------------
[INFO] 
[INFO] --- maven-clean-plugin:2.5:clean (default-clean) @ tez-javadoc-tools ---
[INFO] Deleting <https://builds.apache.org/job/Tez-Build-Hadoop-2.4/ws/tez-tools/tez-javadoc-tools/target>
[INFO] 
[INFO] --- buildnumber-maven-plugin:1.1:create (default) @ tez-javadoc-tools ---
[INFO] Checking for local modifications: skipped.
[INFO] Updating project files from SCM: skipped.
[INFO] Executing: /bin/sh -c cd <https://builds.apache.org/job/Tez-Build-Hadoop-2.4/ws/tez-tools/tez-javadoc-tools>
&& git rev-parse --verify HEAD
[INFO] Working directory: <https://builds.apache.org/job/Tez-Build-Hadoop-2.4/ws/tez-tools/tez-javadoc-tools>
[INFO] Storing buildNumber: 9dce5101170893066d788e8a1a96bbc8672dc5b9 at timestamp: 1449108127711
[INFO] Executing: /bin/sh -c cd <https://builds.apache.org/job/Tez-Build-Hadoop-2.4/ws/tez-tools/tez-javadoc-tools>
&& git rev-parse --verify HEAD
[INFO] Working directory: <https://builds.apache.org/job/Tez-Build-Hadoop-2.4/ws/tez-tools/tez-javadoc-tools>
[INFO] Storing buildScmBranch: UNKNOWN
[INFO] 
[INFO] --- build-helper-maven-plugin:1.8:maven-version (maven-version) @ tez-javadoc-tools
---
[INFO] 
[INFO] --- maven-resources-plugin:2.6:resources (default-resources) @ tez-javadoc-tools ---
[INFO] Using 'UTF-8' encoding to copy filtered resources.
[INFO] skip non existing resourceDirectory <https://builds.apache.org/job/Tez-Build-Hadoop-2.4/ws/tez-tools/tez-javadoc-tools/src/main/resources>
[INFO] 
[INFO] --- maven-compiler-plugin:3.1:compile (default-compile) @ tez-javadoc-tools ---
[INFO] Changes detected - recompiling the module!
[INFO] Compiling 6 source files to <https://builds.apache.org/job/Tez-Build-Hadoop-2.4/ws/tez-tools/tez-javadoc-tools/target/classes>
[INFO] 
[INFO] --- maven-resources-plugin:2.6:testResources (default-testResources) @ tez-javadoc-tools
---
[INFO] Using 'UTF-8' encoding to copy filtered resources.
[INFO] skip non existing resourceDirectory <https://builds.apache.org/job/Tez-Build-Hadoop-2.4/ws/tez-tools/tez-javadoc-tools/src/test/resources>
[INFO] 
[INFO] --- maven-compiler-plugin:3.1:testCompile (default-testCompile) @ tez-javadoc-tools
---
[INFO] No sources to compile
[INFO] 
[INFO] --- maven-surefire-plugin:2.14.1:test (default-test) @ tez-javadoc-tools ---
[INFO] No tests to run.
[INFO]                                                                         
[INFO] ------------------------------------------------------------------------
[INFO] Building hadoop-shim-impls 0.8.2-SNAPSHOT
[INFO] ------------------------------------------------------------------------
[INFO] 
[INFO] --- maven-clean-plugin:2.5:clean (default-clean) @ hadoop-shim-impls ---
[INFO] 
[INFO] --- buildnumber-maven-plugin:1.1:create (default) @ hadoop-shim-impls ---
[INFO] Checking for local modifications: skipped.
[INFO] Updating project files from SCM: skipped.
[INFO] Executing: /bin/sh -c cd <https://builds.apache.org/job/Tez-Build-Hadoop-2.4/ws/hadoop-shim-impls>
&& git rev-parse --verify HEAD
[INFO] Working directory: <https://builds.apache.org/job/Tez-Build-Hadoop-2.4/ws/hadoop-shim-impls>
[INFO] Storing buildNumber: 9dce5101170893066d788e8a1a96bbc8672dc5b9 at timestamp: 1449108127877
[INFO] Executing: /bin/sh -c cd <https://builds.apache.org/job/Tez-Build-Hadoop-2.4/ws/hadoop-shim-impls>
&& git rev-parse --verify HEAD
[INFO] Working directory: <https://builds.apache.org/job/Tez-Build-Hadoop-2.4/ws/hadoop-shim-impls>
[INFO] Storing buildScmBranch: UNKNOWN
[INFO] 
[INFO] --- build-helper-maven-plugin:1.8:maven-version (maven-version) @ hadoop-shim-impls
---
[INFO]                                                                         
[INFO] ------------------------------------------------------------------------
[INFO] Building hadoop-shim-2.4 0.8.2-SNAPSHOT
[INFO] ------------------------------------------------------------------------
[INFO] 
[INFO] --- maven-clean-plugin:2.5:clean (default-clean) @ hadoop-shim-2.4 ---
[INFO] Deleting <https://builds.apache.org/job/Tez-Build-Hadoop-2.4/ws/hadoop-shim-impls/hadoop-shim-2.4/target>
[INFO] 
[INFO] --- buildnumber-maven-plugin:1.1:create (default) @ hadoop-shim-2.4 ---
[INFO] Checking for local modifications: skipped.
[INFO] Updating project files from SCM: skipped.
[INFO] Executing: /bin/sh -c cd <https://builds.apache.org/job/Tez-Build-Hadoop-2.4/ws/hadoop-shim-impls/hadoop-shim-2.4>
&& git rev-parse --verify HEAD
[INFO] Working directory: <https://builds.apache.org/job/Tez-Build-Hadoop-2.4/ws/hadoop-shim-impls/hadoop-shim-2.4>
[INFO] Storing buildNumber: 9dce5101170893066d788e8a1a96bbc8672dc5b9 at timestamp: 1449108127956
[INFO] Executing: /bin/sh -c cd <https://builds.apache.org/job/Tez-Build-Hadoop-2.4/ws/hadoop-shim-impls/hadoop-shim-2.4>
&& git rev-parse --verify HEAD
[INFO] Working directory: <https://builds.apache.org/job/Tez-Build-Hadoop-2.4/ws/hadoop-shim-impls/hadoop-shim-2.4>
[INFO] Storing buildScmBranch: UNKNOWN
[INFO] 
[INFO] --- build-helper-maven-plugin:1.8:maven-version (maven-version) @ hadoop-shim-2.4 ---
[INFO] 
[INFO] --- maven-resources-plugin:2.6:resources (default-resources) @ hadoop-shim-2.4 ---
[INFO] Using 'UTF-8' encoding to copy filtered resources.
[INFO] Copying 1 resource
[INFO] 
[INFO] --- maven-compiler-plugin:3.1:compile (default-compile) @ hadoop-shim-2.4 ---
[INFO] Changes detected - recompiling the module!
[INFO] Compiling 2 source files to <https://builds.apache.org/job/Tez-Build-Hadoop-2.4/ws/hadoop-shim-impls/hadoop-shim-2.4/target/classes>
[INFO] 
[INFO] --- maven-resources-plugin:2.6:testResources (default-testResources) @ hadoop-shim-2.4
---
[INFO] Using 'UTF-8' encoding to copy filtered resources.
[INFO] skip non existing resourceDirectory <https://builds.apache.org/job/Tez-Build-Hadoop-2.4/ws/hadoop-shim-impls/hadoop-shim-2.4/src/test/resources>
[INFO] 
[INFO] --- maven-compiler-plugin:3.1:testCompile (default-testCompile) @ hadoop-shim-2.4 ---
[INFO] Changes detected - recompiling the module!
[INFO] Compiling 1 source file to <https://builds.apache.org/job/Tez-Build-Hadoop-2.4/ws/hadoop-shim-impls/hadoop-shim-2.4/target/test-classes>
[INFO] 
[INFO] --- maven-surefire-plugin:2.14.1:test (default-test) @ hadoop-shim-2.4 ---
[INFO] Surefire report directory: <https://builds.apache.org/job/Tez-Build-Hadoop-2.4/ws/hadoop-shim-impls/hadoop-shim-2.4/target/surefire-reports>

-------------------------------------------------------
 T E S T S
-------------------------------------------------------

-------------------------------------------------------
 T E S T S
-------------------------------------------------------
Running org.apache.tez.hadoop.shim.TestHadoop23_24ShimProvider
Tests run: 1, Failures: 0, Errors: 0, Skipped: 0, Time elapsed: 0.068 sec

Results :

Tests run: 1, Failures: 0, Errors: 0, Skipped: 0

[INFO]                                                                         
[INFO] ------------------------------------------------------------------------
[INFO] Building tez-dist 0.8.2-SNAPSHOT
[INFO] ------------------------------------------------------------------------
[INFO] 
[INFO] --- maven-clean-plugin:2.5:clean (default-clean) @ tez-dist ---
[INFO] 
[INFO] --- buildnumber-maven-plugin:1.1:create (default) @ tez-dist ---
[INFO] Checking for local modifications: skipped.
[INFO] Updating project files from SCM: skipped.
[INFO] Executing: /bin/sh -c cd <https://builds.apache.org/job/Tez-Build-Hadoop-2.4/ws/tez-dist>
&& git rev-parse --verify HEAD
[INFO] Working directory: <https://builds.apache.org/job/Tez-Build-Hadoop-2.4/ws/tez-dist>
[INFO] Storing buildNumber: 9dce5101170893066d788e8a1a96bbc8672dc5b9 at timestamp: 1449108128463
[INFO] Executing: /bin/sh -c cd <https://builds.apache.org/job/Tez-Build-Hadoop-2.4/ws/tez-dist>
&& git rev-parse --verify HEAD
[INFO] Working directory: <https://builds.apache.org/job/Tez-Build-Hadoop-2.4/ws/tez-dist>
[INFO] Storing buildScmBranch: UNKNOWN
[INFO] 
[INFO] --- build-helper-maven-plugin:1.8:maven-version (maven-version) @ tez-dist ---
[INFO]                                                                         
[INFO] ------------------------------------------------------------------------
[INFO] Building Tez 0.8.2-SNAPSHOT
[INFO] ------------------------------------------------------------------------
[INFO] 
[INFO] --- maven-clean-plugin:2.5:clean (default-clean) @ tez-docs ---
[INFO] 
[INFO] --- buildnumber-maven-plugin:1.1:create (default) @ tez-docs ---
[INFO] Checking for local modifications: skipped.
[INFO] Updating project files from SCM: skipped.
[INFO] Executing: /bin/sh -c cd <https://builds.apache.org/job/Tez-Build-Hadoop-2.4/ws/docs>
&& git rev-parse --verify HEAD
[INFO] Working directory: <https://builds.apache.org/job/Tez-Build-Hadoop-2.4/ws/docs>
[INFO] Storing buildNumber: 9dce5101170893066d788e8a1a96bbc8672dc5b9 at timestamp: 1449108128481
[INFO] Executing: /bin/sh -c cd <https://builds.apache.org/job/Tez-Build-Hadoop-2.4/ws/docs>
&& git rev-parse --verify HEAD
[INFO] Working directory: <https://builds.apache.org/job/Tez-Build-Hadoop-2.4/ws/docs>
[INFO] Storing buildScmBranch: UNKNOWN
[INFO] 
[INFO] --- build-helper-maven-plugin:1.8:maven-version (maven-version) @ tez-docs ---
[INFO] ------------------------------------------------------------------------
[INFO] Reactor Summary:
[INFO] 
[INFO] tez ............................................... SUCCESS [  1.735 s]
[INFO] hadoop-shim ....................................... SUCCESS [  1.910 s]
[INFO] tez-api ........................................... SUCCESS [ 48.786 s]
[INFO] tez-common ........................................ SUCCESS [  4.680 s]
[INFO] tez-runtime-internals ............................. SUCCESS [ 13.584 s]
[INFO] tez-runtime-library ............................... SUCCESS [02:49 min]
[INFO] tez-mapreduce ..................................... SUCCESS [ 33.449 s]
[INFO] tez-examples ...................................... SUCCESS [  0.332 s]
[INFO] tez-dag ........................................... SUCCESS [02:22 min]
[INFO] tez-tests ......................................... SUCCESS [40:13 min]
[INFO] tez-ext-service-tests ............................. SUCCESS [01:04 min]
[INFO] tez-ui ............................................ SUCCESS [ 21.291 s]
[INFO] tez-plugins ....................................... SUCCESS [  0.021 s]
[INFO] tez-yarn-timeline-history ......................... SUCCESS [ 56.111 s]
[INFO] tez-history-parser ................................ FAILURE [01:29 min]
[INFO] tez-tools ......................................... SUCCESS [  0.016 s]
[INFO] tez-perf-analyzer ................................. SUCCESS [  0.013 s]
[INFO] tez-job-analyzer .................................. SKIPPED
[INFO] tez-javadoc-tools ................................. SUCCESS [  0.278 s]
[INFO] hadoop-shim-impls ................................. SUCCESS [  0.013 s]
[INFO] hadoop-shim-2.4 ................................... SUCCESS [  0.571 s]
[INFO] tez-dist .......................................... SUCCESS [  0.018 s]
[INFO] Tez ............................................... SUCCESS [  0.015 s]
[INFO] ------------------------------------------------------------------------
[INFO] BUILD FAILURE
[INFO] ------------------------------------------------------------------------
[INFO] Total time: 51:03 min
[INFO] Finished at: 2015-12-03T02:02:08+00:00
[INFO] Final Memory: 49M/876M
[INFO] ------------------------------------------------------------------------
[ERROR] Failed to execute goal org.apache.maven.plugins:maven-surefire-plugin:2.14.1:test
(default-test) on project tez-history-parser: There are test failures.
[ERROR] 
[ERROR] Please refer to <https://builds.apache.org/job/Tez-Build-Hadoop-2.4/ws/tez-plugins/tez-history-parser/target/surefire-reports>
for the individual test results.
[ERROR] -> [Help 1]
[ERROR] 
[ERROR] To see the full stack trace of the errors, re-run Maven with the -e switch.
[ERROR] Re-run Maven using the -X switch to enable full debug logging.
[ERROR] 
[ERROR] For more information about the errors and possible solutions, please read the following
articles:
[ERROR] [Help 1] http://cwiki.apache.org/confluence/display/MAVEN/MojoFailureException
[ERROR] 
[ERROR] After correcting the problems, you can resume the build with the command
[ERROR]   mvn <goals> -rf :tez-history-parser
Build step 'Execute shell' marked build as failure
Recording test results

Mime
View raw message