tez-dev mailing list archives

Site index · List index
Message view « Date » · « Thread »
Top « Date » · « Thread »
From Apache Jenkins Server <jenk...@builds.apache.org>
Subject Build failed in Jenkins: Tez-Build-branch-0.7 #114
Date Sat, 16 Jan 2016 16:49:18 GMT
See <https://builds.apache.org/job/Tez-Build-branch-0.7/114/changes>

Changes:

[jeagles] TEZ-2937. Can Processor.close() be called after closing inputs and

------------------------------------------
[...truncated 1410 lines...]
[INFO] Working directory: <https://builds.apache.org/job/Tez-Build-branch-0.7/ws/tez-plugins>
[INFO] Storing buildScmBranch: UNKNOWN
[INFO] 
[INFO] --- build-helper-maven-plugin:1.8:maven-version (maven-version) @ tez-plugins ---
[INFO] 
[INFO] --- maven-jar-plugin:2.4:test-jar (default) @ tez-plugins ---
[WARNING] JAR will be empty - no content was marked for inclusion!
[INFO]                                                                         
[INFO] ------------------------------------------------------------------------
[INFO] Skipping tez-yarn-timeline-history
[INFO] This project has been banned from the build due to previous failures.
[INFO] ------------------------------------------------------------------------
[INFO]                                                                         
[INFO] ------------------------------------------------------------------------
[INFO] Skipping tez-yarn-timeline-history-with-acls
[INFO] This project has been banned from the build due to previous failures.
[INFO] ------------------------------------------------------------------------
[INFO]                                                                         
[INFO] ------------------------------------------------------------------------
[INFO] Skipping tez-history-parser
[INFO] This project has been banned from the build due to previous failures.
[INFO] ------------------------------------------------------------------------
[INFO]                                                                         
[INFO] ------------------------------------------------------------------------
[INFO] Building tez-tools 0.7.1-SNAPSHOT
[INFO] ------------------------------------------------------------------------
[INFO] 
[INFO] --- maven-clean-plugin:2.5:clean (default-clean) @ tez-tools ---
[INFO] Deleting <https://builds.apache.org/job/Tez-Build-branch-0.7/ws/tez-tools/target>
[INFO] 
[INFO] --- buildnumber-maven-plugin:1.1:create (default) @ tez-tools ---
[INFO] Checking for local modifications: skipped.
[INFO] Updating project files from SCM: skipped.
[INFO] Executing: /bin/sh -c cd <https://builds.apache.org/job/Tez-Build-branch-0.7/ws/tez-tools>
&& git rev-parse --verify HEAD
[INFO] Working directory: <https://builds.apache.org/job/Tez-Build-branch-0.7/ws/tez-tools>
[INFO] Storing buildNumber: 73a677a1265a42e3d99b61650a60757e25429104 at timestamp: 1452962961958
[INFO] Executing: /bin/sh -c cd <https://builds.apache.org/job/Tez-Build-branch-0.7/ws/tez-tools>
&& git rev-parse --verify HEAD
[INFO] Working directory: <https://builds.apache.org/job/Tez-Build-branch-0.7/ws/tez-tools>
[INFO] Storing buildScmBranch: UNKNOWN
[INFO] 
[INFO] --- build-helper-maven-plugin:1.8:maven-version (maven-version) @ tez-tools ---
[INFO] 
[INFO] --- buildnumber-maven-plugin:1.1:create (default) @ tez-tools ---
[INFO] Checking for local modifications: skipped.
[INFO] Updating project files from SCM: skipped.
[INFO] Executing: /bin/sh -c cd <https://builds.apache.org/job/Tez-Build-branch-0.7/ws/tez-tools>
&& git rev-parse --verify HEAD
[INFO] Working directory: <https://builds.apache.org/job/Tez-Build-branch-0.7/ws/tez-tools>
[INFO] Storing buildNumber: 73a677a1265a42e3d99b61650a60757e25429104 at timestamp: 1452962961968
[INFO] Executing: /bin/sh -c cd <https://builds.apache.org/job/Tez-Build-branch-0.7/ws/tez-tools>
&& git rev-parse --verify HEAD
[INFO] Working directory: <https://builds.apache.org/job/Tez-Build-branch-0.7/ws/tez-tools>
[INFO] Storing buildScmBranch: UNKNOWN
[INFO] 
[INFO] --- build-helper-maven-plugin:1.8:maven-version (maven-version) @ tez-tools ---
[INFO] 
[INFO] --- maven-jar-plugin:2.4:test-jar (default) @ tez-tools ---
[WARNING] JAR will be empty - no content was marked for inclusion!
[INFO] Building jar: <https://builds.apache.org/job/Tez-Build-branch-0.7/ws/tez-tools/target/tez-tools-0.7.1-SNAPSHOT-tests.jar>
[INFO] 
[INFO] --- maven-install-plugin:2.4:install (default-install) @ tez-tools ---
[INFO] Installing <https://builds.apache.org/job/Tez-Build-branch-0.7/ws/tez-tools/pom.xml>
to /home/jenkins/.m2/repository/org/apache/tez/tez-tools/0.7.1-SNAPSHOT/tez-tools-0.7.1-SNAPSHOT.pom
[INFO] Installing <https://builds.apache.org/job/Tez-Build-branch-0.7/ws/tez-tools/target/tez-tools-0.7.1-SNAPSHOT-tests.jar>
to /home/jenkins/.m2/repository/org/apache/tez/tez-tools/0.7.1-SNAPSHOT/tez-tools-0.7.1-SNAPSHOT-tests.jar
[INFO] 
[INFO] --- maven-deploy-plugin:2.8.1:deploy (default-deploy) @ tez-tools ---
[INFO] Deploying org.apache.tez:tez-tools:0.7.1-SNAPSHOT at end
[INFO] 
[INFO] --- buildnumber-maven-plugin:1.1:create (default) @ tez-tools ---
[INFO] Checking for local modifications: skipped.
[INFO] Updating project files from SCM: skipped.
[INFO] Executing: /bin/sh -c cd <https://builds.apache.org/job/Tez-Build-branch-0.7/ws/tez-tools>
&& git rev-parse --verify HEAD
[INFO] Working directory: <https://builds.apache.org/job/Tez-Build-branch-0.7/ws/tez-tools>
[INFO] Storing buildNumber: 73a677a1265a42e3d99b61650a60757e25429104 at timestamp: 1452962962014
[INFO] Executing: /bin/sh -c cd <https://builds.apache.org/job/Tez-Build-branch-0.7/ws/tez-tools>
&& git rev-parse --verify HEAD
[INFO] Working directory: <https://builds.apache.org/job/Tez-Build-branch-0.7/ws/tez-tools>
[INFO] Storing buildScmBranch: UNKNOWN
[INFO] 
[INFO] --- build-helper-maven-plugin:1.8:maven-version (maven-version) @ tez-tools ---
[INFO] 
[INFO] --- maven-jar-plugin:2.4:test-jar (default) @ tez-tools ---
[WARNING] JAR will be empty - no content was marked for inclusion!
[INFO]                                                                         
[INFO] ------------------------------------------------------------------------
[INFO] Building tez-perf-analyzer 0.7.1-SNAPSHOT
[INFO] ------------------------------------------------------------------------
[INFO] 
[INFO] --- maven-clean-plugin:2.5:clean (default-clean) @ tez-perf-analyzer ---
[INFO] Deleting <https://builds.apache.org/job/Tez-Build-branch-0.7/ws/tez-tools/analyzers/target>
[INFO] 
[INFO] --- buildnumber-maven-plugin:1.1:create (default) @ tez-perf-analyzer ---
[INFO] Checking for local modifications: skipped.
[INFO] Updating project files from SCM: skipped.
[INFO] Executing: /bin/sh -c cd <https://builds.apache.org/job/Tez-Build-branch-0.7/ws/tez-tools/analyzers>
&& git rev-parse --verify HEAD
[INFO] Working directory: <https://builds.apache.org/job/Tez-Build-branch-0.7/ws/tez-tools/analyzers>
[INFO] Storing buildNumber: 73a677a1265a42e3d99b61650a60757e25429104 at timestamp: 1452962962033
[INFO] Executing: /bin/sh -c cd <https://builds.apache.org/job/Tez-Build-branch-0.7/ws/tez-tools/analyzers>
&& git rev-parse --verify HEAD
[INFO] Working directory: <https://builds.apache.org/job/Tez-Build-branch-0.7/ws/tez-tools/analyzers>
[INFO] Storing buildScmBranch: UNKNOWN
[INFO] 
[INFO] --- build-helper-maven-plugin:1.8:maven-version (maven-version) @ tez-perf-analyzer
---
[INFO] 
[INFO] --- buildnumber-maven-plugin:1.1:create (default) @ tez-perf-analyzer ---
[INFO] Checking for local modifications: skipped.
[INFO] Updating project files from SCM: skipped.
[INFO] Executing: /bin/sh -c cd <https://builds.apache.org/job/Tez-Build-branch-0.7/ws/tez-tools/analyzers>
&& git rev-parse --verify HEAD
[INFO] Working directory: <https://builds.apache.org/job/Tez-Build-branch-0.7/ws/tez-tools/analyzers>
[INFO] Storing buildNumber: 73a677a1265a42e3d99b61650a60757e25429104 at timestamp: 1452962962045
[INFO] Executing: /bin/sh -c cd <https://builds.apache.org/job/Tez-Build-branch-0.7/ws/tez-tools/analyzers>
&& git rev-parse --verify HEAD
[INFO] Working directory: <https://builds.apache.org/job/Tez-Build-branch-0.7/ws/tez-tools/analyzers>
[INFO] Storing buildScmBranch: UNKNOWN
[INFO] 
[INFO] --- build-helper-maven-plugin:1.8:maven-version (maven-version) @ tez-perf-analyzer
---
[INFO] 
[INFO] --- maven-jar-plugin:2.4:test-jar (default) @ tez-perf-analyzer ---
[WARNING] JAR will be empty - no content was marked for inclusion!
[INFO] Building jar: <https://builds.apache.org/job/Tez-Build-branch-0.7/ws/tez-tools/analyzers/target/tez-perf-analyzer-0.7.1-SNAPSHOT-tests.jar>
[INFO] 
[INFO] --- maven-install-plugin:2.4:install (default-install) @ tez-perf-analyzer ---
[INFO] Installing <https://builds.apache.org/job/Tez-Build-branch-0.7/ws/tez-tools/analyzers/pom.xml>
to /home/jenkins/.m2/repository/org/apache/tez/tez-perf-analyzer/0.7.1-SNAPSHOT/tez-perf-analyzer-0.7.1-SNAPSHOT.pom
[INFO] Installing <https://builds.apache.org/job/Tez-Build-branch-0.7/ws/tez-tools/analyzers/target/tez-perf-analyzer-0.7.1-SNAPSHOT-tests.jar>
to /home/jenkins/.m2/repository/org/apache/tez/tez-perf-analyzer/0.7.1-SNAPSHOT/tez-perf-analyzer-0.7.1-SNAPSHOT-tests.jar
[INFO] 
[INFO] --- maven-deploy-plugin:2.8.1:deploy (default-deploy) @ tez-perf-analyzer ---
[INFO] Deploying org.apache.tez:tez-perf-analyzer:0.7.1-SNAPSHOT at end
[INFO] 
[INFO] --- buildnumber-maven-plugin:1.1:create (default) @ tez-perf-analyzer ---
[INFO] Checking for local modifications: skipped.
[INFO] Updating project files from SCM: skipped.
[INFO] Executing: /bin/sh -c cd <https://builds.apache.org/job/Tez-Build-branch-0.7/ws/tez-tools/analyzers>
&& git rev-parse --verify HEAD
[INFO] Working directory: <https://builds.apache.org/job/Tez-Build-branch-0.7/ws/tez-tools/analyzers>
[INFO] Storing buildNumber: 73a677a1265a42e3d99b61650a60757e25429104 at timestamp: 1452962962087
[INFO] Executing: /bin/sh -c cd <https://builds.apache.org/job/Tez-Build-branch-0.7/ws/tez-tools/analyzers>
&& git rev-parse --verify HEAD
[INFO] Working directory: <https://builds.apache.org/job/Tez-Build-branch-0.7/ws/tez-tools/analyzers>
[INFO] Storing buildScmBranch: UNKNOWN
[INFO] 
[INFO] --- build-helper-maven-plugin:1.8:maven-version (maven-version) @ tez-perf-analyzer
---
[INFO] 
[INFO] --- maven-jar-plugin:2.4:test-jar (default) @ tez-perf-analyzer ---
[WARNING] JAR will be empty - no content was marked for inclusion!
[INFO]                                                                         
[INFO] ------------------------------------------------------------------------
[INFO] Skipping tez-job-analyzer
[INFO] This project has been banned from the build due to previous failures.
[INFO] ------------------------------------------------------------------------
[INFO]                                                                         
[INFO] ------------------------------------------------------------------------
[INFO] Skipping tez-dist
[INFO] This project has been banned from the build due to previous failures.
[INFO] ------------------------------------------------------------------------
[INFO]                                                                         
[INFO] ------------------------------------------------------------------------
[INFO] Building Tez 0.7.1-SNAPSHOT
[INFO] ------------------------------------------------------------------------
[INFO] 
[INFO] --- maven-clean-plugin:2.5:clean (default-clean) @ tez-docs ---
[INFO] Deleting <https://builds.apache.org/job/Tez-Build-branch-0.7/ws/docs/target>
[INFO] 
[INFO] --- buildnumber-maven-plugin:1.1:create (default) @ tez-docs ---
[INFO] Checking for local modifications: skipped.
[INFO] Updating project files from SCM: skipped.
[INFO] Executing: /bin/sh -c cd <https://builds.apache.org/job/Tez-Build-branch-0.7/ws/docs>
&& git rev-parse --verify HEAD
[INFO] Working directory: <https://builds.apache.org/job/Tez-Build-branch-0.7/ws/docs>
[INFO] Storing buildNumber: 73a677a1265a42e3d99b61650a60757e25429104 at timestamp: 1452962962104
[INFO] Executing: /bin/sh -c cd <https://builds.apache.org/job/Tez-Build-branch-0.7/ws/docs>
&& git rev-parse --verify HEAD
[INFO] Working directory: <https://builds.apache.org/job/Tez-Build-branch-0.7/ws/docs>
[INFO] Storing buildScmBranch: UNKNOWN
[INFO] 
[INFO] --- build-helper-maven-plugin:1.8:maven-version (maven-version) @ tez-docs ---
[INFO] 
[INFO] --- buildnumber-maven-plugin:1.1:create (default) @ tez-docs ---
[INFO] Checking for local modifications: skipped.
[INFO] Updating project files from SCM: skipped.
[INFO] Executing: /bin/sh -c cd <https://builds.apache.org/job/Tez-Build-branch-0.7/ws/docs>
&& git rev-parse --verify HEAD
[INFO] Working directory: <https://builds.apache.org/job/Tez-Build-branch-0.7/ws/docs>
[INFO] Storing buildNumber: 73a677a1265a42e3d99b61650a60757e25429104 at timestamp: 1452962962115
[INFO] Executing: /bin/sh -c cd <https://builds.apache.org/job/Tez-Build-branch-0.7/ws/docs>
&& git rev-parse --verify HEAD
[INFO] Working directory: <https://builds.apache.org/job/Tez-Build-branch-0.7/ws/docs>
[INFO] Storing buildScmBranch: UNKNOWN
[INFO] 
[INFO] --- build-helper-maven-plugin:1.8:maven-version (maven-version) @ tez-docs ---
[INFO] 
[INFO] --- maven-jar-plugin:2.4:test-jar (default) @ tez-docs ---
[WARNING] JAR will be empty - no content was marked for inclusion!
[INFO] Building jar: <https://builds.apache.org/job/Tez-Build-branch-0.7/ws/docs/target/tez-docs-0.7.1-SNAPSHOT-tests.jar>
[INFO] 
[INFO] --- maven-install-plugin:2.4:install (default-install) @ tez-docs ---
[INFO] Installing <https://builds.apache.org/job/Tez-Build-branch-0.7/ws/docs/pom.xml>
to /home/jenkins/.m2/repository/org/apache/tez/tez-docs/0.7.1-SNAPSHOT/tez-docs-0.7.1-SNAPSHOT.pom
[INFO] Installing <https://builds.apache.org/job/Tez-Build-branch-0.7/ws/docs/target/tez-docs-0.7.1-SNAPSHOT-tests.jar>
to /home/jenkins/.m2/repository/org/apache/tez/tez-docs/0.7.1-SNAPSHOT/tez-docs-0.7.1-SNAPSHOT-tests.jar
[INFO] 
[INFO] --- maven-deploy-plugin:2.8.1:deploy (default-deploy) @ tez-docs ---
[INFO] Skipping artifact deployment
[INFO] 
[INFO] --- buildnumber-maven-plugin:1.1:create (default) @ tez-docs ---
[INFO] Checking for local modifications: skipped.
[INFO] Updating project files from SCM: skipped.
[INFO] Executing: /bin/sh -c cd <https://builds.apache.org/job/Tez-Build-branch-0.7/ws/docs>
&& git rev-parse --verify HEAD
[INFO] Working directory: <https://builds.apache.org/job/Tez-Build-branch-0.7/ws/docs>
[INFO] Storing buildNumber: 73a677a1265a42e3d99b61650a60757e25429104 at timestamp: 1452962962161
[INFO] Executing: /bin/sh -c cd <https://builds.apache.org/job/Tez-Build-branch-0.7/ws/docs>
&& git rev-parse --verify HEAD
[INFO] Working directory: <https://builds.apache.org/job/Tez-Build-branch-0.7/ws/docs>
[INFO] Storing buildScmBranch: UNKNOWN
[INFO] 
[INFO] --- build-helper-maven-plugin:1.8:maven-version (maven-version) @ tez-docs ---
[INFO] 
[INFO] --- maven-jar-plugin:2.4:test-jar (default) @ tez-docs ---
[WARNING] JAR will be empty - no content was marked for inclusion!
[INFO] ------------------------------------------------------------------------
[INFO] Reactor Summary:
[INFO] 
[INFO] tez ............................................... SUCCESS [  1.259 s]
[INFO] tez-api ........................................... SUCCESS [ 14.923 s]
[INFO] tez-common ........................................ SUCCESS [  0.671 s]
[INFO] tez-runtime-internals ............................. FAILURE [  0.375 s]
[INFO] tez-runtime-library ............................... SKIPPED
[INFO] tez-mapreduce ..................................... SKIPPED
[INFO] tez-examples ...................................... SKIPPED
[INFO] tez-dag ........................................... SKIPPED
[INFO] tez-tests ......................................... SKIPPED
[INFO] tez-ui ............................................ SUCCESS [ 39.659 s]
[INFO] tez-plugins ....................................... SUCCESS [  0.179 s]
[INFO] tez-yarn-timeline-history ......................... SKIPPED
[INFO] tez-yarn-timeline-history-with-acls ............... SKIPPED
[INFO] tez-history-parser ................................ SKIPPED
[INFO] tez-tools ......................................... SUCCESS [  0.076 s]
[INFO] tez-perf-analyzer ................................. SUCCESS [  0.070 s]
[INFO] tez-job-analyzer .................................. SKIPPED
[INFO] tez-dist .......................................... SKIPPED
[INFO] Tez ............................................... SUCCESS [  0.077 s]
[INFO] ------------------------------------------------------------------------
[INFO] BUILD FAILURE
[INFO] ------------------------------------------------------------------------
[INFO] Total time: 57.889 s
[INFO] Finished at: 2016-01-16T16:49:22+00:00
[INFO] Final Memory: 48M/1042M
[INFO] ------------------------------------------------------------------------
[ERROR] Failed to execute goal org.apache.maven.plugins:maven-compiler-plugin:3.1:compile
(default-compile) on project tez-runtime-internals: Compilation failure
[ERROR] <https://builds.apache.org/job/Tez-Build-branch-0.7/ws/tez-runtime-internals/src/main/java/org/apache/tez/runtime/LogicalIOProcessorRuntimeTask.java>:[857,9]
cannot find symbol
[ERROR] symbol:   method maybeResetInterruptStatus()
[ERROR] location: class org.apache.tez.runtime.LogicalIOProcessorRuntimeTask
[ERROR] -> [Help 1]
[ERROR] 
[ERROR] To see the full stack trace of the errors, re-run Maven with the -e switch.
[ERROR] Re-run Maven using the -X switch to enable full debug logging.
[ERROR] 
[ERROR] For more information about the errors and possible solutions, please read the following
articles:
[ERROR] [Help 1] http://cwiki.apache.org/confluence/display/MAVEN/MojoFailureException
[ERROR] 
[ERROR] After correcting the problems, you can resume the build with the command
[ERROR]   mvn <goals> -rf :tez-runtime-internals
Build step 'Execute shell' marked build as failure
Archiving artifacts
Compressed 50.69 MB of artifacts by 100.0% relative to #113

Mime
View raw message