tez-dev mailing list archives

Site index · List index
Message view « Date » · « Thread »
Top « Date » · « Thread »
From Apache Jenkins Server <jenk...@builds.apache.org>
Subject Build failed in Jenkins: Tez-Build-Hadoop-2.2 #237
Date Thu, 21 Jan 2016 00:42:01 GMT
See <https://builds.apache.org/job/Tez-Build-Hadoop-2.2/237/changes>

Changes:

[sseth] TEZ-3053. Containers timeout if they do not receive a task within the

[hitesh] TEZ-2594. Fix LICENSE for missing entries for full and minimal tarballs.

------------------------------------------
[...truncated 1185 lines...]
Running "concat:dist/scripts/components.js" (concat) task
File "dist/scripts/components.js" created.

Running "concat:dist/scripts/templates.js" (concat) task
File "dist/scripts/templates.js" created.

Running "concat:dist/scripts/main.js" (concat) task
File "dist/scripts/main.js" created.

Running "cssmin:dist" (cssmin) task
File dist/styles/main.css created.

Running "cssmin:dist/styles/main.css" (cssmin) task
File dist/styles/main.css created.

Running "copy:dist" (copy) task
Copied 27 files

Running "usemin:html" (usemin) task

Processing as HTML - dist/index.html
Update the HTML to reference our concat/min/revved script files
Update the HTML with the new css filenames
Update the HTML with the new img filenames
Update the HTML with data-main tags
Update the HTML with the data tags
Update the HTML with background imgs, case there is some inline style
Update the HTML with anchors images
Update the HTML with reference in input

Running "usemin:css" (usemin) task

Processing as CSS - dist/styles/main.css
Update the CSS with new img filenames

Done, without errors.
[INFO] 
[INFO] --- maven-resources-plugin:2.6:resources (default-resources) @ tez-ui ---
[INFO] Using 'UTF-8' encoding to copy filtered resources.
[INFO] Copying 2 resources
[INFO] 
[INFO] --- maven-compiler-plugin:3.1:compile (default-compile) @ tez-ui ---
[INFO] No sources to compile
[INFO] 
[INFO] --- maven-resources-plugin:2.6:testResources (default-testResources) @ tez-ui ---
[INFO] Using 'UTF-8' encoding to copy filtered resources.
[INFO] skip non existing resourceDirectory <https://builds.apache.org/job/Tez-Build-Hadoop-2.2/ws/tez-ui/src/test/resources>
[INFO] 
[INFO] --- maven-compiler-plugin:3.1:testCompile (default-testCompile) @ tez-ui ---
[INFO] No sources to compile
[INFO] 
[INFO] --- maven-surefire-plugin:2.14.1:test (default-test) @ tez-ui ---
[INFO] No tests to run.
[INFO]                                                                         
[INFO] ------------------------------------------------------------------------
[INFO] Building tez-plugins 0.8.3-SNAPSHOT
[INFO] ------------------------------------------------------------------------
[INFO] 
[INFO] --- maven-clean-plugin:2.5:clean (default-clean) @ tez-plugins ---
[INFO] 
[INFO] --- buildnumber-maven-plugin:1.1:create (default) @ tez-plugins ---
[INFO] Checking for local modifications: skipped.
[INFO] Updating project files from SCM: skipped.
[INFO] Executing: /bin/sh -c cd <https://builds.apache.org/job/Tez-Build-Hadoop-2.2/ws/tez-plugins>
&& git rev-parse --verify HEAD
[INFO] Working directory: <https://builds.apache.org/job/Tez-Build-Hadoop-2.2/ws/tez-plugins>
[INFO] Storing buildNumber: 73e993cba52e25c0d126a59439a76b43af9506bc at timestamp: 1453336925661
[INFO] Executing: /bin/sh -c cd <https://builds.apache.org/job/Tez-Build-Hadoop-2.2/ws/tez-plugins>
&& git rev-parse --verify HEAD
[INFO] Working directory: <https://builds.apache.org/job/Tez-Build-Hadoop-2.2/ws/tez-plugins>
[INFO] Storing buildScmBranch: UNKNOWN
[INFO] 
[INFO] --- build-helper-maven-plugin:1.8:maven-version (maven-version) @ tez-plugins ---
[INFO]                                                                         
[INFO] ------------------------------------------------------------------------
[INFO] Building tez-tools 0.8.3-SNAPSHOT
[INFO] ------------------------------------------------------------------------
[INFO] 
[INFO] --- maven-clean-plugin:2.5:clean (default-clean) @ tez-tools ---
[INFO] 
[INFO] --- buildnumber-maven-plugin:1.1:create (default) @ tez-tools ---
[INFO] Checking for local modifications: skipped.
[INFO] Updating project files from SCM: skipped.
[INFO] Executing: /bin/sh -c cd <https://builds.apache.org/job/Tez-Build-Hadoop-2.2/ws/tez-tools>
&& git rev-parse --verify HEAD
[INFO] Working directory: <https://builds.apache.org/job/Tez-Build-Hadoop-2.2/ws/tez-tools>
[INFO] Storing buildNumber: 73e993cba52e25c0d126a59439a76b43af9506bc at timestamp: 1453336925676
[INFO] Executing: /bin/sh -c cd <https://builds.apache.org/job/Tez-Build-Hadoop-2.2/ws/tez-tools>
&& git rev-parse --verify HEAD
[INFO] Working directory: <https://builds.apache.org/job/Tez-Build-Hadoop-2.2/ws/tez-tools>
[INFO] Storing buildScmBranch: UNKNOWN
[INFO] 
[INFO] --- build-helper-maven-plugin:1.8:maven-version (maven-version) @ tez-tools ---
[INFO]                                                                         
[INFO] ------------------------------------------------------------------------
[INFO] Building tez-perf-analyzer 0.8.3-SNAPSHOT
[INFO] ------------------------------------------------------------------------
[INFO] 
[INFO] --- maven-clean-plugin:2.5:clean (default-clean) @ tez-perf-analyzer ---
[INFO] 
[INFO] --- buildnumber-maven-plugin:1.1:create (default) @ tez-perf-analyzer ---
[INFO] Checking for local modifications: skipped.
[INFO] Updating project files from SCM: skipped.
[INFO] Executing: /bin/sh -c cd <https://builds.apache.org/job/Tez-Build-Hadoop-2.2/ws/tez-tools/analyzers>
&& git rev-parse --verify HEAD
[INFO] Working directory: <https://builds.apache.org/job/Tez-Build-Hadoop-2.2/ws/tez-tools/analyzers>
[INFO] Storing buildNumber: 73e993cba52e25c0d126a59439a76b43af9506bc at timestamp: 1453336925690
[INFO] Executing: /bin/sh -c cd <https://builds.apache.org/job/Tez-Build-Hadoop-2.2/ws/tez-tools/analyzers>
&& git rev-parse --verify HEAD
[INFO] Working directory: <https://builds.apache.org/job/Tez-Build-Hadoop-2.2/ws/tez-tools/analyzers>
[INFO] Storing buildScmBranch: UNKNOWN
[INFO] 
[INFO] --- build-helper-maven-plugin:1.8:maven-version (maven-version) @ tez-perf-analyzer
---
[INFO]                                                                         
[INFO] ------------------------------------------------------------------------
[INFO] Building tez-javadoc-tools 0.8.3-SNAPSHOT
[INFO] ------------------------------------------------------------------------
[INFO] 
[INFO] --- maven-clean-plugin:2.5:clean (default-clean) @ tez-javadoc-tools ---
[INFO] Deleting <https://builds.apache.org/job/Tez-Build-Hadoop-2.2/ws/tez-tools/tez-javadoc-tools/target>
[INFO] 
[INFO] --- buildnumber-maven-plugin:1.1:create (default) @ tez-javadoc-tools ---
[INFO] Checking for local modifications: skipped.
[INFO] Updating project files from SCM: skipped.
[INFO] Executing: /bin/sh -c cd <https://builds.apache.org/job/Tez-Build-Hadoop-2.2/ws/tez-tools/tez-javadoc-tools>
&& git rev-parse --verify HEAD
[INFO] Working directory: <https://builds.apache.org/job/Tez-Build-Hadoop-2.2/ws/tez-tools/tez-javadoc-tools>
[INFO] Storing buildNumber: 73e993cba52e25c0d126a59439a76b43af9506bc at timestamp: 1453336925826
[INFO] Executing: /bin/sh -c cd <https://builds.apache.org/job/Tez-Build-Hadoop-2.2/ws/tez-tools/tez-javadoc-tools>
&& git rev-parse --verify HEAD
[INFO] Working directory: <https://builds.apache.org/job/Tez-Build-Hadoop-2.2/ws/tez-tools/tez-javadoc-tools>
[INFO] Storing buildScmBranch: UNKNOWN
[INFO] 
[INFO] --- build-helper-maven-plugin:1.8:maven-version (maven-version) @ tez-javadoc-tools
---
[INFO] 
[INFO] --- maven-resources-plugin:2.6:resources (default-resources) @ tez-javadoc-tools ---
[INFO] Using 'UTF-8' encoding to copy filtered resources.
[INFO] skip non existing resourceDirectory <https://builds.apache.org/job/Tez-Build-Hadoop-2.2/ws/tez-tools/tez-javadoc-tools/src/main/resources>
[INFO] 
[INFO] --- maven-compiler-plugin:3.1:compile (default-compile) @ tez-javadoc-tools ---
[INFO] Changes detected - recompiling the module!
[INFO] Compiling 6 source files to <https://builds.apache.org/job/Tez-Build-Hadoop-2.2/ws/tez-tools/tez-javadoc-tools/target/classes>
[INFO] 
[INFO] --- maven-resources-plugin:2.6:testResources (default-testResources) @ tez-javadoc-tools
---
[INFO] Using 'UTF-8' encoding to copy filtered resources.
[INFO] skip non existing resourceDirectory <https://builds.apache.org/job/Tez-Build-Hadoop-2.2/ws/tez-tools/tez-javadoc-tools/src/test/resources>
[INFO] 
[INFO] --- maven-compiler-plugin:3.1:testCompile (default-testCompile) @ tez-javadoc-tools
---
[INFO] No sources to compile
[INFO] 
[INFO] --- maven-surefire-plugin:2.14.1:test (default-test) @ tez-javadoc-tools ---
[INFO] No tests to run.
[INFO]                                                                         
[INFO] ------------------------------------------------------------------------
[INFO] Building hadoop-shim-impls 0.8.3-SNAPSHOT
[INFO] ------------------------------------------------------------------------
[INFO] 
[INFO] --- maven-clean-plugin:2.5:clean (default-clean) @ hadoop-shim-impls ---
[INFO] 
[INFO] --- buildnumber-maven-plugin:1.1:create (default) @ hadoop-shim-impls ---
[INFO] Checking for local modifications: skipped.
[INFO] Updating project files from SCM: skipped.
[INFO] Executing: /bin/sh -c cd <https://builds.apache.org/job/Tez-Build-Hadoop-2.2/ws/hadoop-shim-impls>
&& git rev-parse --verify HEAD
[INFO] Working directory: <https://builds.apache.org/job/Tez-Build-Hadoop-2.2/ws/hadoop-shim-impls>
[INFO] Storing buildNumber: 73e993cba52e25c0d126a59439a76b43af9506bc at timestamp: 1453336926025
[INFO] Executing: /bin/sh -c cd <https://builds.apache.org/job/Tez-Build-Hadoop-2.2/ws/hadoop-shim-impls>
&& git rev-parse --verify HEAD
[INFO] Working directory: <https://builds.apache.org/job/Tez-Build-Hadoop-2.2/ws/hadoop-shim-impls>
[INFO] Storing buildScmBranch: UNKNOWN
[INFO] 
[INFO] --- build-helper-maven-plugin:1.8:maven-version (maven-version) @ hadoop-shim-impls
---
[INFO]                                                                         
[INFO] ------------------------------------------------------------------------
[INFO] Building tez-dist 0.8.3-SNAPSHOT
[INFO] ------------------------------------------------------------------------
[INFO] 
[INFO] --- maven-clean-plugin:2.5:clean (default-clean) @ tez-dist ---
[INFO] 
[INFO] --- buildnumber-maven-plugin:1.1:create (default) @ tez-dist ---
[INFO] Checking for local modifications: skipped.
[INFO] Updating project files from SCM: skipped.
[INFO] Executing: /bin/sh -c cd <https://builds.apache.org/job/Tez-Build-Hadoop-2.2/ws/tez-dist>
&& git rev-parse --verify HEAD
[INFO] Working directory: <https://builds.apache.org/job/Tez-Build-Hadoop-2.2/ws/tez-dist>
[INFO] Storing buildNumber: 73e993cba52e25c0d126a59439a76b43af9506bc at timestamp: 1453336926041
[INFO] Executing: /bin/sh -c cd <https://builds.apache.org/job/Tez-Build-Hadoop-2.2/ws/tez-dist>
&& git rev-parse --verify HEAD
[INFO] Working directory: <https://builds.apache.org/job/Tez-Build-Hadoop-2.2/ws/tez-dist>
[INFO] Storing buildScmBranch: UNKNOWN
[INFO] 
[INFO] --- build-helper-maven-plugin:1.8:maven-version (maven-version) @ tez-dist ---
[INFO]                                                                         
[INFO] ------------------------------------------------------------------------
[INFO] Building Tez 0.8.3-SNAPSHOT
[INFO] ------------------------------------------------------------------------
[INFO] 
[INFO] --- maven-clean-plugin:2.5:clean (default-clean) @ tez-docs ---
[INFO] 
[INFO] --- buildnumber-maven-plugin:1.1:create (default) @ tez-docs ---
[INFO] Checking for local modifications: skipped.
[INFO] Updating project files from SCM: skipped.
[INFO] Executing: /bin/sh -c cd <https://builds.apache.org/job/Tez-Build-Hadoop-2.2/ws/docs>
&& git rev-parse --verify HEAD
[INFO] Working directory: <https://builds.apache.org/job/Tez-Build-Hadoop-2.2/ws/docs>
[INFO] Storing buildNumber: 73e993cba52e25c0d126a59439a76b43af9506bc at timestamp: 1453336926056
[INFO] Executing: /bin/sh -c cd <https://builds.apache.org/job/Tez-Build-Hadoop-2.2/ws/docs>
&& git rev-parse --verify HEAD
[INFO] Working directory: <https://builds.apache.org/job/Tez-Build-Hadoop-2.2/ws/docs>
[INFO] Storing buildScmBranch: UNKNOWN
[INFO] 
[INFO] --- build-helper-maven-plugin:1.8:maven-version (maven-version) @ tez-docs ---
[INFO] ------------------------------------------------------------------------
[INFO] Reactor Summary:
[INFO] 
[INFO] tez ............................................... SUCCESS [  1.617 s]
[INFO] hadoop-shim ....................................... SUCCESS [  2.484 s]
[INFO] tez-api ........................................... SUCCESS [ 40.672 s]
[INFO] tez-common ........................................ SUCCESS [  4.177 s]
[INFO] tez-runtime-internals ............................. SUCCESS [ 12.935 s]
[INFO] tez-runtime-library ............................... SUCCESS [02:41 min]
[INFO] tez-mapreduce ..................................... SUCCESS [ 29.161 s]
[INFO] tez-examples ...................................... SUCCESS [  0.514 s]
[INFO] tez-dag ........................................... SUCCESS [02:17 min]
[INFO] tez-tests ......................................... SUCCESS [36:04 min]
[INFO] tez-ext-service-tests ............................. FAILURE [  1.186 s]
[INFO] tez-ui ............................................ SUCCESS [ 20.758 s]
[INFO] tez-plugins ....................................... SUCCESS [  0.014 s]
[INFO] tez-tools ......................................... SUCCESS [  0.014 s]
[INFO] tez-perf-analyzer ................................. SUCCESS [  0.014 s]
[INFO] tez-javadoc-tools ................................. SUCCESS [  0.322 s]
[INFO] hadoop-shim-impls ................................. SUCCESS [  0.014 s]
[INFO] tez-dist .......................................... SUCCESS [  0.016 s]
[INFO] Tez ............................................... SUCCESS [  0.013 s]
[INFO] ------------------------------------------------------------------------
[INFO] BUILD FAILURE
[INFO] ------------------------------------------------------------------------
[INFO] Total time: 42:57 min
[INFO] Finished at: 2016-01-21T00:42:06+00:00
[INFO] Final Memory: 36M/657M
[INFO] ------------------------------------------------------------------------
[ERROR] Failed to execute goal org.apache.maven.plugins:maven-compiler-plugin:3.1:testCompile
(default-testCompile) on project tez-ext-service-tests: Compilation failure: Compilation failure:
[ERROR] <https://builds.apache.org/job/Tez-Build-Hadoop-2.2/ws/tez-ext-service-tests/src/test/java/org/apache/tez/tests/TestExternalTezServicesErrors.java>:[26,42]
cannot find symbol
[ERROR] symbol:   class ApplicationAttemptReport
[ERROR] location: package org.apache.hadoop.yarn.api.records
[ERROR] <https://builds.apache.org/job/Tez-Build-Hadoop-2.2/ws/tez-ext-service-tests/src/test/java/org/apache/tez/tests/TestExternalTezServicesErrors.java>:[220,9]
cannot find symbol
[ERROR] symbol:   class ApplicationAttemptReport
[ERROR] location: class org.apache.tez.tests.TestExternalTezServicesErrors
[ERROR] <https://builds.apache.org/job/Tez-Build-Hadoop-2.2/ws/tez-ext-service-tests/src/test/java/org/apache/tez/tests/TestExternalTezServicesErrors.java>:[221,23]
cannot find symbol
[ERROR] symbol:   method getApplicationAttemptReport(org.apache.hadoop.yarn.api.records.ApplicationAttemptId)
[ERROR] location: variable yarnClient of type org.apache.hadoop.yarn.client.api.YarnClient
[ERROR] -> [Help 1]
[ERROR] 
[ERROR] To see the full stack trace of the errors, re-run Maven with the -e switch.
[ERROR] Re-run Maven using the -X switch to enable full debug logging.
[ERROR] 
[ERROR] For more information about the errors and possible solutions, please read the following
articles:
[ERROR] [Help 1] http://cwiki.apache.org/confluence/display/MAVEN/MojoFailureException
[ERROR] 
[ERROR] After correcting the problems, you can resume the build with the command
[ERROR]   mvn <goals> -rf :tez-ext-service-tests
Build step 'Execute shell' marked build as failure
Recording test results

Mime
View raw message