tez-dev mailing list archives

Site index · List index
Message view « Date » · « Thread »
Top « Date » · « Thread »
From Apache Jenkins Server <jenk...@builds.apache.org>
Subject Build failed in Jenkins: Tez-Build-branch-TEZ-2980 #14
Date Wed, 20 Jan 2016 17:20:47 GMT
See <https://builds.apache.org/job/Tez-Build-branch-TEZ-2980/14/changes>

Changes:

[sree] Revert "Update version in branch to 0.8.2-TEZ-2980-SNAPSHOT to prevent"

------------------------------------------
[...truncated 2040 lines...]
[INFO] Updating project files from SCM: skipped.
[INFO] Executing: /bin/sh -c cd <https://builds.apache.org/job/Tez-Build-branch-TEZ-2980/ws/tez-tools/tez-javadoc-tools>
&& git rev-parse --verify HEAD
[INFO] Working directory: <https://builds.apache.org/job/Tez-Build-branch-TEZ-2980/ws/tez-tools/tez-javadoc-tools>
[INFO] Storing buildNumber: d36f9066b75c451b5d37800eab02641ae0ceded5 at timestamp: 1453310459082
[INFO] Executing: /bin/sh -c cd <https://builds.apache.org/job/Tez-Build-branch-TEZ-2980/ws/tez-tools/tez-javadoc-tools>
&& git rev-parse --verify HEAD
[INFO] Working directory: <https://builds.apache.org/job/Tez-Build-branch-TEZ-2980/ws/tez-tools/tez-javadoc-tools>
[INFO] Storing buildScmBranch: UNKNOWN
[INFO] 
[INFO] --- build-helper-maven-plugin:1.8:maven-version (maven-version) @ tez-javadoc-tools
---
[INFO] 
[INFO] --- maven-resources-plugin:2.6:resources (default-resources) @ tez-javadoc-tools ---
[INFO] Using 'UTF-8' encoding to copy filtered resources.
[INFO] skip non existing resourceDirectory <https://builds.apache.org/job/Tez-Build-branch-TEZ-2980/ws/tez-tools/tez-javadoc-tools/src/main/resources>
[INFO] 
[INFO] --- maven-compiler-plugin:3.1:compile (default-compile) @ tez-javadoc-tools ---
[INFO] Nothing to compile - all classes are up to date
[INFO] 
[INFO] --- maven-resources-plugin:2.6:testResources (default-testResources) @ tez-javadoc-tools
---
[INFO] Using 'UTF-8' encoding to copy filtered resources.
[INFO] skip non existing resourceDirectory <https://builds.apache.org/job/Tez-Build-branch-TEZ-2980/ws/tez-tools/tez-javadoc-tools/src/test/resources>
[INFO] 
[INFO] --- maven-compiler-plugin:3.1:testCompile (default-testCompile) @ tez-javadoc-tools
---
[INFO] No sources to compile
[INFO] 
[INFO] --- maven-surefire-plugin:2.14.1:test (default-test) @ tez-javadoc-tools ---
[INFO] No tests to run.
[INFO] Skipping execution of surefire because it has already been run for this configuration
[INFO] 
[INFO] --- maven-jar-plugin:2.4:jar (default-jar) @ tez-javadoc-tools ---
[INFO] Building jar: <https://builds.apache.org/job/Tez-Build-branch-TEZ-2980/ws/tez-tools/tez-javadoc-tools/target/tez-javadoc-tools-0.8.2-SNAPSHOT.jar>
[INFO] 
[INFO] --- maven-jar-plugin:2.4:test-jar (default) @ tez-javadoc-tools ---
[WARNING] JAR will be empty - no content was marked for inclusion!
[INFO] Building jar: <https://builds.apache.org/job/Tez-Build-branch-TEZ-2980/ws/tez-tools/tez-javadoc-tools/target/tez-javadoc-tools-0.8.2-SNAPSHOT-tests.jar>
[INFO]                                                                         
[INFO] ------------------------------------------------------------------------
[INFO] Building hadoop-shim-impls 0.8.2-SNAPSHOT
[INFO] ------------------------------------------------------------------------
[INFO] 
[INFO] --- maven-clean-plugin:2.5:clean (default-clean) @ hadoop-shim-impls ---
[INFO] Deleting <https://builds.apache.org/job/Tez-Build-branch-TEZ-2980/ws/hadoop-shim-impls/target>
[INFO] 
[INFO] --- buildnumber-maven-plugin:1.1:create (default) @ hadoop-shim-impls ---
[INFO] Checking for local modifications: skipped.
[INFO] Updating project files from SCM: skipped.
[INFO] Executing: /bin/sh -c cd <https://builds.apache.org/job/Tez-Build-branch-TEZ-2980/ws/hadoop-shim-impls>
&& git rev-parse --verify HEAD
[INFO] Working directory: <https://builds.apache.org/job/Tez-Build-branch-TEZ-2980/ws/hadoop-shim-impls>
[INFO] Storing buildNumber: d36f9066b75c451b5d37800eab02641ae0ceded5 at timestamp: 1453310459145
[INFO] Executing: /bin/sh -c cd <https://builds.apache.org/job/Tez-Build-branch-TEZ-2980/ws/hadoop-shim-impls>
&& git rev-parse --verify HEAD
[INFO] Working directory: <https://builds.apache.org/job/Tez-Build-branch-TEZ-2980/ws/hadoop-shim-impls>
[INFO] Storing buildScmBranch: UNKNOWN
[INFO] 
[INFO] --- build-helper-maven-plugin:1.8:maven-version (maven-version) @ hadoop-shim-impls
---
[INFO] 
[INFO] --- buildnumber-maven-plugin:1.1:create (default) @ hadoop-shim-impls ---
[INFO] Checking for local modifications: skipped.
[INFO] Updating project files from SCM: skipped.
[INFO] Executing: /bin/sh -c cd <https://builds.apache.org/job/Tez-Build-branch-TEZ-2980/ws/hadoop-shim-impls>
&& git rev-parse --verify HEAD
[INFO] Working directory: <https://builds.apache.org/job/Tez-Build-branch-TEZ-2980/ws/hadoop-shim-impls>
[INFO] Storing buildNumber: d36f9066b75c451b5d37800eab02641ae0ceded5 at timestamp: 1453310459159
[INFO] Executing: /bin/sh -c cd <https://builds.apache.org/job/Tez-Build-branch-TEZ-2980/ws/hadoop-shim-impls>
&& git rev-parse --verify HEAD
[INFO] Working directory: <https://builds.apache.org/job/Tez-Build-branch-TEZ-2980/ws/hadoop-shim-impls>
[INFO] Storing buildScmBranch: UNKNOWN
[INFO] 
[INFO] --- build-helper-maven-plugin:1.8:maven-version (maven-version) @ hadoop-shim-impls
---
[INFO] 
[INFO] --- maven-jar-plugin:2.4:test-jar (default) @ hadoop-shim-impls ---
[WARNING] JAR will be empty - no content was marked for inclusion!
[INFO] Building jar: <https://builds.apache.org/job/Tez-Build-branch-TEZ-2980/ws/hadoop-shim-impls/target/hadoop-shim-impls-0.8.2-SNAPSHOT-tests.jar>
[INFO]                                                                         
[INFO] ------------------------------------------------------------------------
[INFO] Building hadoop-shim-2.6 0.8.2-SNAPSHOT
[INFO] ------------------------------------------------------------------------
[INFO] 
[INFO] --- maven-clean-plugin:2.5:clean (default-clean) @ hadoop-shim-2.6 ---
[INFO] Deleting <https://builds.apache.org/job/Tez-Build-branch-TEZ-2980/ws/hadoop-shim-impls/hadoop-shim-2.6/target>
[INFO] 
[INFO] --- buildnumber-maven-plugin:1.1:create (default) @ hadoop-shim-2.6 ---
[INFO] Checking for local modifications: skipped.
[INFO] Updating project files from SCM: skipped.
[INFO] Executing: /bin/sh -c cd <https://builds.apache.org/job/Tez-Build-branch-TEZ-2980/ws/hadoop-shim-impls/hadoop-shim-2.6>
&& git rev-parse --verify HEAD
[INFO] Working directory: <https://builds.apache.org/job/Tez-Build-branch-TEZ-2980/ws/hadoop-shim-impls/hadoop-shim-2.6>
[INFO] Storing buildNumber: d36f9066b75c451b5d37800eab02641ae0ceded5 at timestamp: 1453310459236
[INFO] Executing: /bin/sh -c cd <https://builds.apache.org/job/Tez-Build-branch-TEZ-2980/ws/hadoop-shim-impls/hadoop-shim-2.6>
&& git rev-parse --verify HEAD
[INFO] Working directory: <https://builds.apache.org/job/Tez-Build-branch-TEZ-2980/ws/hadoop-shim-impls/hadoop-shim-2.6>
[INFO] Storing buildScmBranch: UNKNOWN
[INFO] 
[INFO] --- build-helper-maven-plugin:1.8:maven-version (maven-version) @ hadoop-shim-2.6 ---
[INFO] 
[INFO] --- maven-resources-plugin:2.6:resources (default-resources) @ hadoop-shim-2.6 ---
[INFO] Using 'UTF-8' encoding to copy filtered resources.
[INFO] Copying 1 resource
[INFO] 
[INFO] --- maven-compiler-plugin:3.1:compile (default-compile) @ hadoop-shim-2.6 ---
[INFO] Changes detected - recompiling the module!
[INFO] Compiling 2 source files to <https://builds.apache.org/job/Tez-Build-branch-TEZ-2980/ws/hadoop-shim-impls/hadoop-shim-2.6/target/classes>
[INFO] 
[INFO] --- maven-resources-plugin:2.6:testResources (default-testResources) @ hadoop-shim-2.6
---
[INFO] Using 'UTF-8' encoding to copy filtered resources.
[INFO] skip non existing resourceDirectory <https://builds.apache.org/job/Tez-Build-branch-TEZ-2980/ws/hadoop-shim-impls/hadoop-shim-2.6/src/test/resources>
[INFO] 
[INFO] --- maven-compiler-plugin:3.1:testCompile (default-testCompile) @ hadoop-shim-2.6 ---
[INFO] Changes detected - recompiling the module!
[INFO] Compiling 1 source file to <https://builds.apache.org/job/Tez-Build-branch-TEZ-2980/ws/hadoop-shim-impls/hadoop-shim-2.6/target/test-classes>
[INFO] 
[INFO] --- maven-surefire-plugin:2.14.1:test (default-test) @ hadoop-shim-2.6 ---
[INFO] Surefire report directory: <https://builds.apache.org/job/Tez-Build-branch-TEZ-2980/ws/hadoop-shim-impls/hadoop-shim-2.6/target/surefire-reports>

-------------------------------------------------------
 T E S T S
-------------------------------------------------------

-------------------------------------------------------
 T E S T S
-------------------------------------------------------
Running org.apache.tez.hadoop.shim.TestHadoop25_26_27ShimProvider
Tests run: 4, Failures: 0, Errors: 0, Skipped: 0, Time elapsed: 0.262 sec

Results :

Tests run: 4, Failures: 0, Errors: 0, Skipped: 0

[INFO] 
[INFO] --- buildnumber-maven-plugin:1.1:create (default) @ hadoop-shim-2.6 ---
[INFO] Checking for local modifications: skipped.
[INFO] Updating project files from SCM: skipped.
[INFO] Executing: /bin/sh -c cd <https://builds.apache.org/job/Tez-Build-branch-TEZ-2980/ws/hadoop-shim-impls/hadoop-shim-2.6>
&& git rev-parse --verify HEAD
[INFO] Working directory: <https://builds.apache.org/job/Tez-Build-branch-TEZ-2980/ws/hadoop-shim-impls/hadoop-shim-2.6>
[INFO] Storing buildNumber: d36f9066b75c451b5d37800eab02641ae0ceded5 at timestamp: 1453310459969
[INFO] Executing: /bin/sh -c cd <https://builds.apache.org/job/Tez-Build-branch-TEZ-2980/ws/hadoop-shim-impls/hadoop-shim-2.6>
&& git rev-parse --verify HEAD
[INFO] Working directory: <https://builds.apache.org/job/Tez-Build-branch-TEZ-2980/ws/hadoop-shim-impls/hadoop-shim-2.6>
[INFO] Storing buildScmBranch: UNKNOWN
[INFO] 
[INFO] --- build-helper-maven-plugin:1.8:maven-version (maven-version) @ hadoop-shim-2.6 ---
[INFO] 
[INFO] --- maven-resources-plugin:2.6:resources (default-resources) @ hadoop-shim-2.6 ---
[INFO] Using 'UTF-8' encoding to copy filtered resources.
[INFO] Copying 1 resource
[INFO] 
[INFO] --- maven-compiler-plugin:3.1:compile (default-compile) @ hadoop-shim-2.6 ---
[INFO] Nothing to compile - all classes are up to date
[INFO] 
[INFO] --- maven-resources-plugin:2.6:testResources (default-testResources) @ hadoop-shim-2.6
---
[INFO] Using 'UTF-8' encoding to copy filtered resources.
[INFO] skip non existing resourceDirectory <https://builds.apache.org/job/Tez-Build-branch-TEZ-2980/ws/hadoop-shim-impls/hadoop-shim-2.6/src/test/resources>
[INFO] 
[INFO] --- maven-compiler-plugin:3.1:testCompile (default-testCompile) @ hadoop-shim-2.6 ---
[INFO] Nothing to compile - all classes are up to date
[INFO] 
[INFO] --- maven-surefire-plugin:2.14.1:test (default-test) @ hadoop-shim-2.6 ---
[INFO] Skipping execution of surefire because it has already been run for this configuration
[INFO] 
[INFO] --- maven-jar-plugin:2.4:jar (default-jar) @ hadoop-shim-2.6 ---
[INFO] Building jar: <https://builds.apache.org/job/Tez-Build-branch-TEZ-2980/ws/hadoop-shim-impls/hadoop-shim-2.6/target/hadoop-shim-2.6-0.8.2-SNAPSHOT.jar>
[INFO] 
[INFO] --- maven-jar-plugin:2.4:test-jar (default) @ hadoop-shim-2.6 ---
[INFO] Building jar: <https://builds.apache.org/job/Tez-Build-branch-TEZ-2980/ws/hadoop-shim-impls/hadoop-shim-2.6/target/hadoop-shim-2.6-0.8.2-SNAPSHOT-tests.jar>
[INFO]                                                                         
[INFO] ------------------------------------------------------------------------
[INFO] Skipping tez-dist
[INFO] This project has been banned from the build due to previous failures.
[INFO] ------------------------------------------------------------------------
[INFO]                                                                         
[INFO] ------------------------------------------------------------------------
[INFO] Building Tez 0.8.2-SNAPSHOT
[INFO] ------------------------------------------------------------------------
[INFO] 
[INFO] --- maven-clean-plugin:2.5:clean (default-clean) @ tez-docs ---
[INFO] Deleting <https://builds.apache.org/job/Tez-Build-branch-TEZ-2980/ws/docs/target>
[INFO] 
[INFO] --- buildnumber-maven-plugin:1.1:create (default) @ tez-docs ---
[INFO] Checking for local modifications: skipped.
[INFO] Updating project files from SCM: skipped.
[INFO] Executing: /bin/sh -c cd <https://builds.apache.org/job/Tez-Build-branch-TEZ-2980/ws/docs>
&& git rev-parse --verify HEAD
[INFO] Working directory: <https://builds.apache.org/job/Tez-Build-branch-TEZ-2980/ws/docs>
[INFO] Storing buildNumber: d36f9066b75c451b5d37800eab02641ae0ceded5 at timestamp: 1453310460030
[INFO] Executing: /bin/sh -c cd <https://builds.apache.org/job/Tez-Build-branch-TEZ-2980/ws/docs>
&& git rev-parse --verify HEAD
[INFO] Working directory: <https://builds.apache.org/job/Tez-Build-branch-TEZ-2980/ws/docs>
[INFO] Storing buildScmBranch: UNKNOWN
[INFO] 
[INFO] --- build-helper-maven-plugin:1.8:maven-version (maven-version) @ tez-docs ---
[INFO] 
[INFO] --- buildnumber-maven-plugin:1.1:create (default) @ tez-docs ---
[INFO] Checking for local modifications: skipped.
[INFO] Updating project files from SCM: skipped.
[INFO] Executing: /bin/sh -c cd <https://builds.apache.org/job/Tez-Build-branch-TEZ-2980/ws/docs>
&& git rev-parse --verify HEAD
[INFO] Working directory: <https://builds.apache.org/job/Tez-Build-branch-TEZ-2980/ws/docs>
[INFO] Storing buildNumber: d36f9066b75c451b5d37800eab02641ae0ceded5 at timestamp: 1453310460045
[INFO] Executing: /bin/sh -c cd <https://builds.apache.org/job/Tez-Build-branch-TEZ-2980/ws/docs>
&& git rev-parse --verify HEAD
[INFO] Working directory: <https://builds.apache.org/job/Tez-Build-branch-TEZ-2980/ws/docs>
[INFO] Storing buildScmBranch: UNKNOWN
[INFO] 
[INFO] --- build-helper-maven-plugin:1.8:maven-version (maven-version) @ tez-docs ---
[INFO] 
[INFO] --- maven-jar-plugin:2.4:test-jar (default) @ tez-docs ---
[WARNING] JAR will be empty - no content was marked for inclusion!
[INFO] Building jar: <https://builds.apache.org/job/Tez-Build-branch-TEZ-2980/ws/docs/target/tez-docs-0.8.2-SNAPSHOT-tests.jar>
[INFO] ------------------------------------------------------------------------
[INFO] Reactor Summary:
[INFO] 
[INFO] tez ............................................... SUCCESS [  1.544 s]
[INFO] hadoop-shim ....................................... SUCCESS [  2.517 s]
[INFO] tez-api ........................................... SUCCESS [ 48.753 s]
[INFO] tez-common ........................................ SUCCESS [  4.987 s]
[INFO] tez-runtime-internals ............................. SUCCESS [ 13.886 s]
[INFO] tez-runtime-library ............................... SUCCESS [02:51 min]
[INFO] tez-mapreduce ..................................... SUCCESS [ 34.302 s]
[INFO] tez-examples ...................................... SUCCESS [  0.274 s]
[INFO] tez-dag ........................................... SUCCESS [02:21 min]
[INFO] tez-tests ......................................... FAILURE [37:32 min]
[INFO] tez-ext-service-tests ............................. SKIPPED
[INFO] tez-ui ............................................ SUCCESS [ 30.801 s]
[INFO] tez-ui2 ........................................... FAILURE [ 22.440 s]
[INFO] tez-plugins ....................................... SUCCESS [  0.053 s]
[INFO] tez-yarn-timeline-history ......................... SKIPPED
[INFO] tez-yarn-timeline-history-with-acls ............... SKIPPED
[INFO] tez-history-parser ................................ SKIPPED
[INFO] tez-tools ......................................... SUCCESS [  0.081 s]
[INFO] tez-perf-analyzer ................................. SUCCESS [  0.038 s]
[INFO] tez-job-analyzer .................................. SKIPPED
[INFO] tez-javadoc-tools ................................. SUCCESS [  0.234 s]
[INFO] hadoop-shim-impls ................................. SUCCESS [  0.045 s]
[INFO] hadoop-shim-2.6 ................................... SUCCESS [  0.841 s]
[INFO] tez-dist .......................................... SKIPPED
[INFO] Tez ............................................... SUCCESS [  0.067 s]
[INFO] ------------------------------------------------------------------------
[INFO] BUILD FAILURE
[INFO] ------------------------------------------------------------------------
[INFO] Total time: 45:26 min
[INFO] Finished at: 2016-01-20T17:21:00+00:00
[INFO] Final Memory: 44M/951M
[INFO] ------------------------------------------------------------------------
[ERROR] Failed to execute goal org.apache.maven.plugins:maven-surefire-plugin:2.14.1:test
(default-test) on project tez-tests: There are test failures.
[ERROR] 
[ERROR] Please refer to <https://builds.apache.org/job/Tez-Build-branch-TEZ-2980/ws/tez-tests/target/surefire-reports>
for the individual test results.
[ERROR] -> [Help 1]
[ERROR] Failed to execute goal org.codehaus.mojo:exec-maven-plugin:1.3.2:exec (ember build)
on project tez-ui2: Command execution failed. Process exited with an error: 1 (Exit value:
1) -> [Help 2]
[ERROR] 
[ERROR] To see the full stack trace of the errors, re-run Maven with the -e switch.
[ERROR] Re-run Maven using the -X switch to enable full debug logging.
[ERROR] 
[ERROR] For more information about the errors and possible solutions, please read the following
articles:
[ERROR] [Help 1] http://cwiki.apache.org/confluence/display/MAVEN/MojoFailureException
[ERROR] [Help 2] http://cwiki.apache.org/confluence/display/MAVEN/MojoExecutionException
[ERROR] 
[ERROR] After correcting the problems, you can resume the build with the command
[ERROR]   mvn <goals> -rf :tez-tests
Build step 'Execute shell' marked build as failure
Archiving artifacts

Mime
View raw message