tez-dev mailing list archives

Site index · List index
Message view « Date » · « Thread »
Top « Date » · « Thread »
From Apache Jenkins Server <jenk...@builds.apache.org>
Subject Build failed in Jenkins: Tez-Build-branch-TEZ-2980 #12
Date Wed, 20 Jan 2016 00:40:57 GMT
See <https://builds.apache.org/job/Tez-Build-branch-TEZ-2980/12/changes>

Changes:

[sree] TEZ-3042. Tez UI 2: Create Counters pages (sree)

[sree] TEZ-3043. Tez UI 2: Create configurations page (sree)

[sree] TEZ-3049. Tez UI 2: Add column selector (sree)

------------------------------------------
[...truncated 3425 lines...]
[INFO] Building jar: <https://builds.apache.org/job/Tez-Build-branch-TEZ-2980/ws/tez-tools/tez-javadoc-tools/target/tez-javadoc-tools-0.8.2-TEZ-2980-SNAPSHOT.jar>
[INFO] 
[INFO] --- maven-jar-plugin:2.4:test-jar (default) @ tez-javadoc-tools ---
[WARNING] JAR will be empty - no content was marked for inclusion!
[INFO] Building jar: <https://builds.apache.org/job/Tez-Build-branch-TEZ-2980/ws/tez-tools/tez-javadoc-tools/target/tez-javadoc-tools-0.8.2-TEZ-2980-SNAPSHOT-tests.jar>
[INFO]                                                                         
[INFO] ------------------------------------------------------------------------
[INFO] Building hadoop-shim-impls 0.8.2-TEZ-2980-SNAPSHOT
[INFO] ------------------------------------------------------------------------
[INFO] 
[INFO] --- maven-clean-plugin:2.5:clean (default-clean) @ hadoop-shim-impls ---
[INFO] Deleting <https://builds.apache.org/job/Tez-Build-branch-TEZ-2980/ws/hadoop-shim-impls/target>
[INFO] 
[INFO] --- buildnumber-maven-plugin:1.1:create (default) @ hadoop-shim-impls ---
[INFO] Checking for local modifications: skipped.
[INFO] Updating project files from SCM: skipped.
[INFO] Executing: /bin/sh -c cd <https://builds.apache.org/job/Tez-Build-branch-TEZ-2980/ws/hadoop-shim-impls>
&& git rev-parse --verify HEAD
[INFO] Working directory: <https://builds.apache.org/job/Tez-Build-branch-TEZ-2980/ws/hadoop-shim-impls>
[INFO] Storing buildNumber: 5c726547d8e960454a9898793607a7bc40f715c6 at timestamp: 1453250467755
[INFO] Executing: /bin/sh -c cd <https://builds.apache.org/job/Tez-Build-branch-TEZ-2980/ws/hadoop-shim-impls>
&& git rev-parse --verify HEAD
[INFO] Working directory: <https://builds.apache.org/job/Tez-Build-branch-TEZ-2980/ws/hadoop-shim-impls>
[INFO] Storing buildScmBranch: UNKNOWN
[INFO] 
[INFO] --- build-helper-maven-plugin:1.8:maven-version (maven-version) @ hadoop-shim-impls
---
[INFO] 
[INFO] --- buildnumber-maven-plugin:1.1:create (default) @ hadoop-shim-impls ---
[INFO] Checking for local modifications: skipped.
[INFO] Updating project files from SCM: skipped.
[INFO] Executing: /bin/sh -c cd <https://builds.apache.org/job/Tez-Build-branch-TEZ-2980/ws/hadoop-shim-impls>
&& git rev-parse --verify HEAD
[INFO] Working directory: <https://builds.apache.org/job/Tez-Build-branch-TEZ-2980/ws/hadoop-shim-impls>
[INFO] Storing buildNumber: 5c726547d8e960454a9898793607a7bc40f715c6 at timestamp: 1453250467764
[INFO] Executing: /bin/sh -c cd <https://builds.apache.org/job/Tez-Build-branch-TEZ-2980/ws/hadoop-shim-impls>
&& git rev-parse --verify HEAD
[INFO] Working directory: <https://builds.apache.org/job/Tez-Build-branch-TEZ-2980/ws/hadoop-shim-impls>
[INFO] Storing buildScmBranch: UNKNOWN
[INFO] 
[INFO] --- build-helper-maven-plugin:1.8:maven-version (maven-version) @ hadoop-shim-impls
---
[INFO] 
[INFO] --- maven-jar-plugin:2.4:test-jar (default) @ hadoop-shim-impls ---
[WARNING] JAR will be empty - no content was marked for inclusion!
[INFO] Building jar: <https://builds.apache.org/job/Tez-Build-branch-TEZ-2980/ws/hadoop-shim-impls/target/hadoop-shim-impls-0.8.2-TEZ-2980-SNAPSHOT-tests.jar>
[INFO]                                                                         
[INFO] ------------------------------------------------------------------------
[INFO] Building hadoop-shim-2.6 0.8.2-TEZ-2980-SNAPSHOT
[INFO] ------------------------------------------------------------------------
[INFO] 
[INFO] --- maven-clean-plugin:2.5:clean (default-clean) @ hadoop-shim-2.6 ---
[INFO] Deleting <https://builds.apache.org/job/Tez-Build-branch-TEZ-2980/ws/hadoop-shim-impls/hadoop-shim-2.6/target>
[INFO] 
[INFO] --- buildnumber-maven-plugin:1.1:create (default) @ hadoop-shim-2.6 ---
[INFO] Checking for local modifications: skipped.
[INFO] Updating project files from SCM: skipped.
[INFO] Executing: /bin/sh -c cd <https://builds.apache.org/job/Tez-Build-branch-TEZ-2980/ws/hadoop-shim-impls/hadoop-shim-2.6>
&& git rev-parse --verify HEAD
[INFO] Working directory: <https://builds.apache.org/job/Tez-Build-branch-TEZ-2980/ws/hadoop-shim-impls/hadoop-shim-2.6>
[INFO] Storing buildNumber: 5c726547d8e960454a9898793607a7bc40f715c6 at timestamp: 1453250467859
[INFO] Executing: /bin/sh -c cd <https://builds.apache.org/job/Tez-Build-branch-TEZ-2980/ws/hadoop-shim-impls/hadoop-shim-2.6>
&& git rev-parse --verify HEAD
[INFO] Working directory: <https://builds.apache.org/job/Tez-Build-branch-TEZ-2980/ws/hadoop-shim-impls/hadoop-shim-2.6>
[INFO] Storing buildScmBranch: UNKNOWN
[INFO] 
[INFO] --- build-helper-maven-plugin:1.8:maven-version (maven-version) @ hadoop-shim-2.6 ---
[INFO] 
[INFO] --- maven-resources-plugin:2.6:resources (default-resources) @ hadoop-shim-2.6 ---
[INFO] Using 'UTF-8' encoding to copy filtered resources.
[INFO] Copying 1 resource
[INFO] 
[INFO] --- maven-compiler-plugin:3.1:compile (default-compile) @ hadoop-shim-2.6 ---
[INFO] Changes detected - recompiling the module!
[INFO] Compiling 2 source files to <https://builds.apache.org/job/Tez-Build-branch-TEZ-2980/ws/hadoop-shim-impls/hadoop-shim-2.6/target/classes>
[INFO] 
[INFO] --- maven-resources-plugin:2.6:testResources (default-testResources) @ hadoop-shim-2.6
---
[INFO] Using 'UTF-8' encoding to copy filtered resources.
[INFO] skip non existing resourceDirectory <https://builds.apache.org/job/Tez-Build-branch-TEZ-2980/ws/hadoop-shim-impls/hadoop-shim-2.6/src/test/resources>
[INFO] 
[INFO] --- maven-compiler-plugin:3.1:testCompile (default-testCompile) @ hadoop-shim-2.6 ---
[INFO] Changes detected - recompiling the module!
[INFO] Compiling 1 source file to <https://builds.apache.org/job/Tez-Build-branch-TEZ-2980/ws/hadoop-shim-impls/hadoop-shim-2.6/target/test-classes>
[INFO] 
[INFO] --- maven-surefire-plugin:2.14.1:test (default-test) @ hadoop-shim-2.6 ---
[INFO] Surefire report directory: <https://builds.apache.org/job/Tez-Build-branch-TEZ-2980/ws/hadoop-shim-impls/hadoop-shim-2.6/target/surefire-reports>

-------------------------------------------------------
 T E S T S
-------------------------------------------------------

-------------------------------------------------------
 T E S T S
-------------------------------------------------------
Running org.apache.tez.hadoop.shim.TestHadoop25_26_27ShimProvider
Tests run: 4, Failures: 0, Errors: 0, Skipped: 0, Time elapsed: 0.208 sec

Results :

Tests run: 4, Failures: 0, Errors: 0, Skipped: 0

[INFO] 
[INFO] --- buildnumber-maven-plugin:1.1:create (default) @ hadoop-shim-2.6 ---
[INFO] Checking for local modifications: skipped.
[INFO] Updating project files from SCM: skipped.
[INFO] Executing: /bin/sh -c cd <https://builds.apache.org/job/Tez-Build-branch-TEZ-2980/ws/hadoop-shim-impls/hadoop-shim-2.6>
&& git rev-parse --verify HEAD
[INFO] Working directory: <https://builds.apache.org/job/Tez-Build-branch-TEZ-2980/ws/hadoop-shim-impls/hadoop-shim-2.6>
[INFO] Storing buildNumber: 5c726547d8e960454a9898793607a7bc40f715c6 at timestamp: 1453250468437
[INFO] Executing: /bin/sh -c cd <https://builds.apache.org/job/Tez-Build-branch-TEZ-2980/ws/hadoop-shim-impls/hadoop-shim-2.6>
&& git rev-parse --verify HEAD
[INFO] Working directory: <https://builds.apache.org/job/Tez-Build-branch-TEZ-2980/ws/hadoop-shim-impls/hadoop-shim-2.6>
[INFO] Storing buildScmBranch: UNKNOWN
[INFO] 
[INFO] --- build-helper-maven-plugin:1.8:maven-version (maven-version) @ hadoop-shim-2.6 ---
[INFO] 
[INFO] --- maven-resources-plugin:2.6:resources (default-resources) @ hadoop-shim-2.6 ---
[INFO] Using 'UTF-8' encoding to copy filtered resources.
[INFO] Copying 1 resource
[INFO] 
[INFO] --- maven-compiler-plugin:3.1:compile (default-compile) @ hadoop-shim-2.6 ---
[INFO] Nothing to compile - all classes are up to date
[INFO] 
[INFO] --- maven-resources-plugin:2.6:testResources (default-testResources) @ hadoop-shim-2.6
---
[INFO] Using 'UTF-8' encoding to copy filtered resources.
[INFO] skip non existing resourceDirectory <https://builds.apache.org/job/Tez-Build-branch-TEZ-2980/ws/hadoop-shim-impls/hadoop-shim-2.6/src/test/resources>
[INFO] 
[INFO] --- maven-compiler-plugin:3.1:testCompile (default-testCompile) @ hadoop-shim-2.6 ---
[INFO] Nothing to compile - all classes are up to date
[INFO] 
[INFO] --- maven-surefire-plugin:2.14.1:test (default-test) @ hadoop-shim-2.6 ---
[INFO] Skipping execution of surefire because it has already been run for this configuration
[INFO] 
[INFO] --- maven-jar-plugin:2.4:jar (default-jar) @ hadoop-shim-2.6 ---
[INFO] Building jar: <https://builds.apache.org/job/Tez-Build-branch-TEZ-2980/ws/hadoop-shim-impls/hadoop-shim-2.6/target/hadoop-shim-2.6-0.8.2-TEZ-2980-SNAPSHOT.jar>
[INFO] 
[INFO] --- maven-jar-plugin:2.4:test-jar (default) @ hadoop-shim-2.6 ---
[INFO] Building jar: <https://builds.apache.org/job/Tez-Build-branch-TEZ-2980/ws/hadoop-shim-impls/hadoop-shim-2.6/target/hadoop-shim-2.6-0.8.2-TEZ-2980-SNAPSHOT-tests.jar>
[INFO]                                                                         
[INFO] ------------------------------------------------------------------------
[INFO] Building tez-dist 0.8.2-TEZ-2980-SNAPSHOT
[INFO] ------------------------------------------------------------------------
[INFO] 
[INFO] --- maven-clean-plugin:2.5:clean (default-clean) @ tez-dist ---
[INFO] Deleting <https://builds.apache.org/job/Tez-Build-branch-TEZ-2980/ws/tez-dist/target>
[INFO] 
[INFO] --- buildnumber-maven-plugin:1.1:create (default) @ tez-dist ---
[INFO] Checking for local modifications: skipped.
[INFO] Updating project files from SCM: skipped.
[INFO] Executing: /bin/sh -c cd <https://builds.apache.org/job/Tez-Build-branch-TEZ-2980/ws/tez-dist>
&& git rev-parse --verify HEAD
[INFO] Working directory: <https://builds.apache.org/job/Tez-Build-branch-TEZ-2980/ws/tez-dist>
[INFO] Storing buildNumber: 5c726547d8e960454a9898793607a7bc40f715c6 at timestamp: 1453250468522
[INFO] Executing: /bin/sh -c cd <https://builds.apache.org/job/Tez-Build-branch-TEZ-2980/ws/tez-dist>
&& git rev-parse --verify HEAD
[INFO] Working directory: <https://builds.apache.org/job/Tez-Build-branch-TEZ-2980/ws/tez-dist>
[INFO] Storing buildScmBranch: UNKNOWN
[INFO] 
[INFO] --- build-helper-maven-plugin:1.8:maven-version (maven-version) @ tez-dist ---
[INFO] 
[INFO] --- buildnumber-maven-plugin:1.1:create (default) @ tez-dist ---
[INFO] Checking for local modifications: skipped.
[INFO] Updating project files from SCM: skipped.
[INFO] Executing: /bin/sh -c cd <https://builds.apache.org/job/Tez-Build-branch-TEZ-2980/ws/tez-dist>
&& git rev-parse --verify HEAD
[INFO] Working directory: <https://builds.apache.org/job/Tez-Build-branch-TEZ-2980/ws/tez-dist>
[INFO] Storing buildNumber: 5c726547d8e960454a9898793607a7bc40f715c6 at timestamp: 1453250468534
[INFO] Executing: /bin/sh -c cd <https://builds.apache.org/job/Tez-Build-branch-TEZ-2980/ws/tez-dist>
&& git rev-parse --verify HEAD
[INFO] Working directory: <https://builds.apache.org/job/Tez-Build-branch-TEZ-2980/ws/tez-dist>
[INFO] Storing buildScmBranch: UNKNOWN
[INFO] 
[INFO] --- build-helper-maven-plugin:1.8:maven-version (maven-version) @ tez-dist ---
[INFO] 
[INFO] --- maven-assembly-plugin:2.4:single (package-tez) @ tez-dist ---
[INFO] Reading assembly descriptor: src/main/assembly/tez-dist.xml
[INFO]                                                                         
[INFO] ------------------------------------------------------------------------
[INFO] Building Tez 0.8.2-TEZ-2980-SNAPSHOT
[INFO] ------------------------------------------------------------------------
[INFO] 
[INFO] --- maven-clean-plugin:2.5:clean (default-clean) @ tez-docs ---
[INFO] Deleting <https://builds.apache.org/job/Tez-Build-branch-TEZ-2980/ws/docs/target>
[INFO] 
[INFO] --- buildnumber-maven-plugin:1.1:create (default) @ tez-docs ---
[INFO] Checking for local modifications: skipped.
[INFO] Updating project files from SCM: skipped.
[INFO] Executing: /bin/sh -c cd <https://builds.apache.org/job/Tez-Build-branch-TEZ-2980/ws/docs>
&& git rev-parse --verify HEAD
[INFO] Working directory: <https://builds.apache.org/job/Tez-Build-branch-TEZ-2980/ws/docs>
[INFO] Storing buildNumber: 5c726547d8e960454a9898793607a7bc40f715c6 at timestamp: 1453250468839
[INFO] Executing: /bin/sh -c cd <https://builds.apache.org/job/Tez-Build-branch-TEZ-2980/ws/docs>
&& git rev-parse --verify HEAD
[INFO] Working directory: <https://builds.apache.org/job/Tez-Build-branch-TEZ-2980/ws/docs>
[INFO] Storing buildScmBranch: UNKNOWN
[INFO] 
[INFO] --- build-helper-maven-plugin:1.8:maven-version (maven-version) @ tez-docs ---
[INFO] 
[INFO] --- buildnumber-maven-plugin:1.1:create (default) @ tez-docs ---
[INFO] Checking for local modifications: skipped.
[INFO] Updating project files from SCM: skipped.
[INFO] Executing: /bin/sh -c cd <https://builds.apache.org/job/Tez-Build-branch-TEZ-2980/ws/docs>
&& git rev-parse --verify HEAD
[INFO] Working directory: <https://builds.apache.org/job/Tez-Build-branch-TEZ-2980/ws/docs>
[INFO] Storing buildNumber: 5c726547d8e960454a9898793607a7bc40f715c6 at timestamp: 1453250468849
[INFO] Executing: /bin/sh -c cd <https://builds.apache.org/job/Tez-Build-branch-TEZ-2980/ws/docs>
&& git rev-parse --verify HEAD
[INFO] Working directory: <https://builds.apache.org/job/Tez-Build-branch-TEZ-2980/ws/docs>
[INFO] Storing buildScmBranch: UNKNOWN
[INFO] 
[INFO] --- build-helper-maven-plugin:1.8:maven-version (maven-version) @ tez-docs ---
[INFO] 
[INFO] --- maven-jar-plugin:2.4:test-jar (default) @ tez-docs ---
[WARNING] JAR will be empty - no content was marked for inclusion!
[INFO] Building jar: <https://builds.apache.org/job/Tez-Build-branch-TEZ-2980/ws/docs/target/tez-docs-0.8.2-TEZ-2980-SNAPSHOT-tests.jar>
[INFO] ------------------------------------------------------------------------
[INFO] Reactor Summary:
[INFO] 
[INFO] tez ............................................... SUCCESS [  1.746 s]
[INFO] hadoop-shim ....................................... SUCCESS [  2.431 s]
[INFO] tez-api ........................................... SUCCESS [ 47.579 s]
[INFO] tez-common ........................................ SUCCESS [  4.744 s]
[INFO] tez-runtime-internals ............................. SUCCESS [ 13.365 s]
[INFO] tez-runtime-library ............................... SUCCESS [02:45 min]
[INFO] tez-mapreduce ..................................... SUCCESS [ 32.903 s]
[INFO] tez-examples ...................................... SUCCESS [  0.286 s]
[INFO] tez-dag ........................................... SUCCESS [02:16 min]
[INFO] tez-tests ......................................... SUCCESS [37:24 min]
[INFO] tez-ext-service-tests ............................. SUCCESS [01:00 min]
[INFO] tez-ui ............................................ SUCCESS [ 27.156 s]
[INFO] tez-ui2 ........................................... SUCCESS [02:31 min]
[INFO] tez-plugins ....................................... SUCCESS [  0.048 s]
[INFO] tez-yarn-timeline-history ......................... SUCCESS [ 55.559 s]
[INFO] tez-yarn-timeline-history-with-acls ............... SUCCESS [02:00 min]
[INFO] tez-history-parser ................................ SUCCESS [02:06 min]
[INFO] tez-tools ......................................... SUCCESS [  0.215 s]
[INFO] tez-perf-analyzer ................................. SUCCESS [  0.057 s]
[INFO] tez-job-analyzer .................................. FAILURE [02:02 min]
[INFO] tez-javadoc-tools ................................. SUCCESS [  0.147 s]
[INFO] hadoop-shim-impls ................................. SUCCESS [  0.029 s]
[INFO] hadoop-shim-2.6 ................................... SUCCESS [  0.696 s]
[INFO] tez-dist .......................................... FAILURE [  0.347 s]
[INFO] Tez ............................................... SUCCESS [  0.042 s]
[INFO] ------------------------------------------------------------------------
[INFO] BUILD FAILURE
[INFO] ------------------------------------------------------------------------
[INFO] Total time: 55:15 min
[INFO] Finished at: 2016-01-20T00:41:08+00:00
[INFO] Final Memory: 64M/1054M
[INFO] ------------------------------------------------------------------------
[ERROR] Failed to execute goal org.apache.maven.plugins:maven-surefire-plugin:2.14.1:test
(default-test) on project tez-job-analyzer: There are test failures.
[ERROR] 
[ERROR] Please refer to <https://builds.apache.org/job/Tez-Build-branch-TEZ-2980/ws/tez-tools/analyzers/job-analyzer/target/surefire-reports>
for the individual test results.
[ERROR] -> [Help 1]
[ERROR] Failed to execute goal org.apache.maven.plugins:maven-assembly-plugin:2.4:single (package-tez)
on project tez-dist: Failed to create assembly: Error adding file 'org.apache.tez:tez-job-analyzer:jar:0.8.2-TEZ-2980-SNAPSHOT'
to archive: <https://builds.apache.org/job/Tez-Build-branch-TEZ-2980/ws/tez-tools/analyzers/job-analyzer/target/classes>
isn't a file. -> [Help 2]
[ERROR] 
[ERROR] To see the full stack trace of the errors, re-run Maven with the -e switch.
[ERROR] Re-run Maven using the -X switch to enable full debug logging.
[ERROR] 
[ERROR] For more information about the errors and possible solutions, please read the following
articles:
[ERROR] [Help 1] http://cwiki.apache.org/confluence/display/MAVEN/MojoFailureException
[ERROR] [Help 2] http://cwiki.apache.org/confluence/display/MAVEN/MojoExecutionException
[ERROR] 
[ERROR] After correcting the problems, you can resume the build with the command
[ERROR]   mvn <goals> -rf :tez-job-analyzer
Build step 'Execute shell' marked build as failure
Archiving artifacts

Mime
View raw message