tez-dev mailing list archives

Site index · List index
Message view « Date » · « Thread »
Top « Date » · « Thread »
From Apache Jenkins Server <jenk...@builds.apache.org>
Subject Build failed in Jenkins: Tez-Build #1419
Date Tue, 05 Apr 2016 10:03:38 GMT
See <https://builds.apache.org/job/Tez-Build/1419/changes>

Changes:

[sree] TEZ-3172. Tez UI: Swimlane - In progress & Shadow (sree)

------------------------------------------
[...truncated 6696 lines...]
[INFO] Storing buildNumber: 8e9e5ae7fe14c262ebcff5f2364fc5b5275c776a at timestamp: 1459850614912
[INFO] Executing: /bin/sh -c cd <https://builds.apache.org/job/Tez-Build/ws/hadoop-shim-impls>
&& git rev-parse --verify HEAD
[INFO] Working directory: <https://builds.apache.org/job/Tez-Build/ws/hadoop-shim-impls>
[INFO] Storing buildScmBranch: UNKNOWN
[INFO] 
[INFO] --- build-helper-maven-plugin:1.8:maven-version (maven-version) @ hadoop-shim-impls
---
[INFO] 
[INFO] --- maven-jar-plugin:2.4:test-jar (default) @ hadoop-shim-impls ---
[WARNING] JAR will be empty - no content was marked for inclusion!
[INFO]                                                                         
[INFO] ------------------------------------------------------------------------
[INFO] Building hadoop-shim-2.6 0.8.3-SNAPSHOT
[INFO] ------------------------------------------------------------------------
[INFO] 
[INFO] --- maven-clean-plugin:3.0.0:clean (default-clean) @ hadoop-shim-2.6 ---
[INFO] 
[INFO] --- buildnumber-maven-plugin:1.1:create (default) @ hadoop-shim-2.6 ---
[INFO] Checking for local modifications: skipped.
[INFO] Updating project files from SCM: skipped.
[INFO] Executing: /bin/sh -c cd <https://builds.apache.org/job/Tez-Build/ws/hadoop-shim-impls/hadoop-shim-2.6>
&& git rev-parse --verify HEAD
[INFO] Working directory: <https://builds.apache.org/job/Tez-Build/ws/hadoop-shim-impls/hadoop-shim-2.6>
[INFO] Storing buildNumber: 8e9e5ae7fe14c262ebcff5f2364fc5b5275c776a at timestamp: 1459850614965
[INFO] Executing: /bin/sh -c cd <https://builds.apache.org/job/Tez-Build/ws/hadoop-shim-impls/hadoop-shim-2.6>
&& git rev-parse --verify HEAD
[INFO] Working directory: <https://builds.apache.org/job/Tez-Build/ws/hadoop-shim-impls/hadoop-shim-2.6>
[INFO] Storing buildScmBranch: UNKNOWN
[INFO] 
[INFO] --- build-helper-maven-plugin:1.8:maven-version (maven-version) @ hadoop-shim-2.6 ---
[INFO] 
[INFO] --- maven-resources-plugin:2.6:resources (default-resources) @ hadoop-shim-2.6 ---
[INFO] Using 'UTF-8' encoding to copy filtered resources.
[INFO] Copying 1 resource
[INFO] 
[INFO] --- maven-compiler-plugin:3.1:compile (default-compile) @ hadoop-shim-2.6 ---
[INFO] Changes detected - recompiling the module!
[INFO] Compiling 2 source files to <https://builds.apache.org/job/Tez-Build/ws/hadoop-shim-impls/hadoop-shim-2.6/target/classes>
[INFO] 
[INFO] --- maven-resources-plugin:2.6:testResources (default-testResources) @ hadoop-shim-2.6
---
[INFO] Using 'UTF-8' encoding to copy filtered resources.
[INFO] skip non existing resourceDirectory <https://builds.apache.org/job/Tez-Build/ws/hadoop-shim-impls/hadoop-shim-2.6/src/test/resources>
[INFO] 
[INFO] --- maven-compiler-plugin:3.1:testCompile (default-testCompile) @ hadoop-shim-2.6 ---
[INFO] Changes detected - recompiling the module!
[INFO] Compiling 1 source file to <https://builds.apache.org/job/Tez-Build/ws/hadoop-shim-impls/hadoop-shim-2.6/target/test-classes>
[INFO] 
[INFO] --- maven-surefire-plugin:2.14.1:test (default-test) @ hadoop-shim-2.6 ---
[INFO] Surefire report directory: <https://builds.apache.org/job/Tez-Build/ws/hadoop-shim-impls/hadoop-shim-2.6/target/surefire-reports>

-------------------------------------------------------
 T E S T S
-------------------------------------------------------

-------------------------------------------------------
 T E S T S
-------------------------------------------------------
Running org.apache.tez.hadoop.shim.TestHadoop25_26_27ShimProvider
Tests run: 4, Failures: 0, Errors: 0, Skipped: 0, Time elapsed: 0.207 sec

Results :

Tests run: 4, Failures: 0, Errors: 0, Skipped: 0

[INFO] 
[INFO] --- buildnumber-maven-plugin:1.1:create (default) @ hadoop-shim-2.6 ---
[INFO] Checking for local modifications: skipped.
[INFO] Updating project files from SCM: skipped.
[INFO] Executing: /bin/sh -c cd <https://builds.apache.org/job/Tez-Build/ws/hadoop-shim-impls/hadoop-shim-2.6>
&& git rev-parse --verify HEAD
[INFO] Working directory: <https://builds.apache.org/job/Tez-Build/ws/hadoop-shim-impls/hadoop-shim-2.6>
[INFO] Storing buildNumber: 8e9e5ae7fe14c262ebcff5f2364fc5b5275c776a at timestamp: 1459850615502
[INFO] Executing: /bin/sh -c cd <https://builds.apache.org/job/Tez-Build/ws/hadoop-shim-impls/hadoop-shim-2.6>
&& git rev-parse --verify HEAD
[INFO] Working directory: <https://builds.apache.org/job/Tez-Build/ws/hadoop-shim-impls/hadoop-shim-2.6>
[INFO] Storing buildScmBranch: UNKNOWN
[INFO] 
[INFO] --- build-helper-maven-plugin:1.8:maven-version (maven-version) @ hadoop-shim-2.6 ---
[INFO] 
[INFO] --- maven-resources-plugin:2.6:resources (default-resources) @ hadoop-shim-2.6 ---
[INFO] Using 'UTF-8' encoding to copy filtered resources.
[INFO] Copying 1 resource
[INFO] 
[INFO] --- maven-compiler-plugin:3.1:compile (default-compile) @ hadoop-shim-2.6 ---
[INFO] Nothing to compile - all classes are up to date
[INFO] 
[INFO] --- maven-resources-plugin:2.6:testResources (default-testResources) @ hadoop-shim-2.6
---
[INFO] Using 'UTF-8' encoding to copy filtered resources.
[INFO] skip non existing resourceDirectory <https://builds.apache.org/job/Tez-Build/ws/hadoop-shim-impls/hadoop-shim-2.6/src/test/resources>
[INFO] 
[INFO] --- maven-compiler-plugin:3.1:testCompile (default-testCompile) @ hadoop-shim-2.6 ---
[INFO] Nothing to compile - all classes are up to date
[INFO] 
[INFO] --- maven-surefire-plugin:2.14.1:test (default-test) @ hadoop-shim-2.6 ---
[INFO] Skipping execution of surefire because it has already been run for this configuration
[INFO] 
[INFO] --- maven-jar-plugin:2.4:jar (default-jar) @ hadoop-shim-2.6 ---
[INFO] Building jar: <https://builds.apache.org/job/Tez-Build/ws/hadoop-shim-impls/hadoop-shim-2.6/target/hadoop-shim-2.6-0.8.3-SNAPSHOT.jar>
[INFO] 
[INFO] --- maven-jar-plugin:2.4:test-jar (default) @ hadoop-shim-2.6 ---
[INFO] Building jar: <https://builds.apache.org/job/Tez-Build/ws/hadoop-shim-impls/hadoop-shim-2.6/target/hadoop-shim-2.6-0.8.3-SNAPSHOT-tests.jar>
[INFO] 
[INFO] --- maven-install-plugin:2.4:install (default-install) @ hadoop-shim-2.6 ---
[INFO] Installing <https://builds.apache.org/job/Tez-Build/ws/hadoop-shim-impls/hadoop-shim-2.6/target/hadoop-shim-2.6-0.8.3-SNAPSHOT.jar>
to /home/jenkins/.m2/repository/org/apache/tez/hadoop-shim-2.6/0.8.3-SNAPSHOT/hadoop-shim-2.6-0.8.3-SNAPSHOT.jar
[INFO] Installing <https://builds.apache.org/job/Tez-Build/ws/hadoop-shim-impls/hadoop-shim-2.6/pom.xml>
to /home/jenkins/.m2/repository/org/apache/tez/hadoop-shim-2.6/0.8.3-SNAPSHOT/hadoop-shim-2.6-0.8.3-SNAPSHOT.pom
[INFO] Installing <https://builds.apache.org/job/Tez-Build/ws/hadoop-shim-impls/hadoop-shim-2.6/target/hadoop-shim-2.6-0.8.3-SNAPSHOT-tests.jar>
to /home/jenkins/.m2/repository/org/apache/tez/hadoop-shim-2.6/0.8.3-SNAPSHOT/hadoop-shim-2.6-0.8.3-SNAPSHOT-tests.jar
[INFO] 
[INFO] --- maven-deploy-plugin:2.8.1:deploy (default-deploy) @ hadoop-shim-2.6 ---
[INFO] Deploying org.apache.tez:hadoop-shim-2.6:0.8.3-SNAPSHOT at end
[INFO] 
[INFO] --- buildnumber-maven-plugin:1.1:create (default) @ hadoop-shim-2.6 ---
[INFO] Checking for local modifications: skipped.
[INFO] Updating project files from SCM: skipped.
[INFO] Executing: /bin/sh -c cd <https://builds.apache.org/job/Tez-Build/ws/hadoop-shim-impls/hadoop-shim-2.6>
&& git rev-parse --verify HEAD
[INFO] Working directory: <https://builds.apache.org/job/Tez-Build/ws/hadoop-shim-impls/hadoop-shim-2.6>
[INFO] Storing buildNumber: 8e9e5ae7fe14c262ebcff5f2364fc5b5275c776a at timestamp: 1459850615560
[INFO] Executing: /bin/sh -c cd <https://builds.apache.org/job/Tez-Build/ws/hadoop-shim-impls/hadoop-shim-2.6>
&& git rev-parse --verify HEAD
[INFO] Working directory: <https://builds.apache.org/job/Tez-Build/ws/hadoop-shim-impls/hadoop-shim-2.6>
[INFO] Storing buildScmBranch: UNKNOWN
[INFO] 
[INFO] --- build-helper-maven-plugin:1.8:maven-version (maven-version) @ hadoop-shim-2.6 ---
[INFO] 
[INFO] --- maven-resources-plugin:2.6:resources (default-resources) @ hadoop-shim-2.6 ---
[INFO] Using 'UTF-8' encoding to copy filtered resources.
[INFO] Copying 1 resource
[INFO] 
[INFO] --- maven-compiler-plugin:3.1:compile (default-compile) @ hadoop-shim-2.6 ---
[INFO] Nothing to compile - all classes are up to date
[INFO] 
[INFO] --- maven-resources-plugin:2.6:testResources (default-testResources) @ hadoop-shim-2.6
---
[INFO] Using 'UTF-8' encoding to copy filtered resources.
[INFO] skip non existing resourceDirectory <https://builds.apache.org/job/Tez-Build/ws/hadoop-shim-impls/hadoop-shim-2.6/src/test/resources>
[INFO] 
[INFO] --- maven-compiler-plugin:3.1:testCompile (default-testCompile) @ hadoop-shim-2.6 ---
[INFO] Nothing to compile - all classes are up to date
[INFO] 
[INFO] --- maven-surefire-plugin:2.14.1:test (default-test) @ hadoop-shim-2.6 ---
[INFO] Skipping execution of surefire because it has already been run for this configuration
[INFO] 
[INFO] --- maven-jar-plugin:2.4:jar (default-jar) @ hadoop-shim-2.6 ---
[INFO] 
[INFO] --- maven-jar-plugin:2.4:test-jar (default) @ hadoop-shim-2.6 ---
[INFO]                                                                         
[INFO] ------------------------------------------------------------------------
[INFO] Skipping tez-dist
[INFO] This project has been banned from the build due to previous failures.
[INFO] ------------------------------------------------------------------------
[INFO]                                                                         
[INFO] ------------------------------------------------------------------------
[INFO] Building Tez 0.8.3-SNAPSHOT
[INFO] ------------------------------------------------------------------------
[INFO] 
[INFO] --- maven-clean-plugin:3.0.0:clean (default-clean) @ tez-docs ---
[INFO] 
[INFO] --- buildnumber-maven-plugin:1.1:create (default) @ tez-docs ---
[INFO] Checking for local modifications: skipped.
[INFO] Updating project files from SCM: skipped.
[INFO] Executing: /bin/sh -c cd <https://builds.apache.org/job/Tez-Build/ws/docs> &&
git rev-parse --verify HEAD
[INFO] Working directory: <https://builds.apache.org/job/Tez-Build/ws/docs>
[INFO] Storing buildNumber: 8e9e5ae7fe14c262ebcff5f2364fc5b5275c776a at timestamp: 1459850615598
[INFO] Executing: /bin/sh -c cd <https://builds.apache.org/job/Tez-Build/ws/docs> &&
git rev-parse --verify HEAD
[INFO] Working directory: <https://builds.apache.org/job/Tez-Build/ws/docs>
[INFO] Storing buildScmBranch: UNKNOWN
[INFO] 
[INFO] --- build-helper-maven-plugin:1.8:maven-version (maven-version) @ tez-docs ---
[INFO] 
[INFO] --- buildnumber-maven-plugin:1.1:create (default) @ tez-docs ---
[INFO] Checking for local modifications: skipped.
[INFO] Updating project files from SCM: skipped.
[INFO] Executing: /bin/sh -c cd <https://builds.apache.org/job/Tez-Build/ws/docs> &&
git rev-parse --verify HEAD
[INFO] Working directory: <https://builds.apache.org/job/Tez-Build/ws/docs>
[INFO] Storing buildNumber: 8e9e5ae7fe14c262ebcff5f2364fc5b5275c776a at timestamp: 1459850615607
[INFO] Executing: /bin/sh -c cd <https://builds.apache.org/job/Tez-Build/ws/docs> &&
git rev-parse --verify HEAD
[INFO] Working directory: <https://builds.apache.org/job/Tez-Build/ws/docs>
[INFO] Storing buildScmBranch: UNKNOWN
[INFO] 
[INFO] --- build-helper-maven-plugin:1.8:maven-version (maven-version) @ tez-docs ---
[INFO] 
[INFO] --- maven-jar-plugin:2.4:test-jar (default) @ tez-docs ---
[WARNING] JAR will be empty - no content was marked for inclusion!
[INFO] Building jar: <https://builds.apache.org/job/Tez-Build/ws/docs/target/tez-docs-0.8.3-SNAPSHOT-tests.jar>
[INFO] 
[INFO] --- maven-install-plugin:2.4:install (default-install) @ tez-docs ---
[INFO] Installing <https://builds.apache.org/job/Tez-Build/ws/docs/pom.xml> to /home/jenkins/.m2/repository/org/apache/tez/tez-docs/0.8.3-SNAPSHOT/tez-docs-0.8.3-SNAPSHOT.pom
[INFO] Installing <https://builds.apache.org/job/Tez-Build/ws/docs/target/tez-docs-0.8.3-SNAPSHOT-tests.jar>
to /home/jenkins/.m2/repository/org/apache/tez/tez-docs/0.8.3-SNAPSHOT/tez-docs-0.8.3-SNAPSHOT-tests.jar
[INFO] 
[INFO] --- maven-deploy-plugin:2.8.1:deploy (default-deploy) @ tez-docs ---
[INFO] Skipping artifact deployment
[INFO] 
[INFO] --- buildnumber-maven-plugin:1.1:create (default) @ tez-docs ---
[INFO] Checking for local modifications: skipped.
[INFO] Updating project files from SCM: skipped.
[INFO] Executing: /bin/sh -c cd <https://builds.apache.org/job/Tez-Build/ws/docs> &&
git rev-parse --verify HEAD
[INFO] Working directory: <https://builds.apache.org/job/Tez-Build/ws/docs>
[INFO] Storing buildNumber: 8e9e5ae7fe14c262ebcff5f2364fc5b5275c776a at timestamp: 1459850615703
[INFO] Executing: /bin/sh -c cd <https://builds.apache.org/job/Tez-Build/ws/docs> &&
git rev-parse --verify HEAD
[INFO] Working directory: <https://builds.apache.org/job/Tez-Build/ws/docs>
[INFO] Storing buildScmBranch: UNKNOWN
[INFO] 
[INFO] --- build-helper-maven-plugin:1.8:maven-version (maven-version) @ tez-docs ---
[INFO] 
[INFO] --- maven-jar-plugin:2.4:test-jar (default) @ tez-docs ---
[WARNING] JAR will be empty - no content was marked for inclusion!
[INFO] ------------------------------------------------------------------------
[INFO] Reactor Summary:
[INFO] 
[INFO] tez ............................................... SUCCESS [  2.091 s]
[INFO] hadoop-shim ....................................... SUCCESS [  3.151 s]
[INFO] tez-api ........................................... SUCCESS [ 55.912 s]
[INFO] tez-common ........................................ SUCCESS [  5.392 s]
[INFO] tez-runtime-internals ............................. SUCCESS [ 14.161 s]
[INFO] tez-runtime-library ............................... SUCCESS [02:50 min]
[INFO] tez-mapreduce ..................................... SUCCESS [ 32.659 s]
[INFO] tez-examples ...................................... SUCCESS [  0.349 s]
[INFO] tez-dag ........................................... FAILURE [02:10 min]
[INFO] tez-tests ......................................... SKIPPED
[INFO] tez-ext-service-tests ............................. SKIPPED
[INFO] tez-ui ............................................ SUCCESS [01:13 min]
[INFO] tez-ui2 ........................................... SUCCESS [05:36 min]
[INFO] tez-plugins ....................................... SUCCESS [  0.099 s]
[INFO] tez-yarn-timeline-history ......................... SKIPPED
[INFO] tez-yarn-timeline-history-with-acls ............... SKIPPED
[INFO] tez-history-parser ................................ SKIPPED
[INFO] tez-tools ......................................... SUCCESS [  0.096 s]
[INFO] tez-perf-analyzer ................................. SUCCESS [  0.057 s]
[INFO] tez-job-analyzer .................................. SKIPPED
[INFO] tez-javadoc-tools ................................. SUCCESS [  0.247 s]
[INFO] hadoop-shim-impls ................................. SUCCESS [  0.049 s]
[INFO] hadoop-shim-2.6 ................................... SUCCESS [  0.669 s]
[INFO] tez-dist .......................................... SKIPPED
[INFO] Tez ............................................... SUCCESS [  0.122 s]
[INFO] ------------------------------------------------------------------------
[INFO] BUILD FAILURE
[INFO] ------------------------------------------------------------------------
[INFO] Total time: 13:46 min
[INFO] Finished at: 2016-04-05T10:03:35+00:00
[INFO] Final Memory: 87M/884M
[INFO] ------------------------------------------------------------------------
[ERROR] Failed to execute goal org.apache.maven.plugins:maven-surefire-plugin:2.14.1:test
(default-test) on project tez-dag: There are test failures.
[ERROR] 
[ERROR] Please refer to <https://builds.apache.org/job/Tez-Build/ws/tez-dag/target/surefire-reports>
for the individual test results.
[ERROR] -> [Help 1]
[ERROR] 
[ERROR] To see the full stack trace of the errors, re-run Maven with the -e switch.
[ERROR] Re-run Maven using the -X switch to enable full debug logging.
[ERROR] 
[ERROR] For more information about the errors and possible solutions, please read the following
articles:
[ERROR] [Help 1] http://cwiki.apache.org/confluence/display/MAVEN/MojoFailureException
[ERROR] 
[ERROR] After correcting the problems, you can resume the build with the command
[ERROR]   mvn <goals> -rf :tez-dag
Build step 'Execute shell' marked build as failure
Archiving artifacts
Recording test results

Mime
View raw message