tez-dev mailing list archives

Site index · List index
Message view « Date » · « Thread »
Top « Date » · « Thread »
From Apache Jenkins Server <jenk...@builds.apache.org>
Subject Build failed in Jenkins: Tez-Build #1432
Date Sat, 16 Apr 2016 05:02:32 GMT
See <https://builds.apache.org/job/Tez-Build/1432/changes>

Changes:

[sseth] TEZ-3208 part2. Update documentation for 0.8.3 release.

------------------------------------------
[...truncated 6391 lines...]
[WARNING] The following patterns were never triggered in this artifact exclusion filter:
o  '*:*:test-jar'

[WARNING] The following patterns were never triggered in this artifact exclusion filter:
o  '*:*:test-jar'

[WARNING] The following patterns were never triggered in this artifact exclusion filter:
o  '*:*:test-jar'

[WARNING] The following patterns were never triggered in this artifact exclusion filter:
o  '*:*:test-jar'

[INFO] Building tar: <https://builds.apache.org/job/Tez-Build/1432/artifact/tez-dist/target/tez-0.8.4-SNAPSHOT.tar.gz>
[INFO] 
[INFO] --- maven-assembly-plugin:2.4:single (package-tez-minimal) @ tez-dist ---
[INFO] Reading assembly descriptor: src/main/assembly/tez-dist-minimal.xml
[WARNING] NOTE: Currently, inclusion of module dependencies may produce unpredictable results
if a version conflict occurs.
[WARNING] The following patterns were never triggered in this artifact exclusion filter:
o  '*:*:test-jar'

[WARNING] The following patterns were never triggered in this artifact exclusion filter:
o  '*:*:test-jar'

[WARNING] The following patterns were never triggered in this artifact exclusion filter:
o  '*:*:test-jar'

[WARNING] The following patterns were never triggered in this artifact exclusion filter:
o  '*:*:test-jar'

[WARNING] The following patterns were never triggered in this artifact exclusion filter:
o  '*:*:test-jar'

[WARNING] The following patterns were never triggered in this artifact exclusion filter:
o  '*:*:test-jar'

[WARNING] The following patterns were never triggered in this artifact exclusion filter:
o  '*:*:test-jar'

[WARNING] The following patterns were never triggered in this artifact exclusion filter:
o  '*:*:test-jar'

[WARNING] The following patterns were never triggered in this artifact exclusion filter:
o  '*:*:test-jar'

[WARNING] The following patterns were never triggered in this artifact exclusion filter:
o  '*:*:test-jar'

[WARNING] The following patterns were never triggered in this artifact exclusion filter:
o  '*:*:test-jar'

[WARNING] The following patterns were never triggered in this artifact exclusion filter:
o  '*:*:test-jar'

[WARNING] The following patterns were never triggered in this artifact exclusion filter:
o  '*:*:test-jar'

[WARNING] The following patterns were never triggered in this artifact exclusion filter:
o  '*:*:test-jar'

[WARNING] The following patterns were never triggered in this artifact exclusion filter:
o  '*:*:test-jar'

[WARNING] The following patterns were never triggered in this artifact exclusion filter:
o  '*:*:test-jar'

[WARNING] The following patterns were never triggered in this artifact exclusion filter:
o  '*:*:test-jar'

[WARNING] The following patterns were never triggered in this artifact exclusion filter:
o  '*:*:test-jar'

[INFO] Copying files to <https://builds.apache.org/job/Tez-Build/ws/tez-dist/target/tez-0.8.4-SNAPSHOT-minimal>
[WARNING] NOTE: Currently, inclusion of module dependencies may produce unpredictable results
if a version conflict occurs.
[WARNING] The following patterns were never triggered in this artifact exclusion filter:
o  '*:*:test-jar'

[WARNING] The following patterns were never triggered in this artifact exclusion filter:
o  '*:*:test-jar'

[WARNING] The following patterns were never triggered in this artifact exclusion filter:
o  '*:*:test-jar'

[WARNING] The following patterns were never triggered in this artifact exclusion filter:
o  '*:*:test-jar'

[WARNING] The following patterns were never triggered in this artifact exclusion filter:
o  '*:*:test-jar'

[WARNING] The following patterns were never triggered in this artifact exclusion filter:
o  '*:*:test-jar'

[WARNING] The following patterns were never triggered in this artifact exclusion filter:
o  '*:*:test-jar'

[WARNING] The following patterns were never triggered in this artifact exclusion filter:
o  '*:*:test-jar'

[WARNING] The following patterns were never triggered in this artifact exclusion filter:
o  '*:*:test-jar'

[WARNING] The following patterns were never triggered in this artifact exclusion filter:
o  '*:*:test-jar'

[WARNING] The following patterns were never triggered in this artifact exclusion filter:
o  '*:*:test-jar'

[WARNING] The following patterns were never triggered in this artifact exclusion filter:
o  '*:*:test-jar'

[WARNING] The following patterns were never triggered in this artifact exclusion filter:
o  '*:*:test-jar'

[WARNING] The following patterns were never triggered in this artifact exclusion filter:
o  '*:*:test-jar'

[WARNING] The following patterns were never triggered in this artifact exclusion filter:
o  '*:*:test-jar'

[WARNING] The following patterns were never triggered in this artifact exclusion filter:
o  '*:*:test-jar'

[WARNING] The following patterns were never triggered in this artifact exclusion filter:
o  '*:*:test-jar'

[WARNING] The following patterns were never triggered in this artifact exclusion filter:
o  '*:*:test-jar'

[INFO] Building tar: <https://builds.apache.org/job/Tez-Build/1432/artifact/tez-dist/target/tez-0.8.4-SNAPSHOT-minimal.tar.gz>
[INFO] 
[INFO] --- maven-jar-plugin:2.4:test-jar (default) @ tez-dist ---
[WARNING] JAR will be empty - no content was marked for inclusion!
[INFO]                                                                         
[INFO] ------------------------------------------------------------------------
[INFO] Building Tez 0.8.4-SNAPSHOT
[INFO] ------------------------------------------------------------------------
[INFO] 
[INFO] --- maven-clean-plugin:3.0.0:clean (default-clean) @ tez-docs ---
[INFO] Deleting <https://builds.apache.org/job/Tez-Build/ws/docs/target>
[INFO] 
[INFO] --- buildnumber-maven-plugin:1.1:create (default) @ tez-docs ---
[INFO] Checking for local modifications: skipped.
[INFO] Updating project files from SCM: skipped.
[INFO] Executing: /bin/sh -c cd <https://builds.apache.org/job/Tez-Build/ws/docs> &&
git rev-parse --verify HEAD
[INFO] Working directory: <https://builds.apache.org/job/Tez-Build/ws/docs>
[INFO] Storing buildNumber: 7d7b388058dfdb70870bdc55cdfc6d709833d8d2 at timestamp: 1460782870584
[INFO] Executing: /bin/sh -c cd <https://builds.apache.org/job/Tez-Build/ws/docs> &&
git rev-parse --verify HEAD
[INFO] Working directory: <https://builds.apache.org/job/Tez-Build/ws/docs>
[INFO] Storing buildScmBranch: UNKNOWN
[INFO] 
[INFO] --- build-helper-maven-plugin:1.8:maven-version (maven-version) @ tez-docs ---
[INFO] 
[INFO] --- buildnumber-maven-plugin:1.1:create (default) @ tez-docs ---
[INFO] Checking for local modifications: skipped.
[INFO] Updating project files from SCM: skipped.
[INFO] Executing: /bin/sh -c cd <https://builds.apache.org/job/Tez-Build/ws/docs> &&
git rev-parse --verify HEAD
[INFO] Working directory: <https://builds.apache.org/job/Tez-Build/ws/docs>
[INFO] Storing buildNumber: 7d7b388058dfdb70870bdc55cdfc6d709833d8d2 at timestamp: 1460782870595
[INFO] Executing: /bin/sh -c cd <https://builds.apache.org/job/Tez-Build/ws/docs> &&
git rev-parse --verify HEAD
[INFO] Working directory: <https://builds.apache.org/job/Tez-Build/ws/docs>
[INFO] Storing buildScmBranch: UNKNOWN
[INFO] 
[INFO] --- build-helper-maven-plugin:1.8:maven-version (maven-version) @ tez-docs ---
[INFO] 
[INFO] --- maven-jar-plugin:2.4:test-jar (default) @ tez-docs ---
[WARNING] JAR will be empty - no content was marked for inclusion!
[INFO] Building jar: <https://builds.apache.org/job/Tez-Build/ws/docs/target/tez-docs-0.8.4-SNAPSHOT-tests.jar>
[INFO] 
[INFO] --- maven-install-plugin:2.4:install (default-install) @ tez-docs ---
[INFO] Installing <https://builds.apache.org/job/Tez-Build/ws/docs/pom.xml> to /home/jenkins/.m2/repository/org/apache/tez/tez-docs/0.8.4-SNAPSHOT/tez-docs-0.8.4-SNAPSHOT.pom
[INFO] Installing <https://builds.apache.org/job/Tez-Build/ws/docs/target/tez-docs-0.8.4-SNAPSHOT-tests.jar>
to /home/jenkins/.m2/repository/org/apache/tez/tez-docs/0.8.4-SNAPSHOT/tez-docs-0.8.4-SNAPSHOT-tests.jar
[INFO] 
[INFO] --- maven-deploy-plugin:2.8.1:deploy (default-deploy) @ tez-docs ---
[INFO] Skipping artifact deployment
Downloading: https://repository.apache.org/content/repositories/snapshots/org/apache/tez/tez/0.8.4-SNAPSHOT/maven-metadata.xml
806/806 B   
            
Downloaded: https://repository.apache.org/content/repositories/snapshots/org/apache/tez/tez/0.8.4-SNAPSHOT/maven-metadata.xml
(806 B at 0.3 KB/sec)
Uploading: https://repository.apache.org/content/repositories/snapshots/org/apache/tez/tez/0.8.4-SNAPSHOT/tez-0.8.4-20160416.050113-3.pom
2/44 KB     
4/44 KB   
6/44 KB   
8/44 KB   
10/44 KB   
12/44 KB   
14/44 KB   
16/44 KB   
18/44 KB   
20/44 KB   
22/44 KB   
24/44 KB   
26/44 KB   
28/44 KB   
30/44 KB   
32/44 KB   
34/44 KB   
36/44 KB   
38/44 KB   
40/44 KB   
42/44 KB   
44/44 KB   
           
[INFO] ------------------------------------------------------------------------
[INFO] Reactor Summary:
[INFO] 
[INFO] tez ............................................... SUCCESS [  1.696 s]
[INFO] hadoop-shim ....................................... SUCCESS [  2.928 s]
[INFO] tez-api ........................................... SUCCESS [ 54.939 s]
[INFO] tez-common ........................................ SUCCESS [  5.409 s]
[INFO] tez-runtime-internals ............................. SUCCESS [ 14.374 s]
[INFO] tez-runtime-library ............................... SUCCESS [02:51 min]
[INFO] tez-mapreduce ..................................... SUCCESS [ 35.686 s]
[INFO] tez-examples ...................................... SUCCESS [  0.349 s]
[INFO] tez-dag ........................................... SUCCESS [02:36 min]
[INFO] tez-tests ......................................... SUCCESS [44:55 min]
[INFO] tez-ext-service-tests ............................. SUCCESS [06:40 min]
[INFO] tez-ui ............................................ SUCCESS [01:27 min]
[INFO] tez-ui2 ........................................... SUCCESS [03:09 min]
[INFO] tez-plugins ....................................... SUCCESS [  0.093 s]
[INFO] tez-yarn-timeline-history ......................... SUCCESS [ 57.598 s]
[INFO] tez-yarn-timeline-history-with-acls ............... SUCCESS [02:04 min]
[INFO] tez-history-parser ................................ SUCCESS [02:15 min]
[INFO] tez-tools ......................................... SUCCESS [  0.202 s]
[INFO] tez-perf-analyzer ................................. SUCCESS [  0.070 s]
[INFO] tez-job-analyzer .................................. SUCCESS [02:07 min]
[INFO] tez-javadoc-tools ................................. SUCCESS [  0.228 s]
[INFO] hadoop-shim-impls ................................. SUCCESS [  0.069 s]
[INFO] hadoop-shim-2.6 ................................... SUCCESS [  0.723 s]
[INFO] tez-dist .......................................... SUCCESS [ 27.151 s]
[INFO] Tez ............................................... FAILURE [01:03 min]
[INFO] ------------------------------------------------------------------------
[INFO] BUILD FAILURE
[INFO] ------------------------------------------------------------------------
[INFO] Total time: 01:12 h
[INFO] Finished at: 2016-04-16T05:02:13+00:00
[INFO] Final Memory: 75M/1137M
[INFO] ------------------------------------------------------------------------
[ERROR] Failed to execute goal org.apache.maven.plugins:maven-deploy-plugin:2.8.1:deploy (default-deploy)
on project tez-docs: Failed to deploy artifacts: Could not transfer artifact org.apache.tez:tez:pom:0.8.4-20160416.050113-3
from/to apache.snapshots.https (https://repository.apache.org/content/repositories/snapshots):
Failed to transfer file: https://repository.apache.org/content/repositories/snapshots/org/apache/tez/tez/0.8.4-SNAPSHOT/tez-0.8.4-20160416.050113-3.pom.
Return code is: 502, ReasonPhrase: Proxy Error. -> [Help 1]
[ERROR] 
[ERROR] To see the full stack trace of the errors, re-run Maven with the -e switch.
[ERROR] Re-run Maven using the -X switch to enable full debug logging.
[ERROR] 
[ERROR] For more information about the errors and possible solutions, please read the following
articles:
[ERROR] [Help 1] http://cwiki.apache.org/confluence/display/MAVEN/MojoExecutionException
[ERROR] 
[ERROR] After correcting the problems, you can resume the build with the command
[ERROR]   mvn <goals> -rf :tez-docs
Build step 'Execute shell' marked build as failure
Archiving artifacts
Recording test results

Mime
View raw message