tez-dev mailing list archives

Site index · List index
Message view « Date » · « Thread »
Top « Date » · « Thread »
From "Hitesh Shah (JIRA)" <j...@apache.org>
Subject [jira] [Created] (TEZ-3229) Tez-ui failing to compile on jenkins after the tez-ui2 move
Date Tue, 26 Apr 2016 15:58:12 GMT
Hitesh Shah created TEZ-3229:
--------------------------------

             Summary: Tez-ui failing to compile on jenkins after the tez-ui2 move
                 Key: TEZ-3229
                 URL: https://issues.apache.org/jira/browse/TEZ-3229
             Project: Apache Tez
          Issue Type: Bug
            Reporter: Hitesh Shah
            Assignee: Sreenath Somarajapuram
            Priority: Blocker


>From jenkins logs:

> tez-ui@0.2.0 build:mvn /home/jenkins/jenkins-slave/workspace/Tez-Build/tez-ui/src/main/webapp
> TMPDIR=tmp node/node ./node_modules/ember-cli/bin/ember build -prod

version: 1.13.13
Could not find watchman, falling back to NodeWatcher for file system events.
Visit http://www.ember-cli.com/user-guide/#watchman for more info.
BuildingBuilding.Building..Building...BuildingBuilding.Building..Building...BuildingBuilding.Building..Building...BuildingBuilding.Building..Building...BuildingBuilding.Building..Building...BuildingBuilding.Building..Building...BuildingBuilding.Building..Building...Building[BABEL]
Note: The code generator has deoptimised the styling of "tez-ui/bower_components/antiscroll/deps/jquery.js"
as it exceeds the max of "100KB".
Building.Building..Building...BuildingBuilding.Building..Building...BuildingBuilding.Building..Building...BuildingBuilding.Building..Building...[BABEL]
Note: The code generator has deoptimised the styling of "tez-ui/bower_components/codemirror/keymap/vim.js"
as it exceeds the max of "100KB".
Building[BABEL] Note: The code generator has deoptimised the styling of "tez-ui/bower_components/codemirror/lib/codemirror.js"
as it exceeds the max of "100KB".
Building.Building..Building...BuildingBuilding.Building..Building...BuildingBuilding.Building..Building...BuildingBuilding.Building..Building...BuildingBuilding.Building..Building...[BABEL]
Note: The code generator has deoptimised the styling of "tez-ui/bower_components/d3/d3.js"
as it exceeds the max of "100KB".
Building[BABEL] Note: The code generator has deoptimised the styling of "tez-ui/bower_components/d3/d3.min.js"
as it exceeds the max of "100KB".
Building.[BABEL] Note: The code generator has deoptimised the styling of "tez-ui/bower_components/ember/ember.js"
as it exceeds the max of "100KB".
Building..[BABEL] Note: The code generator has deoptimised the styling of "tez-ui/bower_components/ember/ember.min.js"
as it exceeds the max of "100KB".
Building...[BABEL] Note: The code generator has deoptimised the styling of "tez-ui/bower_components/ember/ember.prod.js"
as it exceeds the max of "100KB".
BuildingBuilding.Building..Building...BuildingBuilding.[BABEL] Note: The code generator has
deoptimised the styling of "tez-ui/bower_components/ember-data/ember-data.js" as it exceeds
the max of "100KB".
Building..Building...[BABEL] Note: The code generator has deoptimised the styling of "tez-ui/bower_components/ember-data/ember-data.prod.js"
as it exceeds the max of "100KB".
BuildingBuilding.Building..Building...BuildingBuilding.Building..Building...BuildingBuilding.[BABEL]
Note: The code generator has deoptimised the styling of "tez-ui/bower_components/jquery/jquery.js"
as it exceeds the max of "100KB".
Building..Building...[BABEL] Note: The code generator has deoptimised the styling of "tez-ui/bower_components/jquery/speed/jquery-basis.js"
as it exceeds the max of "100KB".
BuildingBuilding.Building..Building...Build failed.
File: tez-ui/bower_components/jquery/src/intro.js
tez-ui/bower_components/jquery/src/intro.js: Unexpected token (21:0)
SyntaxError: tez-ui/bower_components/jquery/src/intro.js: Unexpected token (21:0)
// Support: Firefox 18+
//"use strict";

    at Parser.pp.raise (/home/jenkins/jenkins-slave/workspace/Tez-Build/tez-ui/src/main/webapp/node_modules/ember-cli-babel/node_modules/broccoli-babel-transpiler/node_modules/babel-core/node_modules/babylon/lib/parser/location.js:24:13)
    at Parser.pp.unexpected (/home/jenkins/jenkins-slave/workspace/Tez-Build/tez-ui/src/main/webapp/node_modules/ember-cli-babel/node_modules/broccoli-babel-transpiler/node_modules/babel-core/node_modules/babylon/lib/parser/util.js:82:8)
    at Parser.pp.parseExprAtom (/home/jenkins/jenkins-slave/workspace/Tez-Build/tez-ui/src/main/webapp/node_modules/ember-cli-babel/node_modules/broccoli-babel-transpiler/node_modules/babel-core/node_modules/babylon/lib/parser/expression.js:425:12)
    at Parser.pp.parseExprSubscripts (/home/jenkins/jenkins-slave/workspace/Tez-Build/tez-ui/src/main/webapp/node_modules/ember-cli-babel/node_modules/broccoli-babel-transpiler/node_modules/babel-core/node_modules/babylon/lib/parser/expression.js:236:19)
    at Parser.pp.parseMaybeUnary (/home/jenkins/jenkins-slave/workspace/Tez-Build/tez-ui/src/main/webapp/node_modules/ember-cli-babel/node_modules/broccoli-babel-transpiler/node_modules/babel-core/node_modules/babylon/lib/parser/expression.js:217:19)
    at Parser.pp.parseExprOps (/home/jenkins/jenkins-slave/workspace/Tez-Build/tez-ui/src/main/webapp/node_modules/ember-cli-babel/node_modules/broccoli-babel-transpiler/node_modules/babel-core/node_modules/babylon/lib/parser/expression.js:163:19)
    at Parser.pp.parseMaybeConditional (/home/jenkins/jenkins-slave/workspace/Tez-Build/tez-ui/src/main/webapp/node_modules/ember-cli-babel/node_modules/broccoli-babel-transpiler/node_modules/babel-core/node_modules/babylon/lib/parser/expression.js:145:19)
    at Parser.pp.parseMaybeAssign (/home/jenkins/jenkins-slave/workspace/Tez-Build/tez-ui/src/main/webapp/node_modules/ember-cli-babel/node_modules/broccoli-babel-transpiler/node_modules/babel-core/node_modules/babylon/lib/parser/expression.js:112:19)
    at Parser.pp.parseExpression (/home/jenkins/jenkins-slave/workspace/Tez-Build/tez-ui/src/main/webapp/node_modules/ember-cli-babel/node_modules/broccoli-babel-transpiler/node_modules/babel-core/node_modules/babylon/lib/parser/expression.js:79:19)
    at Parser.pp.parseStatement (/home/jenkins/jenkins-slave/workspace/Tez-Build/tez-ui/src/main/webapp/node_modules/ember-cli-babel/node_modules/broccoli-babel-transpiler/node_modules/babel-core/node_modules/babylon/lib/parser/statement.js:137:23)

npm ERR! Linux 3.13.0-36-lowlatency
npm ERR! argv "/home/jenkins/jenkins-slave/workspace/Tez-Build/tez-ui/src/main/webapp/node/node"
"/home/jenkins/jenkins-slave/workspace/Tez-Build/tez-ui/src/main/webapp/node/npm/bin/npm-cli"
"run" "build:mvn"
npm ERR! node v0.12.2
npm ERR! npm  v2.15.3
npm ERR! code ELIFECYCLE
npm ERR! tez-ui@0.2.0 build:mvn: `TMPDIR=tmp node/node ./node_modules/ember-cli/bin/ember
build -prod`
npm ERR! Exit status 1
npm ERR! 
npm ERR! Failed at the tez-ui@0.2.0 build:mvn script 'TMPDIR=tmp node/node ./node_modules/ember-cli/bin/ember
build -prod'.
npm ERR! This is most likely a problem with the tez-ui package,
npm ERR! not with npm itself.
npm ERR! Tell the author that this fails on your system:
npm ERR!     TMPDIR=tmp node/node ./node_modules/ember-cli/bin/ember build -prod
npm ERR! You can get information on how to open an issue for this project with:
npm ERR!     npm bugs tez-ui
npm ERR! Or if that isn't available, you can get their info via:
npm ERR! 
npm ERR!     npm owner ls tez-ui
npm ERR! There is likely additional logging output above.




--
This message was sent by Atlassian JIRA
(v6.3.4#6332)

Mime
View raw message