tez-dev mailing list archives

Site index · List index
Message view « Date » · « Thread »
Top « Date » · « Thread »
From Apache Jenkins Server <jenk...@builds.apache.org>
Subject Build failed in Jenkins: Tez-Build #1714
Date Mon, 19 Jun 2017 20:00:55 GMT
See <https://builds.apache.org/job/Tez-Build/1714/display/redirect?page=changes>

Changes:

[kshukla] TEZ-3760. Tez AUX Services: Shading needs to filter SIG files with

------------------------------------------
[...truncated 2.49 KB...]
GIT_AUTHOR_NAME=jenkins
GIT_COMMITTER_NAME=jenkins
GIT_COMMIT=c7a046154e367d42b2c2ff4c643925fbd1dcc265
JENKINS_HOME=/x1/jenkins/jenkins-home
MAVEN_HOME=/home/jenkins/tools/maven/latest
ROOT_BUILD_CAUSE_SCMTRIGGER=true
PATH=/home/jenkins/tools/java/latest1.7/bin:/home/jenkins/tools/maven/latest/bin:/home/jenkins/tools/java/latest1.7/bin:/usr/local/sbin:/usr/local/bin:/usr/sbin:/usr/bin:/sbin:/bin:/usr/games:/usr/local/games
MAIL=/var/mail/jenkins
RUN_DISPLAY_URL=https://builds.apache.org/job/Tez-Build/1714/display/redirect
BUILD_CAUSE_SCMTRIGGER=true
GIT_COMMITTER_EMAIL=builds@apache.org
PWD=<https://builds.apache.org/job/Tez-Build/ws/>
JAVA_HOME=/home/jenkins/tools/java/latest1.7
HUDSON_URL=https://builds.apache.org/
LANG=en_US
JOB_NAME=Tez-Build
BUILD_DISPLAY_NAME=#1714
BUILD_CAUSE=SCMTRIGGER
BUILD_ID=1714
JENKINS_URL=https://builds.apache.org/
JOB_BASE_NAME=Tez-Build
GIT_PREVIOUS_SUCCESSFUL_COMMIT=d5e65e207492ee1663a737e2411dbb75e07b891f
HOME=/home/jenkins
SHLVL=2
GIT_BRANCH=origin/master
JENKINS_SERVER_COOKIE=f4ebd1e6b0d976e8
EXECUTOR_NUMBER=0
GIT_URL=http://git-wip-us.apache.org/repos/asf/tez.git
NODE_LABELS=H3 Hadoop
LOGNAME=jenkins
SSH_CONNECTION=140.211.11.14 59010 67.195.81.147 22
HUDSON_HOME=/x1/jenkins/jenkins-home
NODE_NAME=H3
JOB_DISPLAY_URL=https://builds.apache.org/job/Tez-Build/display/redirect
BUILD_NUMBER=1714
XDG_RUNTIME_DIR=/run/user/10011
HUDSON_COOKIE=3e44f582-bacc-4f00-9d2e-721ae90b2508
GIT_AUTHOR_EMAIL=builds@apache.org
_=/usr/bin/env
+ export MAVEN_OPTS=-Xmx2048m
+ MAVEN_OPTS=-Xmx2048m
+ git clean -fdx
+ /home/jenkins/tools/maven/latest/bin/mvn clean test --fail-at-end -DdeployAtEnd=true deploy
package -Dtar
[INFO] Scanning for projects...
[INFO] ------------------------------------------------------------------------
[INFO] Reactor Build Order:
[INFO] 
[INFO] tez
[INFO] hadoop-shim
[INFO] tez-api
[INFO] tez-common
[INFO] tez-runtime-internals
[INFO] tez-runtime-library
[INFO] tez-mapreduce
[INFO] tez-examples
[INFO] tez-dag
[INFO] tez-tests
[INFO] tez-ext-service-tests
[INFO] tez-ui
[INFO] tez-plugins
[INFO] tez-yarn-timeline-history
[INFO] tez-yarn-timeline-history-with-acls
[INFO] tez-history-parser
[INFO] tez-aux-services
[INFO] tez-tools
[INFO] tez-perf-analyzer
[INFO] tez-job-analyzer
[INFO] tez-javadoc-tools
[INFO] hadoop-shim-impls
[INFO] hadoop-shim-2.7
[INFO] tez-dist
[INFO] Tez
[INFO] 
[INFO] ------------------------------------------------------------------------
[INFO] Building tez 0.9.0-SNAPSHOT
[INFO] ------------------------------------------------------------------------
[INFO] 
[INFO] --- maven-clean-plugin:3.0.0:clean (default-clean) @ tez ---
[INFO] 
[INFO] --- maven-enforcer-plugin:1.4:enforce (clean) @ tez ---
[WARNING] Rule 1: org.apache.maven.plugins.enforcer.RequireJavaVersion failed with message:
Detected JDK Version: 1.7.0-80 is not in the allowed range [1.8,).
[INFO] 
[INFO] ------------------------------------------------------------------------
[INFO] Skipping hadoop-shim
[INFO] This project has been banned from the build due to previous failures.
[INFO] ------------------------------------------------------------------------
[INFO] 
[INFO] ------------------------------------------------------------------------
[INFO] Skipping tez-api
[INFO] This project has been banned from the build due to previous failures.
[INFO] ------------------------------------------------------------------------
[INFO] 
[INFO] ------------------------------------------------------------------------
[INFO] Skipping tez-common
[INFO] This project has been banned from the build due to previous failures.
[INFO] ------------------------------------------------------------------------
[INFO] 
[INFO] ------------------------------------------------------------------------
[INFO] Skipping tez-runtime-internals
[INFO] This project has been banned from the build due to previous failures.
[INFO] ------------------------------------------------------------------------
[INFO] 
[INFO] ------------------------------------------------------------------------
[INFO] Skipping tez-runtime-library
[INFO] This project has been banned from the build due to previous failures.
[INFO] ------------------------------------------------------------------------
[INFO] 
[INFO] ------------------------------------------------------------------------
[INFO] Skipping tez-mapreduce
[INFO] This project has been banned from the build due to previous failures.
[INFO] ------------------------------------------------------------------------
[INFO] 
[INFO] ------------------------------------------------------------------------
[INFO] Skipping tez-examples
[INFO] This project has been banned from the build due to previous failures.
[INFO] ------------------------------------------------------------------------
[INFO] 
[INFO] ------------------------------------------------------------------------
[INFO] Skipping tez-dag
[INFO] This project has been banned from the build due to previous failures.
[INFO] ------------------------------------------------------------------------
[INFO] 
[INFO] ------------------------------------------------------------------------
[INFO] Skipping tez-tests
[INFO] This project has been banned from the build due to previous failures.
[INFO] ------------------------------------------------------------------------
[INFO] 
[INFO] ------------------------------------------------------------------------
[INFO] Skipping tez-ext-service-tests
[INFO] This project has been banned from the build due to previous failures.
[INFO] ------------------------------------------------------------------------
[INFO] 
[INFO] ------------------------------------------------------------------------
[INFO] Skipping tez-ui
[INFO] This project has been banned from the build due to previous failures.
[INFO] ------------------------------------------------------------------------
[INFO] 
[INFO] ------------------------------------------------------------------------
[INFO] Skipping tez-plugins
[INFO] This project has been banned from the build due to previous failures.
[INFO] ------------------------------------------------------------------------
[INFO] 
[INFO] ------------------------------------------------------------------------
[INFO] Skipping tez-yarn-timeline-history
[INFO] This project has been banned from the build due to previous failures.
[INFO] ------------------------------------------------------------------------
[INFO] 
[INFO] ------------------------------------------------------------------------
[INFO] Skipping tez-yarn-timeline-history-with-acls
[INFO] This project has been banned from the build due to previous failures.
[INFO] ------------------------------------------------------------------------
[INFO] 
[INFO] ------------------------------------------------------------------------
[INFO] Skipping tez-history-parser
[INFO] This project has been banned from the build due to previous failures.
[INFO] ------------------------------------------------------------------------
[INFO] 
[INFO] ------------------------------------------------------------------------
[INFO] Skipping tez-aux-services
[INFO] This project has been banned from the build due to previous failures.
[INFO] ------------------------------------------------------------------------
[INFO] 
[INFO] ------------------------------------------------------------------------
[INFO] Skipping tez-tools
[INFO] This project has been banned from the build due to previous failures.
[INFO] ------------------------------------------------------------------------
[INFO] 
[INFO] ------------------------------------------------------------------------
[INFO] Skipping tez-perf-analyzer
[INFO] This project has been banned from the build due to previous failures.
[INFO] ------------------------------------------------------------------------
[INFO] 
[INFO] ------------------------------------------------------------------------
[INFO] Skipping tez-job-analyzer
[INFO] This project has been banned from the build due to previous failures.
[INFO] ------------------------------------------------------------------------
[INFO] 
[INFO] ------------------------------------------------------------------------
[INFO] Skipping tez-javadoc-tools
[INFO] This project has been banned from the build due to previous failures.
[INFO] ------------------------------------------------------------------------
[INFO] 
[INFO] ------------------------------------------------------------------------
[INFO] Skipping hadoop-shim-impls
[INFO] This project has been banned from the build due to previous failures.
[INFO] ------------------------------------------------------------------------
[INFO] 
[INFO] ------------------------------------------------------------------------
[INFO] Skipping hadoop-shim-2.7
[INFO] This project has been banned from the build due to previous failures.
[INFO] ------------------------------------------------------------------------
[INFO] 
[INFO] ------------------------------------------------------------------------
[INFO] Skipping tez-dist
[INFO] This project has been banned from the build due to previous failures.
[INFO] ------------------------------------------------------------------------
[INFO] 
[INFO] ------------------------------------------------------------------------
[INFO] Skipping Tez
[INFO] This project has been banned from the build due to previous failures.
[INFO] ------------------------------------------------------------------------
[INFO] ------------------------------------------------------------------------
[INFO] Reactor Summary:
[INFO] 
[INFO] tez ................................................ FAILURE [  0.907 s]
[INFO] hadoop-shim ........................................ SKIPPED
[INFO] tez-api ............................................ SKIPPED
[INFO] tez-common ......................................... SKIPPED
[INFO] tez-runtime-internals .............................. SKIPPED
[INFO] tez-runtime-library ................................ SKIPPED
[INFO] tez-mapreduce ...................................... SKIPPED
[INFO] tez-examples ....................................... SKIPPED
[INFO] tez-dag ............................................ SKIPPED
[INFO] tez-tests .......................................... SKIPPED
[INFO] tez-ext-service-tests .............................. SKIPPED
[INFO] tez-ui ............................................. SKIPPED
[INFO] tez-plugins ........................................ SKIPPED
[INFO] tez-yarn-timeline-history .......................... SKIPPED
[INFO] tez-yarn-timeline-history-with-acls ................ SKIPPED
[INFO] tez-history-parser ................................. SKIPPED
[INFO] tez-aux-services ................................... SKIPPED
[INFO] tez-tools .......................................... SKIPPED
[INFO] tez-perf-analyzer .................................. SKIPPED
[INFO] tez-job-analyzer ................................... SKIPPED
[INFO] tez-javadoc-tools .................................. SKIPPED
[INFO] hadoop-shim-impls .................................. SKIPPED
[INFO] hadoop-shim-2.7 .................................... SKIPPED
[INFO] tez-dist ........................................... SKIPPED
[INFO] Tez ................................................ SKIPPED
[INFO] ------------------------------------------------------------------------
[INFO] BUILD FAILURE
[INFO] ------------------------------------------------------------------------
[INFO] Total time: 1.734 s
[INFO] Finished at: 2017-06-19T20:00:55Z
[INFO] Final Memory: 26M/723M
[INFO] ------------------------------------------------------------------------
[ERROR] Failed to execute goal org.apache.maven.plugins:maven-enforcer-plugin:1.4:enforce
(clean) on project tez: Some Enforcer rules have failed. Look above for specific messages
explaining why the rule failed. -> [Help 1]
[ERROR] 
[ERROR] To see the full stack trace of the errors, re-run Maven with the -e switch.
[ERROR] Re-run Maven using the -X switch to enable full debug logging.
[ERROR] 
[ERROR] For more information about the errors and possible solutions, please read the following
articles:
[ERROR] [Help 1] http://cwiki.apache.org/confluence/display/MAVEN/MojoExecutionException
Build step 'Execute shell' marked build as failure
Archiving artifacts
Recording test results
ERROR: Step ?Publish JUnit test result report? failed: No test report files were found. Configuration
error?


Mime
View raw message