tez-dev mailing list archives

Site index · List index
Message view « Date » · « Thread »
Top « Date » · « Thread »
From Apache Jenkins Server <jenk...@builds.apache.org>
Subject Build failed in Jenkins: Tez-Build #1715
Date Mon, 19 Jun 2017 23:48:48 GMT
See <https://builds.apache.org/job/Tez-Build/1715/display/redirect?page=changes>

Changes:

[jeagles] TEZ-3766. Tez Aux-services : Clean up shaded jar to not include default

------------------------------------------
[...truncated 3.68 KB...]
NODE_NAME=H7
JOB_DISPLAY_URL=https://builds.apache.org/job/Tez-Build/display/redirect
BUILD_NUMBER=1715
XDG_RUNTIME_DIR=/run/user/10021
HUDSON_COOKIE=883fa987-5e73-4989-8295-b3bf378acf9c
GIT_AUTHOR_EMAIL=builds@apache.org
_=/usr/bin/env
+ export MAVEN_OPTS=-Xmx2048m
+ MAVEN_OPTS=-Xmx2048m
+ git clean -fdx
Removing docs/target/
Removing hadoop-shim-impls/hadoop-shim-2.7/target/
Removing hadoop-shim-impls/target/
Removing hadoop-shim/target/
Removing target/
Removing tez-api/target/
Removing tez-common/target/
Removing tez-dag/target/
Removing tez-dist/target/
Removing tez-examples/target/
Removing tez-ext-service-tests/target/
Removing tez-mapreduce/target/
Removing tez-plugins/target/
Removing tez-plugins/tez-aux-services/build/
Removing tez-plugins/tez-aux-services/target/
Removing tez-plugins/tez-history-parser/target/
Removing tez-plugins/tez-yarn-timeline-history-with-acls/target/
Removing tez-plugins/tez-yarn-timeline-history/target/
Removing tez-runtime-internals/target/
Removing tez-runtime-library/outDir/
Removing tez-runtime-library/target/
Removing tez-tests/target/
Removing tez-tools/analyzers/job-analyzer/target/
Removing tez-tools/analyzers/target/
Removing tez-tools/target/
Removing tez-tools/tez-javadoc-tools/target/
Removing tez-ui/src/main/webapp/bower_components/
Removing tez-ui/src/main/webapp/dist/
Removing tez-ui/src/main/webapp/node/
Removing tez-ui/src/main/webapp/node_modules/
Removing tez-ui/src/main/webapp/tmp/
Removing tez-ui/target/
+ /home/jenkins/tools/maven/latest/bin/mvn clean test --fail-at-end -DdeployAtEnd=true deploy
package -Dtar
[INFO] Scanning for projects...
[INFO] ------------------------------------------------------------------------
[INFO] Reactor Build Order:
[INFO] 
[INFO] tez
[INFO] hadoop-shim
[INFO] tez-api
[INFO] tez-common
[INFO] tez-runtime-internals
[INFO] tez-runtime-library
[INFO] tez-mapreduce
[INFO] tez-examples
[INFO] tez-dag
[INFO] tez-tests
[INFO] tez-ext-service-tests
[INFO] tez-ui
[INFO] tez-plugins
[INFO] tez-yarn-timeline-history
[INFO] tez-yarn-timeline-history-with-acls
[INFO] tez-history-parser
[INFO] tez-aux-services
[INFO] tez-tools
[INFO] tez-perf-analyzer
[INFO] tez-job-analyzer
[INFO] tez-javadoc-tools
[INFO] hadoop-shim-impls
[INFO] hadoop-shim-2.7
[INFO] tez-dist
[INFO] Tez
[INFO] 
[INFO] ------------------------------------------------------------------------
[INFO] Building tez 0.9.0-SNAPSHOT
[INFO] ------------------------------------------------------------------------
[INFO] 
[INFO] --- maven-clean-plugin:3.0.0:clean (default-clean) @ tez ---
[INFO] 
[INFO] --- maven-enforcer-plugin:1.4:enforce (clean) @ tez ---
[WARNING] Rule 1: org.apache.maven.plugins.enforcer.RequireJavaVersion failed with message:
Detected JDK Version: 1.7.0-80 is not in the allowed range [1.8,).
[INFO] 
[INFO] ------------------------------------------------------------------------
[INFO] Skipping hadoop-shim
[INFO] This project has been banned from the build due to previous failures.
[INFO] ------------------------------------------------------------------------
[INFO] 
[INFO] ------------------------------------------------------------------------
[INFO] Skipping tez-api
[INFO] This project has been banned from the build due to previous failures.
[INFO] ------------------------------------------------------------------------
[INFO] 
[INFO] ------------------------------------------------------------------------
[INFO] Skipping tez-common
[INFO] This project has been banned from the build due to previous failures.
[INFO] ------------------------------------------------------------------------
[INFO] 
[INFO] ------------------------------------------------------------------------
[INFO] Skipping tez-runtime-internals
[INFO] This project has been banned from the build due to previous failures.
[INFO] ------------------------------------------------------------------------
[INFO] 
[INFO] ------------------------------------------------------------------------
[INFO] Skipping tez-runtime-library
[INFO] This project has been banned from the build due to previous failures.
[INFO] ------------------------------------------------------------------------
[INFO] 
[INFO] ------------------------------------------------------------------------
[INFO] Skipping tez-mapreduce
[INFO] This project has been banned from the build due to previous failures.
[INFO] ------------------------------------------------------------------------
[INFO] 
[INFO] ------------------------------------------------------------------------
[INFO] Skipping tez-examples
[INFO] This project has been banned from the build due to previous failures.
[INFO] ------------------------------------------------------------------------
[INFO] 
[INFO] ------------------------------------------------------------------------
[INFO] Skipping tez-dag
[INFO] This project has been banned from the build due to previous failures.
[INFO] ------------------------------------------------------------------------
[INFO] 
[INFO] ------------------------------------------------------------------------
[INFO] Skipping tez-tests
[INFO] This project has been banned from the build due to previous failures.
[INFO] ------------------------------------------------------------------------
[INFO] 
[INFO] ------------------------------------------------------------------------
[INFO] Skipping tez-ext-service-tests
[INFO] This project has been banned from the build due to previous failures.
[INFO] ------------------------------------------------------------------------
[INFO] 
[INFO] ------------------------------------------------------------------------
[INFO] Skipping tez-ui
[INFO] This project has been banned from the build due to previous failures.
[INFO] ------------------------------------------------------------------------
[INFO] 
[INFO] ------------------------------------------------------------------------
[INFO] Skipping tez-plugins
[INFO] This project has been banned from the build due to previous failures.
[INFO] ------------------------------------------------------------------------
[INFO] 
[INFO] ------------------------------------------------------------------------
[INFO] Skipping tez-yarn-timeline-history
[INFO] This project has been banned from the build due to previous failures.
[INFO] ------------------------------------------------------------------------
[INFO] 
[INFO] ------------------------------------------------------------------------
[INFO] Skipping tez-yarn-timeline-history-with-acls
[INFO] This project has been banned from the build due to previous failures.
[INFO] ------------------------------------------------------------------------
[INFO] 
[INFO] ------------------------------------------------------------------------
[INFO] Skipping tez-history-parser
[INFO] This project has been banned from the build due to previous failures.
[INFO] ------------------------------------------------------------------------
[INFO] 
[INFO] ------------------------------------------------------------------------
[INFO] Skipping tez-aux-services
[INFO] This project has been banned from the build due to previous failures.
[INFO] ------------------------------------------------------------------------
[INFO] 
[INFO] ------------------------------------------------------------------------
[INFO] Skipping tez-tools
[INFO] This project has been banned from the build due to previous failures.
[INFO] ------------------------------------------------------------------------
[INFO] 
[INFO] ------------------------------------------------------------------------
[INFO] Skipping tez-perf-analyzer
[INFO] This project has been banned from the build due to previous failures.
[INFO] ------------------------------------------------------------------------
[INFO] 
[INFO] ------------------------------------------------------------------------
[INFO] Skipping tez-job-analyzer
[INFO] This project has been banned from the build due to previous failures.
[INFO] ------------------------------------------------------------------------
[INFO] 
[INFO] ------------------------------------------------------------------------
[INFO] Skipping tez-javadoc-tools
[INFO] This project has been banned from the build due to previous failures.
[INFO] ------------------------------------------------------------------------
[INFO] 
[INFO] ------------------------------------------------------------------------
[INFO] Skipping hadoop-shim-impls
[INFO] This project has been banned from the build due to previous failures.
[INFO] ------------------------------------------------------------------------
[INFO] 
[INFO] ------------------------------------------------------------------------
[INFO] Skipping hadoop-shim-2.7
[INFO] This project has been banned from the build due to previous failures.
[INFO] ------------------------------------------------------------------------
[INFO] 
[INFO] ------------------------------------------------------------------------
[INFO] Skipping tez-dist
[INFO] This project has been banned from the build due to previous failures.
[INFO] ------------------------------------------------------------------------
[INFO] 
[INFO] ------------------------------------------------------------------------
[INFO] Skipping Tez
[INFO] This project has been banned from the build due to previous failures.
[INFO] ------------------------------------------------------------------------
[INFO] ------------------------------------------------------------------------
[INFO] Reactor Summary:
[INFO] 
[INFO] tez ................................................ FAILURE [  1.180 s]
[INFO] hadoop-shim ........................................ SKIPPED
[INFO] tez-api ............................................ SKIPPED
[INFO] tez-common ......................................... SKIPPED
[INFO] tez-runtime-internals .............................. SKIPPED
[INFO] tez-runtime-library ................................ SKIPPED
[INFO] tez-mapreduce ...................................... SKIPPED
[INFO] tez-examples ....................................... SKIPPED
[INFO] tez-dag ............................................ SKIPPED
[INFO] tez-tests .......................................... SKIPPED
[INFO] tez-ext-service-tests .............................. SKIPPED
[INFO] tez-ui ............................................. SKIPPED
[INFO] tez-plugins ........................................ SKIPPED
[INFO] tez-yarn-timeline-history .......................... SKIPPED
[INFO] tez-yarn-timeline-history-with-acls ................ SKIPPED
[INFO] tez-history-parser ................................. SKIPPED
[INFO] tez-aux-services ................................... SKIPPED
[INFO] tez-tools .......................................... SKIPPED
[INFO] tez-perf-analyzer .................................. SKIPPED
[INFO] tez-job-analyzer ................................... SKIPPED
[INFO] tez-javadoc-tools .................................. SKIPPED
[INFO] hadoop-shim-impls .................................. SKIPPED
[INFO] hadoop-shim-2.7 .................................... SKIPPED
[INFO] tez-dist ........................................... SKIPPED
[INFO] Tez ................................................ SKIPPED
[INFO] ------------------------------------------------------------------------
[INFO] BUILD FAILURE
[INFO] ------------------------------------------------------------------------
[INFO] Total time: 2.205 s
[INFO] Finished at: 2017-06-19T23:48:46Z
[INFO] Final Memory: 26M/723M
[INFO] ------------------------------------------------------------------------
[ERROR] Failed to execute goal org.apache.maven.plugins:maven-enforcer-plugin:1.4:enforce
(clean) on project tez: Some Enforcer rules have failed. Look above for specific messages
explaining why the rule failed. -> [Help 1]
[ERROR] 
[ERROR] To see the full stack trace of the errors, re-run Maven with the -e switch.
[ERROR] Re-run Maven using the -X switch to enable full debug logging.
[ERROR] 
[ERROR] For more information about the errors and possible solutions, please read the following
articles:
[ERROR] [Help 1] http://cwiki.apache.org/confluence/display/MAVEN/MojoExecutionException
Build step 'Execute shell' marked build as failure
Archiving artifacts
Recording test results
ERROR: Step ?Publish JUnit test result report? failed: No test report files were found. Configuration
error?


Mime
View raw message