tez-dev mailing list archives

Site index · List index
Message view « Date » · « Thread »
Top « Date » · « Thread »
From Apache Jenkins Server <jenk...@builds.apache.org>
Subject Build failed in Jenkins: Tez-Build #1732
Date Sat, 08 Jul 2017 04:05:49 GMT
See <https://builds.apache.org/job/Tez-Build/1732/display/redirect?page=changes>

Changes:

[rbalamohan] TEZ-3784. Submitting very large DAG throws

------------------------------------------
[...truncated 322.22 KB...]
[INFO] --- build-helper-maven-plugin:1.8:maven-version (maven-version) @ hadoop-shim-2.7 ---
[INFO] 
[INFO] --- maven-resources-plugin:2.6:resources (default-resources) @ hadoop-shim-2.7 ---
[INFO] Using 'UTF-8' encoding to copy filtered resources.
[INFO] Copying 1 resource
[INFO] 
[INFO] --- maven-compiler-plugin:3.1:compile (default-compile) @ hadoop-shim-2.7 ---
[INFO] Changes detected - recompiling the module!
[INFO] Compiling 2 source files to <https://builds.apache.org/job/Tez-Build/ws/hadoop-shim-impls/hadoop-shim-2.7/target/classes>
[INFO] 
[INFO] --- maven-resources-plugin:2.6:testResources (default-testResources) @ hadoop-shim-2.7
---
[INFO] Using 'UTF-8' encoding to copy filtered resources.
[INFO] skip non existing resourceDirectory <https://builds.apache.org/job/Tez-Build/ws/hadoop-shim-impls/hadoop-shim-2.7/src/test/resources>
[INFO] 
[INFO] --- maven-compiler-plugin:3.1:testCompile (default-testCompile) @ hadoop-shim-2.7 ---
[INFO] Changes detected - recompiling the module!
[INFO] Compiling 1 source file to <https://builds.apache.org/job/Tez-Build/ws/hadoop-shim-impls/hadoop-shim-2.7/target/test-classes>
[INFO] 
[INFO] --- maven-surefire-plugin:2.14.1:test (default-test) @ hadoop-shim-2.7 ---
[INFO] Surefire report directory: <https://builds.apache.org/job/Tez-Build/ws/hadoop-shim-impls/hadoop-shim-2.7/target/surefire-reports>

-------------------------------------------------------
 T E S T S
-------------------------------------------------------

-------------------------------------------------------
 T E S T S
-------------------------------------------------------
Running org.apache.tez.hadoop.shim.TestHadoop25_26_27ShimProvider
Tests run: 4, Failures: 0, Errors: 0, Skipped: 0, Time elapsed: 0.192 sec

Results :

Tests run: 4, Failures: 0, Errors: 0, Skipped: 0

[INFO] 
[INFO] --- buildnumber-maven-plugin:1.1:create (default) @ hadoop-shim-2.7 ---
[INFO] Checking for local modifications: skipped.
[INFO] Updating project files from SCM: skipped.
[INFO] Executing: /bin/sh -c cd <https://builds.apache.org/job/Tez-Build/ws/hadoop-shim-impls/hadoop-shim-2.7>
&& git rev-parse --verify HEAD
[INFO] Working directory: <https://builds.apache.org/job/Tez-Build/ws/hadoop-shim-impls/hadoop-shim-2.7>
[INFO] Storing buildNumber: 3d665f90c16ede5bea7e046a31dac00f032d9e88 at timestamp: 1499486741845
[INFO] Executing: /bin/sh -c cd <https://builds.apache.org/job/Tez-Build/ws/hadoop-shim-impls/hadoop-shim-2.7>
&& git rev-parse --verify HEAD
[INFO] Working directory: <https://builds.apache.org/job/Tez-Build/ws/hadoop-shim-impls/hadoop-shim-2.7>
[INFO] Storing buildScmBranch: UNKNOWN
[INFO] 
[INFO] --- build-helper-maven-plugin:1.8:maven-version (maven-version) @ hadoop-shim-2.7 ---
[INFO] 
[INFO] --- maven-resources-plugin:2.6:resources (default-resources) @ hadoop-shim-2.7 ---
[INFO] Using 'UTF-8' encoding to copy filtered resources.
[INFO] Copying 1 resource
[INFO] 
[INFO] --- maven-compiler-plugin:3.1:compile (default-compile) @ hadoop-shim-2.7 ---
[INFO] Nothing to compile - all classes are up to date
[INFO] 
[INFO] --- maven-resources-plugin:2.6:testResources (default-testResources) @ hadoop-shim-2.7
---
[INFO] Using 'UTF-8' encoding to copy filtered resources.
[INFO] skip non existing resourceDirectory <https://builds.apache.org/job/Tez-Build/ws/hadoop-shim-impls/hadoop-shim-2.7/src/test/resources>
[INFO] 
[INFO] --- maven-compiler-plugin:3.1:testCompile (default-testCompile) @ hadoop-shim-2.7 ---
[INFO] Nothing to compile - all classes are up to date
[INFO] 
[INFO] --- maven-surefire-plugin:2.14.1:test (default-test) @ hadoop-shim-2.7 ---
[INFO] Skipping execution of surefire because it has already been run for this configuration
[INFO] 
[INFO] --- maven-jar-plugin:2.4:jar (default-jar) @ hadoop-shim-2.7 ---
[INFO] Building jar: <https://builds.apache.org/job/Tez-Build/ws/hadoop-shim-impls/hadoop-shim-2.7/target/hadoop-shim-2.7-0.9.0-SNAPSHOT.jar>
[INFO] 
[INFO] --- maven-jar-plugin:2.4:test-jar (default) @ hadoop-shim-2.7 ---
[INFO] Building jar: <https://builds.apache.org/job/Tez-Build/ws/hadoop-shim-impls/hadoop-shim-2.7/target/hadoop-shim-2.7-0.9.0-SNAPSHOT-tests.jar>
[INFO] 
[INFO] --- maven-install-plugin:2.4:install (default-install) @ hadoop-shim-2.7 ---
[INFO] Installing <https://builds.apache.org/job/Tez-Build/ws/hadoop-shim-impls/hadoop-shim-2.7/target/hadoop-shim-2.7-0.9.0-SNAPSHOT.jar>
to /home/jenkins/.m2/repository/org/apache/tez/hadoop-shim-2.7/0.9.0-SNAPSHOT/hadoop-shim-2.7-0.9.0-SNAPSHOT.jar
[INFO] Installing <https://builds.apache.org/job/Tez-Build/ws/hadoop-shim-impls/hadoop-shim-2.7/pom.xml>
to /home/jenkins/.m2/repository/org/apache/tez/hadoop-shim-2.7/0.9.0-SNAPSHOT/hadoop-shim-2.7-0.9.0-SNAPSHOT.pom
[INFO] Installing <https://builds.apache.org/job/Tez-Build/ws/hadoop-shim-impls/hadoop-shim-2.7/target/hadoop-shim-2.7-0.9.0-SNAPSHOT-tests.jar>
to /home/jenkins/.m2/repository/org/apache/tez/hadoop-shim-2.7/0.9.0-SNAPSHOT/hadoop-shim-2.7-0.9.0-SNAPSHOT-tests.jar
[INFO] 
[INFO] --- maven-deploy-plugin:2.8.1:deploy (default-deploy) @ hadoop-shim-2.7 ---
[INFO] Deploying org.apache.tez:hadoop-shim-2.7:0.9.0-SNAPSHOT at end
[INFO] 
[INFO] --- buildnumber-maven-plugin:1.1:create (default) @ hadoop-shim-2.7 ---
[INFO] Checking for local modifications: skipped.
[INFO] Updating project files from SCM: skipped.
[INFO] Executing: /bin/sh -c cd <https://builds.apache.org/job/Tez-Build/ws/hadoop-shim-impls/hadoop-shim-2.7>
&& git rev-parse --verify HEAD
[INFO] Working directory: <https://builds.apache.org/job/Tez-Build/ws/hadoop-shim-impls/hadoop-shim-2.7>
[INFO] Storing buildNumber: 3d665f90c16ede5bea7e046a31dac00f032d9e88 at timestamp: 1499486741887
[INFO] Executing: /bin/sh -c cd <https://builds.apache.org/job/Tez-Build/ws/hadoop-shim-impls/hadoop-shim-2.7>
&& git rev-parse --verify HEAD
[INFO] Working directory: <https://builds.apache.org/job/Tez-Build/ws/hadoop-shim-impls/hadoop-shim-2.7>
[INFO] Storing buildScmBranch: UNKNOWN
[INFO] 
[INFO] --- build-helper-maven-plugin:1.8:maven-version (maven-version) @ hadoop-shim-2.7 ---
[INFO] 
[INFO] --- maven-resources-plugin:2.6:resources (default-resources) @ hadoop-shim-2.7 ---
[INFO] Using 'UTF-8' encoding to copy filtered resources.
[INFO] Copying 1 resource
[INFO] 
[INFO] --- maven-compiler-plugin:3.1:compile (default-compile) @ hadoop-shim-2.7 ---
[INFO] Nothing to compile - all classes are up to date
[INFO] 
[INFO] --- maven-resources-plugin:2.6:testResources (default-testResources) @ hadoop-shim-2.7
---
[INFO] Using 'UTF-8' encoding to copy filtered resources.
[INFO] skip non existing resourceDirectory <https://builds.apache.org/job/Tez-Build/ws/hadoop-shim-impls/hadoop-shim-2.7/src/test/resources>
[INFO] 
[INFO] --- maven-compiler-plugin:3.1:testCompile (default-testCompile) @ hadoop-shim-2.7 ---
[INFO] Nothing to compile - all classes are up to date
[INFO] 
[INFO] --- maven-surefire-plugin:2.14.1:test (default-test) @ hadoop-shim-2.7 ---
[INFO] Skipping execution of surefire because it has already been run for this configuration
[INFO] 
[INFO] --- maven-jar-plugin:2.4:jar (default-jar) @ hadoop-shim-2.7 ---
[INFO] 
[INFO] --- maven-jar-plugin:2.4:test-jar (default) @ hadoop-shim-2.7 ---
[INFO] 
[INFO] ------------------------------------------------------------------------
[INFO] Building tez-dist 0.9.0-SNAPSHOT
[INFO] ------------------------------------------------------------------------
[INFO] 
[INFO] --- maven-clean-plugin:3.0.0:clean (default-clean) @ tez-dist ---
[INFO] 
[INFO] --- buildnumber-maven-plugin:1.1:create (default) @ tez-dist ---
[INFO] Checking for local modifications: skipped.
[INFO] Updating project files from SCM: skipped.
[INFO] Executing: /bin/sh -c cd <https://builds.apache.org/job/Tez-Build/ws/tez-dist>
&& git rev-parse --verify HEAD
[INFO] Working directory: <https://builds.apache.org/job/Tez-Build/ws/tez-dist>
[INFO] Storing buildNumber: 3d665f90c16ede5bea7e046a31dac00f032d9e88 at timestamp: 1499486741925
[INFO] Executing: /bin/sh -c cd <https://builds.apache.org/job/Tez-Build/ws/tez-dist>
&& git rev-parse --verify HEAD
[INFO] Working directory: <https://builds.apache.org/job/Tez-Build/ws/tez-dist>
[INFO] Storing buildScmBranch: UNKNOWN
[INFO] 
[INFO] --- build-helper-maven-plugin:1.8:maven-version (maven-version) @ tez-dist ---
[INFO] 
[INFO] --- buildnumber-maven-plugin:1.1:create (default) @ tez-dist ---
[INFO] Checking for local modifications: skipped.
[INFO] Updating project files from SCM: skipped.
[INFO] Executing: /bin/sh -c cd <https://builds.apache.org/job/Tez-Build/ws/tez-dist>
&& git rev-parse --verify HEAD
[INFO] Working directory: <https://builds.apache.org/job/Tez-Build/ws/tez-dist>
[INFO] Storing buildNumber: 3d665f90c16ede5bea7e046a31dac00f032d9e88 at timestamp: 1499486741933
[INFO] Executing: /bin/sh -c cd <https://builds.apache.org/job/Tez-Build/ws/tez-dist>
&& git rev-parse --verify HEAD
[INFO] Working directory: <https://builds.apache.org/job/Tez-Build/ws/tez-dist>
[INFO] Storing buildScmBranch: UNKNOWN
[INFO] 
[INFO] --- build-helper-maven-plugin:1.8:maven-version (maven-version) @ tez-dist ---
[INFO] 
[INFO] --- maven-assembly-plugin:2.4:single (package-tez) @ tez-dist ---
[INFO] Reading assembly descriptor: src/main/assembly/tez-dist.xml
[INFO] 
[INFO] ------------------------------------------------------------------------
[INFO] Building Tez 0.9.0-SNAPSHOT
[INFO] ------------------------------------------------------------------------
[INFO] 
[INFO] --- maven-clean-plugin:3.0.0:clean (default-clean) @ tez-docs ---
[INFO] 
[INFO] --- buildnumber-maven-plugin:1.1:create (default) @ tez-docs ---
[INFO] Checking for local modifications: skipped.
[INFO] Updating project files from SCM: skipped.
[INFO] Executing: /bin/sh -c cd <https://builds.apache.org/job/Tez-Build/ws/docs> &&
git rev-parse --verify HEAD
[INFO] Working directory: <https://builds.apache.org/job/Tez-Build/ws/docs>
[INFO] Storing buildNumber: 3d665f90c16ede5bea7e046a31dac00f032d9e88 at timestamp: 1499486742403
[INFO] Executing: /bin/sh -c cd <https://builds.apache.org/job/Tez-Build/ws/docs> &&
git rev-parse --verify HEAD
[INFO] Working directory: <https://builds.apache.org/job/Tez-Build/ws/docs>
[INFO] Storing buildScmBranch: UNKNOWN
[INFO] 
[INFO] --- build-helper-maven-plugin:1.8:maven-version (maven-version) @ tez-docs ---
[INFO] 
[INFO] --- buildnumber-maven-plugin:1.1:create (default) @ tez-docs ---
[INFO] Checking for local modifications: skipped.
[INFO] Updating project files from SCM: skipped.
[INFO] Executing: /bin/sh -c cd <https://builds.apache.org/job/Tez-Build/ws/docs> &&
git rev-parse --verify HEAD
[INFO] Working directory: <https://builds.apache.org/job/Tez-Build/ws/docs>
[INFO] Storing buildNumber: 3d665f90c16ede5bea7e046a31dac00f032d9e88 at timestamp: 1499486742410
[INFO] Executing: /bin/sh -c cd <https://builds.apache.org/job/Tez-Build/ws/docs> &&
git rev-parse --verify HEAD
[INFO] Working directory: <https://builds.apache.org/job/Tez-Build/ws/docs>
[INFO] Storing buildScmBranch: UNKNOWN
[INFO] 
[INFO] --- build-helper-maven-plugin:1.8:maven-version (maven-version) @ tez-docs ---
[INFO] 
[INFO] --- maven-jar-plugin:2.4:test-jar (default) @ tez-docs ---
[WARNING] JAR will be empty - no content was marked for inclusion!
[INFO] Building jar: <https://builds.apache.org/job/Tez-Build/ws/docs/target/tez-docs-0.9.0-SNAPSHOT-tests.jar>
[INFO] 
[INFO] --- maven-install-plugin:2.4:install (default-install) @ tez-docs ---
[INFO] Installing <https://builds.apache.org/job/Tez-Build/ws/docs/pom.xml> to /home/jenkins/.m2/repository/org/apache/tez/tez-docs/0.9.0-SNAPSHOT/tez-docs-0.9.0-SNAPSHOT.pom
[INFO] Installing <https://builds.apache.org/job/Tez-Build/ws/docs/target/tez-docs-0.9.0-SNAPSHOT-tests.jar>
to /home/jenkins/.m2/repository/org/apache/tez/tez-docs/0.9.0-SNAPSHOT/tez-docs-0.9.0-SNAPSHOT-tests.jar
[INFO] 
[INFO] --- maven-deploy-plugin:2.8.1:deploy (default-deploy) @ tez-docs ---
[INFO] Skipping artifact deployment
[INFO] 
[INFO] --- buildnumber-maven-plugin:1.1:create (default) @ tez-docs ---
[INFO] Checking for local modifications: skipped.
[INFO] Updating project files from SCM: skipped.
[INFO] Executing: /bin/sh -c cd <https://builds.apache.org/job/Tez-Build/ws/docs> &&
git rev-parse --verify HEAD
[INFO] Working directory: <https://builds.apache.org/job/Tez-Build/ws/docs>
[INFO] Storing buildNumber: 3d665f90c16ede5bea7e046a31dac00f032d9e88 at timestamp: 1499486742429
[INFO] Executing: /bin/sh -c cd <https://builds.apache.org/job/Tez-Build/ws/docs> &&
git rev-parse --verify HEAD
[INFO] Working directory: <https://builds.apache.org/job/Tez-Build/ws/docs>
[INFO] Storing buildScmBranch: UNKNOWN
[INFO] 
[INFO] --- build-helper-maven-plugin:1.8:maven-version (maven-version) @ tez-docs ---
[INFO] 
[INFO] --- maven-jar-plugin:2.4:test-jar (default) @ tez-docs ---
[WARNING] JAR will be empty - no content was marked for inclusion!
[INFO] ------------------------------------------------------------------------
[INFO] Reactor Summary:
[INFO] 
[INFO] tez ................................................ SUCCESS [  1.785 s]
[INFO] hadoop-shim ........................................ SUCCESS [  2.484 s]
[INFO] tez-api ............................................ SUCCESS [01:24 min]
[INFO] tez-common ......................................... SUCCESS [  5.912 s]
[INFO] tez-runtime-internals .............................. SUCCESS [ 22.424 s]
[INFO] tez-runtime-library ................................ SUCCESS [03:02 min]
[INFO] tez-mapreduce ...................................... SUCCESS [ 41.338 s]
[INFO] tez-examples ....................................... SUCCESS [  0.269 s]
[INFO] tez-dag ............................................ SUCCESS [02:53 min]
[INFO] tez-tests .......................................... SUCCESS [31:05 min]
[INFO] tez-ext-service-tests .............................. SUCCESS [02:58 min]
[INFO] tez-ui ............................................. FAILURE [02:56 min]
[INFO] tez-plugins ........................................ SUCCESS [  0.084 s]
[INFO] tez-yarn-timeline-history .......................... SUCCESS [01:05 min]
[INFO] tez-yarn-timeline-history-with-acls ................ SUCCESS [01:21 min]
[INFO] tez-history-parser ................................. SUCCESS [02:12 min]
[INFO] tez-aux-services ................................... SUCCESS [02:10 min]
[INFO] tez-tools .......................................... SUCCESS [  0.057 s]
[INFO] tez-perf-analyzer .................................. SUCCESS [  0.055 s]
[INFO] tez-job-analyzer ................................... SUCCESS [01:59 min]
[INFO] tez-javadoc-tools .................................. SUCCESS [  0.202 s]
[INFO] hadoop-shim-impls .................................. SUCCESS [  0.074 s]
[INFO] hadoop-shim-2.7 .................................... SUCCESS [  0.628 s]
[INFO] tez-dist ........................................... FAILURE [  0.492 s]
[INFO] Tez ................................................ SUCCESS [  0.037 s]
[INFO] ------------------------------------------------------------------------
[INFO] BUILD FAILURE
[INFO] ------------------------------------------------------------------------
[INFO] Total time: 54:28 min
[INFO] Finished at: 2017-07-08T04:05:42Z
[INFO] Final Memory: 69M/1084M
[INFO] ------------------------------------------------------------------------
[ERROR] Failed to execute goal org.codehaus.mojo:exec-maven-plugin:1.3.2:exec (ember test)
on project tez-ui: Command execution failed.: Process exited with an error: 1 (Exit value:
1) -> [Help 1]
[ERROR] Failed to execute goal org.apache.maven.plugins:maven-assembly-plugin:2.4:single (package-tez)
on project tez-dist: Failed to create assembly: Error adding file 'org.apache.tez:tez-ui:war:0.9.0-SNAPSHOT'
to archive: <https://builds.apache.org/job/Tez-Build/ws/tez-ui/target/classes> isn't
a file. -> [Help 1]
[ERROR] 
[ERROR] To see the full stack trace of the errors, re-run Maven with the -e switch.
[ERROR] Re-run Maven using the -X switch to enable full debug logging.
[ERROR] 
[ERROR] For more information about the errors and possible solutions, please read the following
articles:
[ERROR] [Help 1] http://cwiki.apache.org/confluence/display/MAVEN/MojoExecutionException
[ERROR] 
[ERROR] After correcting the problems, you can resume the build with the command
[ERROR]   mvn <goals> -rf :tez-ui
Build step 'Execute shell' marked build as failure
Archiving artifacts
Recording test results

Mime
View raw message