tez-dev mailing list archives

Site index · List index
Message view « Date » · « Thread »
Top « Date » · « Thread »
From Apache Jenkins Server <jenk...@builds.apache.org>
Subject Build failed in Jenkins: Tez-Build #1759
Date Thu, 14 Sep 2017 22:03:00 GMT
See <https://builds.apache.org/job/Tez-Build/1759/display/redirect?page=changes>

Changes:

[kshukla] TEZ-3832. TEZ DAG status shows SUCCEEDED for SUCCEEDED_WITH_FAILURES

------------------------------------------
[...truncated 435.74 KB...]
[INFO] Storing buildNumber: 0033da85d4ccc856c699935d13dd617cf817d955 at timestamp: 1505426575705
[INFO] Executing: /bin/sh -c cd <https://builds.apache.org/job/Tez-Build/ws/hadoop-shim-impls>
&& git rev-parse --verify HEAD
[INFO] Working directory: <https://builds.apache.org/job/Tez-Build/ws/hadoop-shim-impls>
[INFO] Storing buildScmBranch: UNKNOWN
[INFO] 
[INFO] --- build-helper-maven-plugin:1.8:maven-version (maven-version) @ hadoop-shim-impls
---
[INFO] 
[INFO] --- maven-jar-plugin:2.4:test-jar (default) @ hadoop-shim-impls ---
[WARNING] JAR will be empty - no content was marked for inclusion!
[INFO] 
[INFO] ------------------------------------------------------------------------
[INFO] Building hadoop-shim-2.7 0.9.1-SNAPSHOT
[INFO] ------------------------------------------------------------------------
[INFO] 
[INFO] --- maven-clean-plugin:3.0.0:clean (default-clean) @ hadoop-shim-2.7 ---
[INFO] 
[INFO] --- buildnumber-maven-plugin:1.1:create (default) @ hadoop-shim-2.7 ---
[INFO] Checking for local modifications: skipped.
[INFO] Updating project files from SCM: skipped.
[INFO] Executing: /bin/sh -c cd <https://builds.apache.org/job/Tez-Build/ws/hadoop-shim-impls/hadoop-shim-2.7>
&& git rev-parse --verify HEAD
[INFO] Working directory: <https://builds.apache.org/job/Tez-Build/ws/hadoop-shim-impls/hadoop-shim-2.7>
[INFO] Storing buildNumber: 0033da85d4ccc856c699935d13dd617cf817d955 at timestamp: 1505426575738
[INFO] Executing: /bin/sh -c cd <https://builds.apache.org/job/Tez-Build/ws/hadoop-shim-impls/hadoop-shim-2.7>
&& git rev-parse --verify HEAD
[INFO] Working directory: <https://builds.apache.org/job/Tez-Build/ws/hadoop-shim-impls/hadoop-shim-2.7>
[INFO] Storing buildScmBranch: UNKNOWN
[INFO] 
[INFO] --- build-helper-maven-plugin:1.8:maven-version (maven-version) @ hadoop-shim-2.7 ---
[INFO] 
[INFO] --- maven-resources-plugin:2.6:resources (default-resources) @ hadoop-shim-2.7 ---
[INFO] Using 'UTF-8' encoding to copy filtered resources.
[INFO] Copying 1 resource
[INFO] 
[INFO] --- maven-compiler-plugin:3.1:compile (default-compile) @ hadoop-shim-2.7 ---
[INFO] Changes detected - recompiling the module!
[INFO] Compiling 2 source files to <https://builds.apache.org/job/Tez-Build/ws/hadoop-shim-impls/hadoop-shim-2.7/target/classes>
[INFO] 
[INFO] --- maven-resources-plugin:2.6:testResources (default-testResources) @ hadoop-shim-2.7
---
[INFO] Using 'UTF-8' encoding to copy filtered resources.
[INFO] skip non existing resourceDirectory <https://builds.apache.org/job/Tez-Build/ws/hadoop-shim-impls/hadoop-shim-2.7/src/test/resources>
[INFO] 
[INFO] --- maven-compiler-plugin:3.1:testCompile (default-testCompile) @ hadoop-shim-2.7 ---
[INFO] Changes detected - recompiling the module!
[INFO] Compiling 1 source file to <https://builds.apache.org/job/Tez-Build/ws/hadoop-shim-impls/hadoop-shim-2.7/target/test-classes>
[INFO] 
[INFO] --- maven-surefire-plugin:2.14.1:test (default-test) @ hadoop-shim-2.7 ---
[INFO] Surefire report directory: <https://builds.apache.org/job/Tez-Build/ws/hadoop-shim-impls/hadoop-shim-2.7/target/surefire-reports>

-------------------------------------------------------
 T E S T S
-------------------------------------------------------

-------------------------------------------------------
 T E S T S
-------------------------------------------------------
Running org.apache.tez.hadoop.shim.TestHadoop25_26_27ShimProvider
Tests run: 4, Failures: 0, Errors: 0, Skipped: 0, Time elapsed: 0.178 sec

Results :

Tests run: 4, Failures: 0, Errors: 0, Skipped: 0

[INFO] 
[INFO] --- buildnumber-maven-plugin:1.1:create (default) @ hadoop-shim-2.7 ---
[INFO] Checking for local modifications: skipped.
[INFO] Updating project files from SCM: skipped.
[INFO] Executing: /bin/sh -c cd <https://builds.apache.org/job/Tez-Build/ws/hadoop-shim-impls/hadoop-shim-2.7>
&& git rev-parse --verify HEAD
[INFO] Working directory: <https://builds.apache.org/job/Tez-Build/ws/hadoop-shim-impls/hadoop-shim-2.7>
[INFO] Storing buildNumber: 0033da85d4ccc856c699935d13dd617cf817d955 at timestamp: 1505426576297
[INFO] Executing: /bin/sh -c cd <https://builds.apache.org/job/Tez-Build/ws/hadoop-shim-impls/hadoop-shim-2.7>
&& git rev-parse --verify HEAD
[INFO] Working directory: <https://builds.apache.org/job/Tez-Build/ws/hadoop-shim-impls/hadoop-shim-2.7>
[INFO] Storing buildScmBranch: UNKNOWN
[INFO] 
[INFO] --- build-helper-maven-plugin:1.8:maven-version (maven-version) @ hadoop-shim-2.7 ---
[INFO] 
[INFO] --- maven-resources-plugin:2.6:resources (default-resources) @ hadoop-shim-2.7 ---
[INFO] Using 'UTF-8' encoding to copy filtered resources.
[INFO] Copying 1 resource
[INFO] 
[INFO] --- maven-compiler-plugin:3.1:compile (default-compile) @ hadoop-shim-2.7 ---
[INFO] Nothing to compile - all classes are up to date
[INFO] 
[INFO] --- maven-resources-plugin:2.6:testResources (default-testResources) @ hadoop-shim-2.7
---
[INFO] Using 'UTF-8' encoding to copy filtered resources.
[INFO] skip non existing resourceDirectory <https://builds.apache.org/job/Tez-Build/ws/hadoop-shim-impls/hadoop-shim-2.7/src/test/resources>
[INFO] 
[INFO] --- maven-compiler-plugin:3.1:testCompile (default-testCompile) @ hadoop-shim-2.7 ---
[INFO] Nothing to compile - all classes are up to date
[INFO] 
[INFO] --- maven-surefire-plugin:2.14.1:test (default-test) @ hadoop-shim-2.7 ---
[INFO] Skipping execution of surefire because it has already been run for this configuration
[INFO] 
[INFO] --- maven-jar-plugin:2.4:jar (default-jar) @ hadoop-shim-2.7 ---
[INFO] Building jar: <https://builds.apache.org/job/Tez-Build/ws/hadoop-shim-impls/hadoop-shim-2.7/target/hadoop-shim-2.7-0.9.1-SNAPSHOT.jar>
[INFO] 
[INFO] --- maven-jar-plugin:2.4:test-jar (default) @ hadoop-shim-2.7 ---
[INFO] Building jar: <https://builds.apache.org/job/Tez-Build/ws/hadoop-shim-impls/hadoop-shim-2.7/target/hadoop-shim-2.7-0.9.1-SNAPSHOT-tests.jar>
[INFO] 
[INFO] --- maven-install-plugin:2.4:install (default-install) @ hadoop-shim-2.7 ---
[INFO] Installing <https://builds.apache.org/job/Tez-Build/ws/hadoop-shim-impls/hadoop-shim-2.7/target/hadoop-shim-2.7-0.9.1-SNAPSHOT.jar>
to /home/jenkins/.m2/repository/org/apache/tez/hadoop-shim-2.7/0.9.1-SNAPSHOT/hadoop-shim-2.7-0.9.1-SNAPSHOT.jar
[INFO] Installing <https://builds.apache.org/job/Tez-Build/ws/hadoop-shim-impls/hadoop-shim-2.7/pom.xml>
to /home/jenkins/.m2/repository/org/apache/tez/hadoop-shim-2.7/0.9.1-SNAPSHOT/hadoop-shim-2.7-0.9.1-SNAPSHOT.pom
[INFO] Installing <https://builds.apache.org/job/Tez-Build/ws/hadoop-shim-impls/hadoop-shim-2.7/target/hadoop-shim-2.7-0.9.1-SNAPSHOT-tests.jar>
to /home/jenkins/.m2/repository/org/apache/tez/hadoop-shim-2.7/0.9.1-SNAPSHOT/hadoop-shim-2.7-0.9.1-SNAPSHOT-tests.jar
[INFO] 
[INFO] --- maven-deploy-plugin:2.8.1:deploy (default-deploy) @ hadoop-shim-2.7 ---
[INFO] Deploying org.apache.tez:hadoop-shim-2.7:0.9.1-SNAPSHOT at end
[INFO] 
[INFO] --- buildnumber-maven-plugin:1.1:create (default) @ hadoop-shim-2.7 ---
[INFO] Checking for local modifications: skipped.
[INFO] Updating project files from SCM: skipped.
[INFO] Executing: /bin/sh -c cd <https://builds.apache.org/job/Tez-Build/ws/hadoop-shim-impls/hadoop-shim-2.7>
&& git rev-parse --verify HEAD
[INFO] Working directory: <https://builds.apache.org/job/Tez-Build/ws/hadoop-shim-impls/hadoop-shim-2.7>
[INFO] Storing buildNumber: 0033da85d4ccc856c699935d13dd617cf817d955 at timestamp: 1505426576378
[INFO] Executing: /bin/sh -c cd <https://builds.apache.org/job/Tez-Build/ws/hadoop-shim-impls/hadoop-shim-2.7>
&& git rev-parse --verify HEAD
[INFO] Working directory: <https://builds.apache.org/job/Tez-Build/ws/hadoop-shim-impls/hadoop-shim-2.7>
[INFO] Storing buildScmBranch: UNKNOWN
[INFO] 
[INFO] --- build-helper-maven-plugin:1.8:maven-version (maven-version) @ hadoop-shim-2.7 ---
[INFO] 
[INFO] --- maven-resources-plugin:2.6:resources (default-resources) @ hadoop-shim-2.7 ---
[INFO] Using 'UTF-8' encoding to copy filtered resources.
[INFO] Copying 1 resource
[INFO] 
[INFO] --- maven-compiler-plugin:3.1:compile (default-compile) @ hadoop-shim-2.7 ---
[INFO] Nothing to compile - all classes are up to date
[INFO] 
[INFO] --- maven-resources-plugin:2.6:testResources (default-testResources) @ hadoop-shim-2.7
---
[INFO] Using 'UTF-8' encoding to copy filtered resources.
[INFO] skip non existing resourceDirectory <https://builds.apache.org/job/Tez-Build/ws/hadoop-shim-impls/hadoop-shim-2.7/src/test/resources>
[INFO] 
[INFO] --- maven-compiler-plugin:3.1:testCompile (default-testCompile) @ hadoop-shim-2.7 ---
[INFO] Nothing to compile - all classes are up to date
[INFO] 
[INFO] --- maven-surefire-plugin:2.14.1:test (default-test) @ hadoop-shim-2.7 ---
[INFO] Skipping execution of surefire because it has already been run for this configuration
[INFO] 
[INFO] --- maven-jar-plugin:2.4:jar (default-jar) @ hadoop-shim-2.7 ---
[INFO] 
[INFO] --- maven-jar-plugin:2.4:test-jar (default) @ hadoop-shim-2.7 ---
[INFO] 
[INFO] ------------------------------------------------------------------------
[INFO] Skipping tez-dist
[INFO] This project has been banned from the build due to previous failures.
[INFO] ------------------------------------------------------------------------
[INFO] 
[INFO] ------------------------------------------------------------------------
[INFO] Building Tez 0.9.1-SNAPSHOT
[INFO] ------------------------------------------------------------------------
[INFO] 
[INFO] --- maven-clean-plugin:3.0.0:clean (default-clean) @ tez-docs ---
[INFO] 
[INFO] --- buildnumber-maven-plugin:1.1:create (default) @ tez-docs ---
[INFO] Checking for local modifications: skipped.
[INFO] Updating project files from SCM: skipped.
[INFO] Executing: /bin/sh -c cd <https://builds.apache.org/job/Tez-Build/ws/docs> &&
git rev-parse --verify HEAD
[INFO] Working directory: <https://builds.apache.org/job/Tez-Build/ws/docs>
[INFO] Storing buildNumber: 0033da85d4ccc856c699935d13dd617cf817d955 at timestamp: 1505426576400
[INFO] Executing: /bin/sh -c cd <https://builds.apache.org/job/Tez-Build/ws/docs> &&
git rev-parse --verify HEAD
[INFO] Working directory: <https://builds.apache.org/job/Tez-Build/ws/docs>
[INFO] Storing buildScmBranch: UNKNOWN
[INFO] 
[INFO] --- build-helper-maven-plugin:1.8:maven-version (maven-version) @ tez-docs ---
[INFO] 
[INFO] --- buildnumber-maven-plugin:1.1:create (default) @ tez-docs ---
[INFO] Checking for local modifications: skipped.
[INFO] Updating project files from SCM: skipped.
[INFO] Executing: /bin/sh -c cd <https://builds.apache.org/job/Tez-Build/ws/docs> &&
git rev-parse --verify HEAD
[INFO] Working directory: <https://builds.apache.org/job/Tez-Build/ws/docs>
[INFO] Storing buildNumber: 0033da85d4ccc856c699935d13dd617cf817d955 at timestamp: 1505426576408
[INFO] Executing: /bin/sh -c cd <https://builds.apache.org/job/Tez-Build/ws/docs> &&
git rev-parse --verify HEAD
[INFO] Working directory: <https://builds.apache.org/job/Tez-Build/ws/docs>
[INFO] Storing buildScmBranch: UNKNOWN
[INFO] 
[INFO] --- build-helper-maven-plugin:1.8:maven-version (maven-version) @ tez-docs ---
[INFO] 
[INFO] --- maven-jar-plugin:2.4:test-jar (default) @ tez-docs ---
[WARNING] JAR will be empty - no content was marked for inclusion!
[INFO] Building jar: <https://builds.apache.org/job/Tez-Build/ws/docs/target/tez-docs-0.9.1-SNAPSHOT-tests.jar>
[INFO] 
[INFO] --- maven-install-plugin:2.4:install (default-install) @ tez-docs ---
[INFO] Installing <https://builds.apache.org/job/Tez-Build/ws/docs/pom.xml> to /home/jenkins/.m2/repository/org/apache/tez/tez-docs/0.9.1-SNAPSHOT/tez-docs-0.9.1-SNAPSHOT.pom
[INFO] Installing <https://builds.apache.org/job/Tez-Build/ws/docs/target/tez-docs-0.9.1-SNAPSHOT-tests.jar>
to /home/jenkins/.m2/repository/org/apache/tez/tez-docs/0.9.1-SNAPSHOT/tez-docs-0.9.1-SNAPSHOT-tests.jar
[INFO] 
[INFO] --- maven-deploy-plugin:2.8.1:deploy (default-deploy) @ tez-docs ---
[INFO] Skipping artifact deployment
[INFO] 
[INFO] --- buildnumber-maven-plugin:1.1:create (default) @ tez-docs ---
[INFO] Checking for local modifications: skipped.
[INFO] Updating project files from SCM: skipped.
[INFO] Executing: /bin/sh -c cd <https://builds.apache.org/job/Tez-Build/ws/docs> &&
git rev-parse --verify HEAD
[INFO] Working directory: <https://builds.apache.org/job/Tez-Build/ws/docs>
[INFO] Storing buildNumber: 0033da85d4ccc856c699935d13dd617cf817d955 at timestamp: 1505426576428
[INFO] Executing: /bin/sh -c cd <https://builds.apache.org/job/Tez-Build/ws/docs> &&
git rev-parse --verify HEAD
[INFO] Working directory: <https://builds.apache.org/job/Tez-Build/ws/docs>
[INFO] Storing buildScmBranch: UNKNOWN
[INFO] 
[INFO] --- build-helper-maven-plugin:1.8:maven-version (maven-version) @ tez-docs ---
[INFO] 
[INFO] --- maven-jar-plugin:2.4:test-jar (default) @ tez-docs ---
[WARNING] JAR will be empty - no content was marked for inclusion!
[INFO] ------------------------------------------------------------------------
[INFO] Reactor Summary:
[INFO] 
[INFO] tez ................................................ SUCCESS [  2.333 s]
[INFO] hadoop-shim ........................................ SUCCESS [  2.861 s]
[INFO] tez-api ............................................ SUCCESS [01:24 min]
[INFO] tez-common ......................................... SUCCESS [  6.102 s]
[INFO] tez-runtime-internals .............................. SUCCESS [ 22.296 s]
[INFO] tez-runtime-library ................................ SUCCESS [03:12 min]
[INFO] tez-mapreduce ...................................... SUCCESS [ 42.569 s]
[INFO] tez-examples ....................................... SUCCESS [  0.294 s]
[INFO] tez-dag ............................................ SUCCESS [03:06 min]
[INFO] tez-tests .......................................... FAILURE [28:46 min]
[INFO] tez-ext-service-tests .............................. SKIPPED
[INFO] tez-ui ............................................. SUCCESS [06:36 min]
[INFO] tez-plugins ........................................ SUCCESS [  0.128 s]
[INFO] tez-yarn-timeline-history .......................... SKIPPED
[INFO] tez-yarn-timeline-history-with-acls ................ SKIPPED
[INFO] tez-history-parser ................................. SKIPPED
[INFO] tez-aux-services ................................... SKIPPED
[INFO] tez-tools .......................................... SUCCESS [  0.085 s]
[INFO] tez-perf-analyzer .................................. SUCCESS [  0.058 s]
[INFO] tez-job-analyzer ................................... SKIPPED
[INFO] tez-javadoc-tools .................................. SUCCESS [  0.215 s]
[INFO] hadoop-shim-impls .................................. SUCCESS [  0.065 s]
[INFO] hadoop-shim-2.7 .................................... SUCCESS [  0.680 s]
[INFO] tez-dist ........................................... SKIPPED
[INFO] Tez ................................................ SUCCESS [  0.040 s]
[INFO] ------------------------------------------------------------------------
[INFO] BUILD FAILURE
[INFO] ------------------------------------------------------------------------
[INFO] Total time: 44:25 min
[INFO] Finished at: 2017-09-14T22:02:56Z
[INFO] Final Memory: 58M/1011M
[INFO] ------------------------------------------------------------------------
[ERROR] Failed to execute goal org.apache.maven.plugins:maven-surefire-plugin:2.14.1:test
(default-test) on project tez-tests: There are test failures.
[ERROR] 
[ERROR] Please refer to <https://builds.apache.org/job/Tez-Build/ws/tez-tests/target/surefire-reports>
for the individual test results.
[ERROR] -> [Help 1]
[ERROR] 
[ERROR] To see the full stack trace of the errors, re-run Maven with the -e switch.
[ERROR] Re-run Maven using the -X switch to enable full debug logging.
[ERROR] 
[ERROR] For more information about the errors and possible solutions, please read the following
articles:
[ERROR] [Help 1] http://cwiki.apache.org/confluence/display/MAVEN/MojoFailureException
[ERROR] 
[ERROR] After correcting the problems, you can resume the build with the command
[ERROR]   mvn <goals> -rf :tez-tests
Build step 'Execute shell' marked build as failure
Archiving artifacts
Recording test results

Mime
View raw message