tez-dev mailing list archives

Site index · List index
Message view « Date » · « Thread »
Top « Date » · « Thread »
From Siddharth Seth <ss...@apache.org>
Subject Re: Build failed in Jenkins: Tez-Build #1801
Date Mon, 26 Feb 2018 19:17:01 GMT
Try again. The Assigned nodes seemed to have gone away. Have added them
back.

On Thu, Feb 22, 2018 at 6:08 PM, Eric Wohlstadter <wohlstad@cs.ubc.ca>
wrote:

> Looks like Tez builds are running into the protoc version problem again:
> https://issues.apache.org/jira/browse/INFRA-13506
>
> Does anyone know how to fix this?
>
> On Thu, Feb 22, 2018 at 1:32 PM, Apache Jenkins Server <
> jenkins@builds.apache.org> wrote:
>
> > See <https://builds.apache.org/job/Tez-Build/1801/display/
> > redirect?page=changes>
> >
> > Changes:
> >
> > [gopalv] TEZ-3888: Update Jetty to org.eclipse.jetty 9.x (Eric
> Wohlstadter,
> >
> > ------------------------------------------
> > [...truncated 337.20 KB...]
> > [INFO] Updating project files from SCM: skipped.
> > [INFO] Executing: /bin/sh -c cd <https://builds.apache.org/
> > job/Tez-Build/ws/hadoop-shim-impls> && git rev-parse --verify HEAD
> > [INFO] Working directory: <https://builds.apache.org/
> > job/Tez-Build/ws/hadoop-shim-impls>
> > [INFO] Storing buildNumber: bb40cf5b8a49833e13760a0ffe566092eb464d88 at
> > timestamp: 1519335129156
> > [INFO] Executing: /bin/sh -c cd <https://builds.apache.org/
> > job/Tez-Build/ws/hadoop-shim-impls> && git rev-parse --verify HEAD
> > [INFO] Working directory: <https://builds.apache.org/
> > job/Tez-Build/ws/hadoop-shim-impls>
> > [INFO] Storing buildScmBranch: UNKNOWN
> > [INFO]
> > [INFO] --- build-helper-maven-plugin:1.8:maven-version (maven-version) @
> > hadoop-shim-impls ---
> > [INFO]
> > [INFO] --- maven-jar-plugin:2.4:test-jar (default) @ hadoop-shim-impls
> ---
> > [WARNING] JAR will be empty - no content was marked for inclusion!
> > [INFO]
> > [INFO] ------------------------------------------------------------
> > ------------
> > [INFO] Building hadoop-shim-2.7 0.9.2-SNAPSHOT
> > [INFO] ------------------------------------------------------------
> > ------------
> > [INFO]
> > [INFO] --- maven-clean-plugin:3.0.0:clean (default-clean) @
> > hadoop-shim-2.7 ---
> > [INFO]
> > [INFO] --- buildnumber-maven-plugin:1.1:create (default) @
> > hadoop-shim-2.7 ---
> > [INFO] Checking for local modifications: skipped.
> > [INFO] Updating project files from SCM: skipped.
> > [INFO] Executing: /bin/sh -c cd <https://builds.apache.org/
> > job/Tez-Build/ws/hadoop-shim-impls/hadoop-shim-2.7> && git rev-parse
> > --verify HEAD
> > [INFO] Working directory: <https://builds.apache.org/
> > job/Tez-Build/ws/hadoop-shim-impls/hadoop-shim-2.7>
> > [INFO] Storing buildNumber: bb40cf5b8a49833e13760a0ffe566092eb464d88 at
> > timestamp: 1519335129190
> > [INFO] Executing: /bin/sh -c cd <https://builds.apache.org/
> > job/Tez-Build/ws/hadoop-shim-impls/hadoop-shim-2.7> && git rev-parse
> > --verify HEAD
> > [INFO] Working directory: <https://builds.apache.org/
> > job/Tez-Build/ws/hadoop-shim-impls/hadoop-shim-2.7>
> > [INFO] Storing buildScmBranch: UNKNOWN
> > [INFO]
> > [INFO] --- build-helper-maven-plugin:1.8:maven-version (maven-version) @
> > hadoop-shim-2.7 ---
> > [INFO]
> > [INFO] --- maven-resources-plugin:2.6:resources (default-resources) @
> > hadoop-shim-2.7 ---
> > [INFO] Using 'UTF-8' encoding to copy filtered resources.
> > [INFO] Copying 1 resource
> > [INFO]
> > [INFO] --- maven-compiler-plugin:3.1:compile (default-compile) @
> > hadoop-shim-2.7 ---
> > [INFO] Changes detected - recompiling the module!
> > [INFO] Compiling 2 source files to <https://builds.apache.org/
> > job/Tez-Build/ws/hadoop-shim-impls/hadoop-shim-2.7/target/classes>
> > [INFO]
> > [INFO] --- maven-resources-plugin:2.6:testResources
> > (default-testResources) @ hadoop-shim-2.7 ---
> > [INFO] Using 'UTF-8' encoding to copy filtered resources.
> > [INFO] skip non existing resourceDirectory <https://builds.apache.org/
> > job/Tez-Build/ws/hadoop-shim-impls/hadoop-shim-2.7/src/test/resources>
> > [INFO]
> > [INFO] --- maven-compiler-plugin:3.1:testCompile (default-testCompile) @
> > hadoop-shim-2.7 ---
> > [INFO] Changes detected - recompiling the module!
> > [INFO] Compiling 1 source file to <https://builds.apache.org/
> > job/Tez-Build/ws/hadoop-shim-impls/hadoop-shim-2.7/target/test-classes>
> > [INFO]
> > [INFO] --- maven-surefire-plugin:2.14.1:test (default-test) @
> > hadoop-shim-2.7 ---
> > [INFO] Surefire report directory: <https://builds.apache.org/
> > job/Tez-Build/ws/hadoop-shim-impls/hadoop-shim-2.7/target/
> surefire-reports
> > >
> >
> > -------------------------------------------------------
> >  T E S T S
> > -------------------------------------------------------
> >
> > -------------------------------------------------------
> >  T E S T S
> > -------------------------------------------------------
> > Running org.apache.tez.hadoop.shim.TestHadoop25_26_27ShimProvider
> > Tests run: 4, Failures: 0, Errors: 0, Skipped: 0, Time elapsed: 0.163 sec
> >
> > Results :
> >
> > Tests run: 4, Failures: 0, Errors: 0, Skipped: 0
> >
> > [INFO]
> > [INFO] --- buildnumber-maven-plugin:1.1:create (default) @
> > hadoop-shim-2.7 ---
> > [INFO] Checking for local modifications: skipped.
> > [INFO] Updating project files from SCM: skipped.
> > [INFO] Executing: /bin/sh -c cd <https://builds.apache.org/
> > job/Tez-Build/ws/hadoop-shim-impls/hadoop-shim-2.7> && git rev-parse
> > --verify HEAD
> > [INFO] Working directory: <https://builds.apache.org/
> > job/Tez-Build/ws/hadoop-shim-impls/hadoop-shim-2.7>
> > [INFO] Storing buildNumber: bb40cf5b8a49833e13760a0ffe566092eb464d88 at
> > timestamp: 1519335129846
> > [INFO] Executing: /bin/sh -c cd <https://builds.apache.org/
> > job/Tez-Build/ws/hadoop-shim-impls/hadoop-shim-2.7> && git rev-parse
> > --verify HEAD
> > [INFO] Working directory: <https://builds.apache.org/
> > job/Tez-Build/ws/hadoop-shim-impls/hadoop-shim-2.7>
> > [INFO] Storing buildScmBranch: UNKNOWN
> > [INFO]
> > [INFO] --- build-helper-maven-plugin:1.8:maven-version (maven-version) @
> > hadoop-shim-2.7 ---
> > [INFO]
> > [INFO] --- maven-resources-plugin:2.6:resources (default-resources) @
> > hadoop-shim-2.7 ---
> > [INFO] Using 'UTF-8' encoding to copy filtered resources.
> > [INFO] Copying 1 resource
> > [INFO]
> > [INFO] --- maven-compiler-plugin:3.1:compile (default-compile) @
> > hadoop-shim-2.7 ---
> > [INFO] Nothing to compile - all classes are up to date
> > [INFO]
> > [INFO] --- maven-resources-plugin:2.6:testResources
> > (default-testResources) @ hadoop-shim-2.7 ---
> > [INFO] Using 'UTF-8' encoding to copy filtered resources.
> > [INFO] skip non existing resourceDirectory <https://builds.apache.org/
> > job/Tez-Build/ws/hadoop-shim-impls/hadoop-shim-2.7/src/test/resources>
> > [INFO]
> > [INFO] --- maven-compiler-plugin:3.1:testCompile (default-testCompile) @
> > hadoop-shim-2.7 ---
> > [INFO] Nothing to compile - all classes are up to date
> > [INFO]
> > [INFO] --- maven-surefire-plugin:2.14.1:test (default-test) @
> > hadoop-shim-2.7 ---
> > [INFO] Skipping execution of surefire because it has already been run for
> > this configuration
> > [INFO]
> > [INFO] --- maven-jar-plugin:2.4:jar (default-jar) @ hadoop-shim-2.7 ---
> > [INFO] Building jar: <https://builds.apache.org/
> > job/Tez-Build/ws/hadoop-shim-impls/hadoop-shim-2.7/target/
> > hadoop-shim-2.7-0.9.2-SNAPSHOT.jar>
> > [INFO]
> > [INFO] --- maven-jar-plugin:2.4:test-jar (default) @ hadoop-shim-2.7 ---
> > [INFO] Building jar: <https://builds.apache.org/
> > job/Tez-Build/ws/hadoop-shim-impls/hadoop-shim-2.7/target/
> > hadoop-shim-2.7-0.9.2-SNAPSHOT-tests.jar>
> > [INFO]
> > [INFO] --- maven-install-plugin:2.4:install (default-install) @
> > hadoop-shim-2.7 ---
> > [INFO] Installing <https://builds.apache.org/
> job/Tez-Build/ws/hadoop-shim-
> > impls/hadoop-shim-2.7/target/hadoop-shim-2.7-0.9.2-SNAPSHOT.jar> to
> > /home/jenkins/.m2/repository/org/apache/tez/hadoop-shim-2.
> > 7/0.9.2-SNAPSHOT/hadoop-shim-2.7-0.9.2-SNAPSHOT.jar
> > [INFO] Installing <https://builds.apache.org/
> job/Tez-Build/ws/hadoop-shim-
> > impls/hadoop-shim-2.7/pom.xml> to /home/jenkins/.m2/repository/
> > org/apache/tez/hadoop-shim-2.7/0.9.2-SNAPSHOT/hadoop-shim-
> > 2.7-0.9.2-SNAPSHOT.pom
> > [INFO] Installing <https://builds.apache.org/
> job/Tez-Build/ws/hadoop-shim-
> > impls/hadoop-shim-2.7/target/hadoop-shim-2.7-0.9.2-SNAPSHOT-tests.jar>
> to
> > /home/jenkins/.m2/repository/org/apache/tez/hadoop-shim-2.
> > 7/0.9.2-SNAPSHOT/hadoop-shim-2.7-0.9.2-SNAPSHOT-tests.jar
> > [INFO]
> > [INFO] --- maven-deploy-plugin:2.8.1:deploy (default-deploy) @
> > hadoop-shim-2.7 ---
> > [INFO] Deploying org.apache.tez:hadoop-shim-2.7:0.9.2-SNAPSHOT at end
> > [INFO]
> > [INFO] --- buildnumber-maven-plugin:1.1:create (default) @
> > hadoop-shim-2.7 ---
> > [INFO] Checking for local modifications: skipped.
> > [INFO] Updating project files from SCM: skipped.
> > [INFO] Executing: /bin/sh -c cd <https://builds.apache.org/
> > job/Tez-Build/ws/hadoop-shim-impls/hadoop-shim-2.7> && git rev-parse
> > --verify HEAD
> > [INFO] Working directory: <https://builds.apache.org/
> > job/Tez-Build/ws/hadoop-shim-impls/hadoop-shim-2.7>
> > [INFO] Storing buildNumber: bb40cf5b8a49833e13760a0ffe566092eb464d88 at
> > timestamp: 1519335129915
> > [INFO] Executing: /bin/sh -c cd <https://builds.apache.org/
> > job/Tez-Build/ws/hadoop-shim-impls/hadoop-shim-2.7> && git rev-parse
> > --verify HEAD
> > [INFO] Working directory: <https://builds.apache.org/
> > job/Tez-Build/ws/hadoop-shim-impls/hadoop-shim-2.7>
> > [INFO] Storing buildScmBranch: UNKNOWN
> > [INFO]
> > [INFO] --- build-helper-maven-plugin:1.8:maven-version (maven-version) @
> > hadoop-shim-2.7 ---
> > [INFO]
> > [INFO] --- maven-resources-plugin:2.6:resources (default-resources) @
> > hadoop-shim-2.7 ---
> > [INFO] Using 'UTF-8' encoding to copy filtered resources.
> > [INFO] Copying 1 resource
> > [INFO]
> > [INFO] --- maven-compiler-plugin:3.1:compile (default-compile) @
> > hadoop-shim-2.7 ---
> > [INFO] Nothing to compile - all classes are up to date
> > [INFO]
> > [INFO] --- maven-resources-plugin:2.6:testResources
> > (default-testResources) @ hadoop-shim-2.7 ---
> > [INFO] Using 'UTF-8' encoding to copy filtered resources.
> > [INFO] skip non existing resourceDirectory <https://builds.apache.org/
> > job/Tez-Build/ws/hadoop-shim-impls/hadoop-shim-2.7/src/test/resources>
> > [INFO]
> > [INFO] --- maven-compiler-plugin:3.1:testCompile (default-testCompile) @
> > hadoop-shim-2.7 ---
> > [INFO] Nothing to compile - all classes are up to date
> > [INFO]
> > [INFO] --- maven-surefire-plugin:2.14.1:test (default-test) @
> > hadoop-shim-2.7 ---
> > [INFO] Skipping execution of surefire because it has already been run for
> > this configuration
> > [INFO]
> > [INFO] --- maven-jar-plugin:2.4:jar (default-jar) @ hadoop-shim-2.7 ---
> > [INFO]
> > [INFO] --- maven-jar-plugin:2.4:test-jar (default) @ hadoop-shim-2.7 ---
> > [INFO]
> > [INFO] ------------------------------------------------------------
> > ------------
> > [INFO] Skipping tez-dist
> > [INFO] This project has been banned from the build due to previous
> > failures.
> > [INFO] ------------------------------------------------------------
> > ------------
> > [INFO]
> > [INFO] ------------------------------------------------------------
> > ------------
> > [INFO] Building Tez 0.9.2-SNAPSHOT
> > [INFO] ------------------------------------------------------------
> > ------------
> > [INFO]
> > [INFO] --- maven-clean-plugin:3.0.0:clean (default-clean) @ tez-docs ---
> > [INFO]
> > [INFO] --- buildnumber-maven-plugin:1.1:create (default) @ tez-docs ---
> > [INFO] Checking for local modifications: skipped.
> > [INFO] Updating project files from SCM: skipped.
> > [INFO] Executing: /bin/sh -c cd <https://builds.apache.org/
> > job/Tez-Build/ws/docs> && git rev-parse --verify HEAD
> > [INFO] Working directory: <https://builds.apache.org/
> job/Tez-Build/ws/docs
> > >
> > [INFO] Storing buildNumber: bb40cf5b8a49833e13760a0ffe566092eb464d88 at
> > timestamp: 1519335129947
> > [INFO] Executing: /bin/sh -c cd <https://builds.apache.org/
> > job/Tez-Build/ws/docs> && git rev-parse --verify HEAD
> > [INFO] Working directory: <https://builds.apache.org/
> job/Tez-Build/ws/docs
> > >
> > [INFO] Storing buildScmBranch: UNKNOWN
> > [INFO]
> > [INFO] --- build-helper-maven-plugin:1.8:maven-version (maven-version) @
> > tez-docs ---
> > [INFO]
> > [INFO] --- buildnumber-maven-plugin:1.1:create (default) @ tez-docs ---
> > [INFO] Checking for local modifications: skipped.
> > [INFO] Updating project files from SCM: skipped.
> > [INFO] Executing: /bin/sh -c cd <https://builds.apache.org/
> > job/Tez-Build/ws/docs> && git rev-parse --verify HEAD
> > [INFO] Working directory: <https://builds.apache.org/
> job/Tez-Build/ws/docs
> > >
> > [INFO] Storing buildNumber: bb40cf5b8a49833e13760a0ffe566092eb464d88 at
> > timestamp: 1519335129955
> > [INFO] Executing: /bin/sh -c cd <https://builds.apache.org/
> > job/Tez-Build/ws/docs> && git rev-parse --verify HEAD
> > [INFO] Working directory: <https://builds.apache.org/
> job/Tez-Build/ws/docs
> > >
> > [INFO] Storing buildScmBranch: UNKNOWN
> > [INFO]
> > [INFO] --- build-helper-maven-plugin:1.8:maven-version (maven-version) @
> > tez-docs ---
> > [INFO]
> > [INFO] --- maven-jar-plugin:2.4:test-jar (default) @ tez-docs ---
> > [WARNING] JAR will be empty - no content was marked for inclusion!
> > [INFO] Building jar: <https://builds.apache.org/
> > job/Tez-Build/ws/docs/target/tez-docs-0.9.2-SNAPSHOT-tests.jar>
> > [INFO]
> > [INFO] --- maven-install-plugin:2.4:install (default-install) @ tez-docs
> > ---
> > [INFO] Installing <https://builds.apache.org/
> job/Tez-Build/ws/docs/pom.xml>
> > to /home/jenkins/.m2/repository/org/apache/tez/tez-docs/0.9.2-
> > SNAPSHOT/tez-docs-0.9.2-SNAPSHOT.pom
> > [INFO] Installing <https://builds.apache.org/
> job/Tez-Build/ws/docs/target/
> > tez-docs-0.9.2-SNAPSHOT-tests.jar> to /home/jenkins/.m2/repository/
> > org/apache/tez/tez-docs/0.9.2-SNAPSHOT/tez-docs-0.9.2-SNAPSHOT-tests.jar
> > [INFO]
> > [INFO] --- maven-deploy-plugin:2.8.1:deploy (default-deploy) @ tez-docs
> > ---
> > [INFO] Skipping artifact deployment
> > [INFO]
> > [INFO] --- buildnumber-maven-plugin:1.1:create (default) @ tez-docs ---
> > [INFO] Checking for local modifications: skipped.
> > [INFO] Updating project files from SCM: skipped.
> > [INFO] Executing: /bin/sh -c cd <https://builds.apache.org/
> > job/Tez-Build/ws/docs> && git rev-parse --verify HEAD
> > [INFO] Working directory: <https://builds.apache.org/
> job/Tez-Build/ws/docs
> > >
> > [INFO] Storing buildNumber: bb40cf5b8a49833e13760a0ffe566092eb464d88 at
> > timestamp: 1519335129991
> > [INFO] Executing: /bin/sh -c cd <https://builds.apache.org/
> > job/Tez-Build/ws/docs> && git rev-parse --verify HEAD
> > [INFO] Working directory: <https://builds.apache.org/
> job/Tez-Build/ws/docs
> > >
> > [INFO] Storing buildScmBranch: UNKNOWN
> > [INFO]
> > [INFO] --- build-helper-maven-plugin:1.8:maven-version (maven-version) @
> > tez-docs ---
> > [INFO]
> > [INFO] --- maven-jar-plugin:2.4:test-jar (default) @ tez-docs ---
> > [WARNING] JAR will be empty - no content was marked for inclusion!
> > [INFO] ------------------------------------------------------------
> > ------------
> > [INFO] Reactor Summary:
> > [INFO]
> > [INFO] tez ................................................ SUCCESS [
> > 1.783 s]
> > [INFO] hadoop-shim ........................................ SUCCESS [
> > 2.141 s]
> > [INFO] tez-api ............................................ FAILURE [
> > 0.185 s]
> > [INFO] tez-common ......................................... SKIPPED
> > [INFO] tez-runtime-internals .............................. SKIPPED
> > [INFO] tez-runtime-library ................................ SKIPPED
> > [INFO] tez-mapreduce ...................................... SKIPPED
> > [INFO] tez-examples ....................................... SKIPPED
> > [INFO] tez-dag ............................................ SKIPPED
> > [INFO] tez-tests .......................................... SKIPPED
> > [INFO] tez-ext-service-tests .............................. SKIPPED
> > [INFO] tez-ui ............................................. SUCCESS
> > [06:54 min]
> > [INFO] tez-plugins ........................................ SUCCESS [
> > 0.111 s]
> > [INFO] tez-yarn-timeline-history .......................... SKIPPED
> > [INFO] tez-yarn-timeline-history-with-acls ................ SKIPPED
> > [INFO] tez-history-parser ................................. SKIPPED
> > [INFO] tez-aux-services ................................... SKIPPED
> > [INFO] tez-tools .......................................... SUCCESS [
> > 0.082 s]
> > [INFO] tez-perf-analyzer .................................. SUCCESS [
> > 0.046 s]
> > [INFO] tez-job-analyzer ................................... SKIPPED
> > [INFO] tez-javadoc-tools .................................. SKIPPED
> > [INFO] hadoop-shim-impls .................................. SUCCESS [
> > 0.070 s]
> > [INFO] hadoop-shim-2.7 .................................... SUCCESS [
> > 0.774 s]
> > [INFO] tez-dist ........................................... SKIPPED
> > [INFO] Tez ................................................ SUCCESS [
> > 0.059 s]
> > [INFO] ------------------------------------------------------------
> > ------------
> > [INFO] BUILD FAILURE
> > [INFO] ------------------------------------------------------------
> > ------------
> > [INFO] Total time: 07:00 min
> > [INFO] Finished at: 2018-02-22T21:32:10Z
> > [INFO] Final Memory: 51M/1718M
> > [INFO] ------------------------------------------------------------
> > ------------
> > [ERROR] Failed to execute goal org.apache.hadoop:hadoop-
> maven-plugins:2.7.0:protoc
> > (compile-protoc) on project tez-api: org.apache.maven.plugin.
> MojoExecutionException:
> > protoc version is 'libprotoc 2.6.1', expected version is '2.5.0' ->
> [Help 1]
> > [ERROR]
> > [ERROR] To see the full stack trace of the errors, re-run Maven with the
> > -e switch.
> > [ERROR] Re-run Maven using the -X switch to enable full debug logging.
> > [ERROR]
> > [ERROR] For more information about the errors and possible solutions,
> > please read the following articles:
> > [ERROR] [Help 1] http://cwiki.apache.org/confluence/display/MAVEN/
> > MojoExecutionException
> > [ERROR]
> > [ERROR] After correcting the problems, you can resume the build with the
> > command
> > [ERROR]   mvn <goals> -rf :tez-api
> > Build step 'Execute shell' marked build as failure
> > Archiving artifacts
> > Recording test results
> >
>

Mime
  • Unnamed multipart/alternative (inline, None, 0 bytes)
View raw message