tez-dev mailing list archives

Site index · List index
Message view « Date » · « Thread »
Top « Date » · « Thread »
From Apache Jenkins Server <jenk...@builds.apache.org>
Subject Build failed in Jenkins: Tez-Build #1887
Date Mon, 22 Apr 2019 22:56:29 GMT
See <https://builds.apache.org/job/Tez-Build/1887/display/redirect>

------------------------------------------
[...truncated 1.47 MB...]
[INFO] Updating project files from SCM: skipped.
[INFO] Executing: /bin/sh -c cd <https://builds.apache.org/job/Tez-Build/ws/hadoop-shim-impls>
&& git rev-parse --verify HEAD
[INFO] Working directory: <https://builds.apache.org/job/Tez-Build/ws/hadoop-shim-impls>
[INFO] Storing buildNumber: 8395a9560a131799f1af49b26e1f10f12ef48752 at timestamp: 1555973785319
[INFO] Executing: /bin/sh -c cd <https://builds.apache.org/job/Tez-Build/ws/hadoop-shim-impls>
&& git rev-parse --verify HEAD
[INFO] Working directory: <https://builds.apache.org/job/Tez-Build/ws/hadoop-shim-impls>
[INFO] Storing buildScmBranch: UNKNOWN
[INFO] 
[INFO] --- build-helper-maven-plugin:1.8:maven-version (maven-version) @ hadoop-shim-impls
---
[INFO] 
[INFO] --- maven-jar-plugin:2.4:test-jar (default) @ hadoop-shim-impls ---
[WARNING] JAR will be empty - no content was marked for inclusion!
[INFO] 
[INFO] -------------------< org.apache.tez:hadoop-shim-2.8 >-------------------
[INFO] Building hadoop-shim-2.8 0.10.1-SNAPSHOT                         [10/29]
[INFO] --------------------------------[ jar ]---------------------------------
[INFO] 
[INFO] --- maven-clean-plugin:3.0.0:clean (default-clean) @ hadoop-shim-2.8 ---
[INFO] 
[INFO] --- buildnumber-maven-plugin:1.1:create (default) @ hadoop-shim-2.8 ---
[INFO] Checking for local modifications: skipped.
[INFO] Updating project files from SCM: skipped.
[INFO] Executing: /bin/sh -c cd <https://builds.apache.org/job/Tez-Build/ws/hadoop-shim-impls/hadoop-shim-2.8>
&& git rev-parse --verify HEAD
[INFO] Working directory: <https://builds.apache.org/job/Tez-Build/ws/hadoop-shim-impls/hadoop-shim-2.8>
[INFO] Storing buildNumber: 8395a9560a131799f1af49b26e1f10f12ef48752 at timestamp: 1555973785364
[INFO] Executing: /bin/sh -c cd <https://builds.apache.org/job/Tez-Build/ws/hadoop-shim-impls/hadoop-shim-2.8>
&& git rev-parse --verify HEAD
[INFO] Working directory: <https://builds.apache.org/job/Tez-Build/ws/hadoop-shim-impls/hadoop-shim-2.8>
[INFO] Storing buildScmBranch: UNKNOWN
[INFO] 
[INFO] --- build-helper-maven-plugin:1.8:maven-version (maven-version) @ hadoop-shim-2.8 ---
[INFO] 
[INFO] --- maven-resources-plugin:2.6:resources (default-resources) @ hadoop-shim-2.8 ---
[INFO] Using 'UTF-8' encoding to copy filtered resources.
[INFO] Copying 1 resource
[INFO] 
[INFO] --- maven-compiler-plugin:3.1:compile (default-compile) @ hadoop-shim-2.8 ---
[INFO] Changes detected - recompiling the module!
[INFO] Compiling 2 source files to <https://builds.apache.org/job/Tez-Build/ws/hadoop-shim-impls/hadoop-shim-2.8/target/classes>
[INFO] 
[INFO] --- maven-resources-plugin:2.6:testResources (default-testResources) @ hadoop-shim-2.8
---
[INFO] Using 'UTF-8' encoding to copy filtered resources.
[INFO] skip non existing resourceDirectory <https://builds.apache.org/job/Tez-Build/ws/hadoop-shim-impls/hadoop-shim-2.8/src/test/resources>
[INFO] 
[INFO] --- maven-compiler-plugin:3.1:testCompile (default-testCompile) @ hadoop-shim-2.8 ---
[INFO] Changes detected - recompiling the module!
[INFO] Compiling 2 source files to <https://builds.apache.org/job/Tez-Build/ws/hadoop-shim-impls/hadoop-shim-2.8/target/test-classes>
[INFO] 
[INFO] --- maven-surefire-plugin:3.0.0-M1:test (default-test) @ hadoop-shim-2.8 ---
[INFO] 
[INFO] -------------------------------------------------------
[INFO]  T E S T S
[INFO] -------------------------------------------------------
[INFO] Running org.apache.tez.hadoop.shim.TestHadoopShim28
[INFO] Tests run: 1, Failures: 0, Errors: 0, Skipped: 0, Time elapsed: 0.052 s - in org.apache.tez.hadoop.shim.TestHadoopShim28
[INFO] Running org.apache.tez.hadoop.shim.TestHadoopShim28Provider
[INFO] Tests run: 4, Failures: 0, Errors: 0, Skipped: 0, Time elapsed: 0.168 s - in org.apache.tez.hadoop.shim.TestHadoopShim28Provider
[INFO] 
[INFO] Results:
[INFO] 
[INFO] Tests run: 5, Failures: 0, Errors: 0, Skipped: 0
[INFO] 
[INFO] 
[INFO] --- buildnumber-maven-plugin:1.1:create (default) @ hadoop-shim-2.8 ---
[INFO] Checking for local modifications: skipped.
[INFO] Updating project files from SCM: skipped.
[INFO] Executing: /bin/sh -c cd <https://builds.apache.org/job/Tez-Build/ws/hadoop-shim-impls/hadoop-shim-2.8>
&& git rev-parse --verify HEAD
[INFO] Working directory: <https://builds.apache.org/job/Tez-Build/ws/hadoop-shim-impls/hadoop-shim-2.8>
[INFO] Storing buildNumber: 8395a9560a131799f1af49b26e1f10f12ef48752 at timestamp: 1555973787128
[INFO] Executing: /bin/sh -c cd <https://builds.apache.org/job/Tez-Build/ws/hadoop-shim-impls/hadoop-shim-2.8>
&& git rev-parse --verify HEAD
[INFO] Working directory: <https://builds.apache.org/job/Tez-Build/ws/hadoop-shim-impls/hadoop-shim-2.8>
[INFO] Storing buildScmBranch: UNKNOWN
[INFO] 
[INFO] --- build-helper-maven-plugin:1.8:maven-version (maven-version) @ hadoop-shim-2.8 ---
[INFO] 
[INFO] --- maven-resources-plugin:2.6:resources (default-resources) @ hadoop-shim-2.8 ---
[INFO] Using 'UTF-8' encoding to copy filtered resources.
[INFO] Copying 1 resource
[INFO] 
[INFO] --- maven-compiler-plugin:3.1:compile (default-compile) @ hadoop-shim-2.8 ---
[INFO] Nothing to compile - all classes are up to date
[INFO] 
[INFO] --- maven-resources-plugin:2.6:testResources (default-testResources) @ hadoop-shim-2.8
---
[INFO] Using 'UTF-8' encoding to copy filtered resources.
[INFO] skip non existing resourceDirectory <https://builds.apache.org/job/Tez-Build/ws/hadoop-shim-impls/hadoop-shim-2.8/src/test/resources>
[INFO] 
[INFO] --- maven-compiler-plugin:3.1:testCompile (default-testCompile) @ hadoop-shim-2.8 ---
[INFO] Nothing to compile - all classes are up to date
[INFO] 
[INFO] --- maven-surefire-plugin:3.0.0-M1:test (default-test) @ hadoop-shim-2.8 ---
[INFO] Skipping execution of surefire because it has already been run for this configuration
[INFO] 
[INFO] --- maven-jar-plugin:2.4:jar (default-jar) @ hadoop-shim-2.8 ---
[INFO] Building jar: <https://builds.apache.org/job/Tez-Build/ws/hadoop-shim-impls/hadoop-shim-2.8/target/hadoop-shim-2.8-0.10.1-SNAPSHOT.jar>
[INFO] 
[INFO] --- maven-jar-plugin:2.4:test-jar (default) @ hadoop-shim-2.8 ---
[INFO] Building jar: <https://builds.apache.org/job/Tez-Build/ws/hadoop-shim-impls/hadoop-shim-2.8/target/hadoop-shim-2.8-0.10.1-SNAPSHOT-tests.jar>
[INFO] 
[INFO] --- maven-install-plugin:2.4:install (default-install) @ hadoop-shim-2.8 ---
[INFO] Installing <https://builds.apache.org/job/Tez-Build/ws/hadoop-shim-impls/hadoop-shim-2.8/target/hadoop-shim-2.8-0.10.1-SNAPSHOT.jar>
to /home/jenkins/.m2/repository/org/apache/tez/hadoop-shim-2.8/0.10.1-SNAPSHOT/hadoop-shim-2.8-0.10.1-SNAPSHOT.jar
[INFO] Installing <https://builds.apache.org/job/Tez-Build/ws/hadoop-shim-impls/hadoop-shim-2.8/pom.xml>
to /home/jenkins/.m2/repository/org/apache/tez/hadoop-shim-2.8/0.10.1-SNAPSHOT/hadoop-shim-2.8-0.10.1-SNAPSHOT.pom
[INFO] Installing <https://builds.apache.org/job/Tez-Build/ws/hadoop-shim-impls/hadoop-shim-2.8/target/hadoop-shim-2.8-0.10.1-SNAPSHOT-tests.jar>
to /home/jenkins/.m2/repository/org/apache/tez/hadoop-shim-2.8/0.10.1-SNAPSHOT/hadoop-shim-2.8-0.10.1-SNAPSHOT-tests.jar
[INFO] 
[INFO] --- maven-deploy-plugin:2.8.1:deploy (default-deploy) @ hadoop-shim-2.8 ---
[INFO] Deploying org.apache.tez:hadoop-shim-2.8:0.10.1-SNAPSHOT at end
[INFO] 
[INFO] --- buildnumber-maven-plugin:1.1:create (default) @ hadoop-shim-2.8 ---
[INFO] Checking for local modifications: skipped.
[INFO] Updating project files from SCM: skipped.
[INFO] Executing: /bin/sh -c cd <https://builds.apache.org/job/Tez-Build/ws/hadoop-shim-impls/hadoop-shim-2.8>
&& git rev-parse --verify HEAD
[INFO] Working directory: <https://builds.apache.org/job/Tez-Build/ws/hadoop-shim-impls/hadoop-shim-2.8>
[INFO] Storing buildNumber: 8395a9560a131799f1af49b26e1f10f12ef48752 at timestamp: 1555973787194
[INFO] Executing: /bin/sh -c cd <https://builds.apache.org/job/Tez-Build/ws/hadoop-shim-impls/hadoop-shim-2.8>
&& git rev-parse --verify HEAD
[INFO] Working directory: <https://builds.apache.org/job/Tez-Build/ws/hadoop-shim-impls/hadoop-shim-2.8>
[INFO] Storing buildScmBranch: UNKNOWN
[INFO] 
[INFO] --- build-helper-maven-plugin:1.8:maven-version (maven-version) @ hadoop-shim-2.8 ---
[INFO] 
[INFO] --- maven-resources-plugin:2.6:resources (default-resources) @ hadoop-shim-2.8 ---
[INFO] Using 'UTF-8' encoding to copy filtered resources.
[INFO] Copying 1 resource
[INFO] 
[INFO] --- maven-compiler-plugin:3.1:compile (default-compile) @ hadoop-shim-2.8 ---
[INFO] Nothing to compile - all classes are up to date
[INFO] 
[INFO] --- maven-resources-plugin:2.6:testResources (default-testResources) @ hadoop-shim-2.8
---
[INFO] Using 'UTF-8' encoding to copy filtered resources.
[INFO] skip non existing resourceDirectory <https://builds.apache.org/job/Tez-Build/ws/hadoop-shim-impls/hadoop-shim-2.8/src/test/resources>
[INFO] 
[INFO] --- maven-compiler-plugin:3.1:testCompile (default-testCompile) @ hadoop-shim-2.8 ---
[INFO] Nothing to compile - all classes are up to date
[INFO] 
[INFO] --- maven-surefire-plugin:3.0.0-M1:test (default-test) @ hadoop-shim-2.8 ---
[INFO] Skipping execution of surefire because it has already been run for this configuration
[INFO] 
[INFO] --- maven-jar-plugin:2.4:jar (default-jar) @ hadoop-shim-2.8 ---
[INFO] 
[INFO] --- maven-jar-plugin:2.4:test-jar (default) @ hadoop-shim-2.8 ---
[INFO] 
[INFO] ------------------------------------------------------------------------
[INFO] Skipping tez-dist
[INFO] This project has been banned from the build due to previous failures.
[INFO] ------------------------------------------------------------------------
[INFO] 
[INFO] ----------------------< org.apache.tez:tez-docs >-----------------------
[INFO] Building Tez 0.10.1-SNAPSHOT                                     [11/29]
[INFO] --------------------------------[ pom ]---------------------------------
[INFO] 
[INFO] --- maven-clean-plugin:3.0.0:clean (default-clean) @ tez-docs ---
[INFO] 
[INFO] --- buildnumber-maven-plugin:1.1:create (default) @ tez-docs ---
[INFO] Checking for local modifications: skipped.
[INFO] Updating project files from SCM: skipped.
[INFO] Executing: /bin/sh -c cd <https://builds.apache.org/job/Tez-Build/ws/docs> &&
git rev-parse --verify HEAD
[INFO] Working directory: <https://builds.apache.org/job/Tez-Build/ws/docs>
[INFO] Storing buildNumber: 8395a9560a131799f1af49b26e1f10f12ef48752 at timestamp: 1555973787228
[INFO] Executing: /bin/sh -c cd <https://builds.apache.org/job/Tez-Build/ws/docs> &&
git rev-parse --verify HEAD
[INFO] Working directory: <https://builds.apache.org/job/Tez-Build/ws/docs>
[INFO] Storing buildScmBranch: UNKNOWN
[INFO] 
[INFO] --- build-helper-maven-plugin:1.8:maven-version (maven-version) @ tez-docs ---
[INFO] 
[INFO] --- buildnumber-maven-plugin:1.1:create (default) @ tez-docs ---
[INFO] Checking for local modifications: skipped.
[INFO] Updating project files from SCM: skipped.
[INFO] Executing: /bin/sh -c cd <https://builds.apache.org/job/Tez-Build/ws/docs> &&
git rev-parse --verify HEAD
[INFO] Working directory: <https://builds.apache.org/job/Tez-Build/ws/docs>
[INFO] Storing buildNumber: 8395a9560a131799f1af49b26e1f10f12ef48752 at timestamp: 1555973787238
[INFO] Executing: /bin/sh -c cd <https://builds.apache.org/job/Tez-Build/ws/docs> &&
git rev-parse --verify HEAD
[INFO] Working directory: <https://builds.apache.org/job/Tez-Build/ws/docs>
[INFO] Storing buildScmBranch: UNKNOWN
[INFO] 
[INFO] --- build-helper-maven-plugin:1.8:maven-version (maven-version) @ tez-docs ---
[INFO] 
[INFO] --- maven-jar-plugin:2.4:test-jar (default) @ tez-docs ---
[WARNING] JAR will be empty - no content was marked for inclusion!
[INFO] Building jar: <https://builds.apache.org/job/Tez-Build/ws/docs/target/tez-docs-0.10.1-SNAPSHOT-tests.jar>
[INFO] 
[INFO] --- maven-install-plugin:2.4:install (default-install) @ tez-docs ---
[INFO] Installing <https://builds.apache.org/job/Tez-Build/ws/docs/pom.xml> to /home/jenkins/.m2/repository/org/apache/tez/tez-docs/0.10.1-SNAPSHOT/tez-docs-0.10.1-SNAPSHOT.pom
[INFO] Installing <https://builds.apache.org/job/Tez-Build/ws/docs/target/tez-docs-0.10.1-SNAPSHOT-tests.jar>
to /home/jenkins/.m2/repository/org/apache/tez/tez-docs/0.10.1-SNAPSHOT/tez-docs-0.10.1-SNAPSHOT-tests.jar
[INFO] 
[INFO] --- maven-deploy-plugin:2.8.1:deploy (default-deploy) @ tez-docs ---
[INFO] Skipping artifact deployment
[INFO] 
[INFO] --- buildnumber-maven-plugin:1.1:create (default) @ tez-docs ---
[INFO] Checking for local modifications: skipped.
[INFO] Updating project files from SCM: skipped.
[INFO] Executing: /bin/sh -c cd <https://builds.apache.org/job/Tez-Build/ws/docs> &&
git rev-parse --verify HEAD
[INFO] Working directory: <https://builds.apache.org/job/Tez-Build/ws/docs>
[INFO] Storing buildNumber: 8395a9560a131799f1af49b26e1f10f12ef48752 at timestamp: 1555973787263
[INFO] Executing: /bin/sh -c cd <https://builds.apache.org/job/Tez-Build/ws/docs> &&
git rev-parse --verify HEAD
[INFO] Working directory: <https://builds.apache.org/job/Tez-Build/ws/docs>
[INFO] Storing buildScmBranch: UNKNOWN
[INFO] 
[INFO] --- build-helper-maven-plugin:1.8:maven-version (maven-version) @ tez-docs ---
[INFO] 
[INFO] --- maven-jar-plugin:2.4:test-jar (default) @ tez-docs ---
[WARNING] JAR will be empty - no content was marked for inclusion!
[INFO] ------------------------------------------------------------------------
[INFO] Reactor Summary for tez 0.10.1-SNAPSHOT:
[INFO] 
[INFO] tez ................................................ SUCCESS [ 23.488 s]
[INFO] hadoop-shim ........................................ SUCCESS [ 18.853 s]
[INFO] tez-api ............................................ FAILURE [  6.238 s]
[INFO] tez-build-tools .................................... SUCCESS [  0.109 s]
[INFO] tez-common ......................................... SKIPPED
[INFO] tez-runtime-internals .............................. SKIPPED
[INFO] tez-runtime-library ................................ SKIPPED
[INFO] tez-mapreduce ...................................... SKIPPED
[INFO] tez-examples ....................................... SKIPPED
[INFO] tez-dag ............................................ SKIPPED
[INFO] tez-tests .......................................... SKIPPED
[INFO] tez-ext-service-tests .............................. SKIPPED
[INFO] tez-ui ............................................. SUCCESS [08:09 min]
[INFO] tez-plugins ........................................ SUCCESS [  0.054 s]
[INFO] tez-protobuf-history-plugin ........................ SKIPPED
[INFO] tez-yarn-timeline-history .......................... SKIPPED
[INFO] tez-yarn-timeline-history-with-acls ................ SKIPPED
[INFO] tez-yarn-timeline-cache-plugin ..................... SKIPPED
[INFO] tez-yarn-timeline-history-with-fs .................. SKIPPED
[INFO] tez-history-parser ................................. SKIPPED
[INFO] tez-aux-services ................................... SKIPPED
[INFO] tez-tools .......................................... SUCCESS [  0.081 s]
[INFO] tez-perf-analyzer .................................. SUCCESS [  0.059 s]
[INFO] tez-job-analyzer ................................... SKIPPED
[INFO] tez-javadoc-tools .................................. SKIPPED
[INFO] hadoop-shim-impls .................................. SUCCESS [  0.054 s]
[INFO] hadoop-shim-2.8 .................................... SUCCESS [  1.892 s]
[INFO] tez-dist ........................................... SKIPPED
[INFO] Tez ................................................ SUCCESS [  0.051 s]
[INFO] ------------------------------------------------------------------------
[INFO] BUILD FAILURE
[INFO] ------------------------------------------------------------------------
[INFO] Total time:  09:01 min
[INFO] Finished at: 2019-04-22T22:56:27Z
[INFO] ------------------------------------------------------------------------
[ERROR] Failed to execute goal org.apache.hadoop:hadoop-maven-plugins:3.0.3:protoc (compile-protoc)
on project tez-api: org.apache.maven.plugin.MojoExecutionException: protoc version is 'libprotoc
2.6.1', expected version is '2.5.0' -> [Help 1]
[ERROR] 
[ERROR] To see the full stack trace of the errors, re-run Maven with the -e switch.
[ERROR] Re-run Maven using the -X switch to enable full debug logging.
[ERROR] 
[ERROR] For more information about the errors and possible solutions, please read the following
articles:
[ERROR] [Help 1] http://cwiki.apache.org/confluence/display/MAVEN/MojoExecutionException
[ERROR] 
[ERROR] After correcting the problems, you can resume the build with the command
[ERROR]   mvn <goals> -rf :tez-api
Build step 'Execute shell' marked build as failure
Archiving artifacts
Recording test results

Mime
View raw message