tez-dev mailing list archives

Site index · List index
Message view « Date » · « Thread »
Top « Date » · « Thread »
From Apache Jenkins Server <jenk...@builds.apache.org>
Subject Build failed in Jenkins: Tez-Build-Hadoop3 #221
Date Wed, 22 Jan 2020 04:40:39 GMT
See <https://builds.apache.org/job/Tez-Build-Hadoop3/221/display/redirect?page=changes>

Changes:

[rbalamohan] TEZ-4113: TezUtils::createByteStringFromConf should use snappy instead


------------------------------------------
[...truncated 33.73 KB...]
  }`.
ng.Building..Building...BuildingBuilding.Building..Building...BuildingBuilding.Building..Building...BuildingBuilding.Building..Building...BuildingBuilding.Building..Building...BuildingBuilding.Building..Building...BuildingBuilding.Building..Building...BuildingBuilding.Building..Building...BuildingBuilding.Building..Building...BuildingBuilding.Building..Building...BuildingBuilding.Building..Built
project successfully. Stored in "dist/".
Done in 40.25s.
[INFO] 
[INFO] --- maven-resources-plugin:2.6:resources (default-resources) @ tez-ui ---
[INFO] Using 'UTF-8' encoding to copy filtered resources.
[INFO] Copying 2 resources
[INFO] 
[INFO] --- maven-compiler-plugin:3.1:compile (default-compile) @ tez-ui ---
[INFO] No sources to compile
[INFO] 
[INFO] --- maven-resources-plugin:2.6:testResources (default-testResources) @ tez-ui ---
[INFO] Using 'UTF-8' encoding to copy filtered resources.
[INFO] skip non existing resourceDirectory <https://builds.apache.org/job/Tez-Build-Hadoop3/ws/tez-ui/src/test/resources>
[INFO] 
[INFO] --- maven-compiler-plugin:3.1:testCompile (default-testCompile) @ tez-ui ---
[INFO] No sources to compile
[INFO] 
[INFO] --- maven-surefire-plugin:3.0.0-M1:test (default-test) @ tez-ui ---
[INFO] Tests are skipped.
[INFO] 
[INFO] --- exec-maven-plugin:1.3.2:exec (ember test) @ tez-ui ---
[INFO] skipping execute as per configuraion
[INFO] 
[INFO] ---------------------< org.apache.tez:tez-plugins >---------------------
[INFO] Building tez-plugins 0.10.1-SNAPSHOT                              [6/29]
[INFO] --------------------------------[ pom ]---------------------------------
[INFO] 
[INFO] --- maven-clean-plugin:3.0.0:clean (default-clean) @ tez-plugins ---
[INFO] 
[INFO] --- buildnumber-maven-plugin:1.1:create (default) @ tez-plugins ---
[INFO] Checking for local modifications: skipped.
[INFO] Updating project files from SCM: skipped.
[INFO] Executing: /bin/sh -c cd <https://builds.apache.org/job/Tez-Build-Hadoop3/ws/tez-plugins>
&& git rev-parse --verify HEAD
[INFO] Working directory: <https://builds.apache.org/job/Tez-Build-Hadoop3/ws/tez-plugins>
[INFO] Storing buildNumber: 5b81017a4d11c09cfa0180e3d56e22c22744559b at timestamp: 1579668037876
[INFO] Executing: /bin/sh -c cd <https://builds.apache.org/job/Tez-Build-Hadoop3/ws/tez-plugins>
&& git rev-parse --verify HEAD
[INFO] Working directory: <https://builds.apache.org/job/Tez-Build-Hadoop3/ws/tez-plugins>
[INFO] Storing buildScmBranch: UNKNOWN
[INFO] 
[INFO] --- build-helper-maven-plugin:1.8:maven-version (maven-version) @ tez-plugins ---
[INFO] 
[INFO] ------------------------------------------------------------------------
[INFO] Skipping tez-protobuf-history-plugin
[INFO] This project has been banned from the build due to previous failures.
[INFO] ------------------------------------------------------------------------
[INFO] 
[INFO] ------------------------------------------------------------------------
[INFO] Skipping tez-yarn-timeline-history
[INFO] This project has been banned from the build due to previous failures.
[INFO] ------------------------------------------------------------------------
[INFO] 
[INFO] ------------------------------------------------------------------------
[INFO] Skipping tez-yarn-timeline-history-with-acls
[INFO] This project has been banned from the build due to previous failures.
[INFO] ------------------------------------------------------------------------
[INFO] 
[INFO] ------------------------------------------------------------------------
[INFO] Skipping tez-yarn-timeline-cache-plugin
[INFO] This project has been banned from the build due to previous failures.
[INFO] ------------------------------------------------------------------------
[INFO] 
[INFO] ------------------------------------------------------------------------
[INFO] Skipping tez-yarn-timeline-history-with-fs
[INFO] This project has been banned from the build due to previous failures.
[INFO] ------------------------------------------------------------------------
[INFO] 
[INFO] ------------------------------------------------------------------------
[INFO] Skipping tez-history-parser
[INFO] This project has been banned from the build due to previous failures.
[INFO] ------------------------------------------------------------------------
[INFO] 
[INFO] ------------------------------------------------------------------------
[INFO] Skipping tez-aux-services
[INFO] This project has been banned from the build due to previous failures.
[INFO] ------------------------------------------------------------------------
[INFO] 
[INFO] ----------------------< org.apache.tez:tez-tools >----------------------
[INFO] Building tez-tools 0.10.1-SNAPSHOT                                [7/29]
[INFO] --------------------------------[ pom ]---------------------------------
[INFO] 
[INFO] --- maven-clean-plugin:3.0.0:clean (default-clean) @ tez-tools ---
[INFO] 
[INFO] --- buildnumber-maven-plugin:1.1:create (default) @ tez-tools ---
[INFO] Checking for local modifications: skipped.
[INFO] Updating project files from SCM: skipped.
[INFO] Executing: /bin/sh -c cd <https://builds.apache.org/job/Tez-Build-Hadoop3/ws/tez-tools>
&& git rev-parse --verify HEAD
[INFO] Working directory: <https://builds.apache.org/job/Tez-Build-Hadoop3/ws/tez-tools>
[INFO] Storing buildNumber: 5b81017a4d11c09cfa0180e3d56e22c22744559b at timestamp: 1579668037898
[INFO] Executing: /bin/sh -c cd <https://builds.apache.org/job/Tez-Build-Hadoop3/ws/tez-tools>
&& git rev-parse --verify HEAD
[INFO] Working directory: <https://builds.apache.org/job/Tez-Build-Hadoop3/ws/tez-tools>
[INFO] Storing buildScmBranch: UNKNOWN
[INFO] 
[INFO] --- build-helper-maven-plugin:1.8:maven-version (maven-version) @ tez-tools ---
[INFO] 
[INFO] ------------------< org.apache.tez:tez-perf-analyzer >------------------
[INFO] Building tez-perf-analyzer 0.10.1-SNAPSHOT                        [8/29]
[INFO] --------------------------------[ pom ]---------------------------------
[INFO] 
[INFO] --- maven-clean-plugin:3.0.0:clean (default-clean) @ tez-perf-analyzer ---
[INFO] 
[INFO] --- buildnumber-maven-plugin:1.1:create (default) @ tez-perf-analyzer ---
[INFO] Checking for local modifications: skipped.
[INFO] Updating project files from SCM: skipped.
[INFO] Executing: /bin/sh -c cd <https://builds.apache.org/job/Tez-Build-Hadoop3/ws/tez-tools/analyzers>
&& git rev-parse --verify HEAD
[INFO] Working directory: <https://builds.apache.org/job/Tez-Build-Hadoop3/ws/tez-tools/analyzers>
[INFO] Storing buildNumber: 5b81017a4d11c09cfa0180e3d56e22c22744559b at timestamp: 1579668037914
[INFO] Executing: /bin/sh -c cd <https://builds.apache.org/job/Tez-Build-Hadoop3/ws/tez-tools/analyzers>
&& git rev-parse --verify HEAD
[INFO] Working directory: <https://builds.apache.org/job/Tez-Build-Hadoop3/ws/tez-tools/analyzers>
[INFO] Storing buildScmBranch: UNKNOWN
[INFO] 
[INFO] --- build-helper-maven-plugin:1.8:maven-version (maven-version) @ tez-perf-analyzer
---
[INFO] 
[INFO] ------------------------------------------------------------------------
[INFO] Skipping tez-job-analyzer
[INFO] This project has been banned from the build due to previous failures.
[INFO] ------------------------------------------------------------------------
[INFO] 
[INFO] ------------------------------------------------------------------------
[INFO] Skipping tez-javadoc-tools
[INFO] This project has been banned from the build due to previous failures.
[INFO] ------------------------------------------------------------------------
[INFO] 
[INFO] ------------------< org.apache.tez:hadoop-shim-impls >------------------
[INFO] Building hadoop-shim-impls 0.10.1-SNAPSHOT                        [9/29]
[INFO] --------------------------------[ pom ]---------------------------------
[INFO] 
[INFO] --- maven-clean-plugin:3.0.0:clean (default-clean) @ hadoop-shim-impls ---
[INFO] 
[INFO] --- buildnumber-maven-plugin:1.1:create (default) @ hadoop-shim-impls ---
[INFO] Checking for local modifications: skipped.
[INFO] Updating project files from SCM: skipped.
[INFO] Executing: /bin/sh -c cd <https://builds.apache.org/job/Tez-Build-Hadoop3/ws/hadoop-shim-impls>
&& git rev-parse --verify HEAD
[INFO] Working directory: <https://builds.apache.org/job/Tez-Build-Hadoop3/ws/hadoop-shim-impls>
[INFO] Storing buildNumber: 5b81017a4d11c09cfa0180e3d56e22c22744559b at timestamp: 1579668037932
[INFO] Executing: /bin/sh -c cd <https://builds.apache.org/job/Tez-Build-Hadoop3/ws/hadoop-shim-impls>
&& git rev-parse --verify HEAD
[INFO] Working directory: <https://builds.apache.org/job/Tez-Build-Hadoop3/ws/hadoop-shim-impls>
[INFO] Storing buildScmBranch: UNKNOWN
[INFO] 
[INFO] --- build-helper-maven-plugin:1.8:maven-version (maven-version) @ hadoop-shim-impls
---
[INFO] 
[INFO] -------------------< org.apache.tez:hadoop-shim-2.8 >-------------------
[INFO] Building hadoop-shim-2.8 0.10.1-SNAPSHOT                         [10/29]
[INFO] --------------------------------[ jar ]---------------------------------
[INFO] 
[INFO] --- maven-clean-plugin:3.0.0:clean (default-clean) @ hadoop-shim-2.8 ---
[INFO] 
[INFO] --- buildnumber-maven-plugin:1.1:create (default) @ hadoop-shim-2.8 ---
[INFO] Checking for local modifications: skipped.
[INFO] Updating project files from SCM: skipped.
[INFO] Executing: /bin/sh -c cd <https://builds.apache.org/job/Tez-Build-Hadoop3/ws/hadoop-shim-impls/hadoop-shim-2.8>
&& git rev-parse --verify HEAD
[INFO] Working directory: <https://builds.apache.org/job/Tez-Build-Hadoop3/ws/hadoop-shim-impls/hadoop-shim-2.8>
[INFO] Storing buildNumber: 5b81017a4d11c09cfa0180e3d56e22c22744559b at timestamp: 1579668037970
[INFO] Executing: /bin/sh -c cd <https://builds.apache.org/job/Tez-Build-Hadoop3/ws/hadoop-shim-impls/hadoop-shim-2.8>
&& git rev-parse --verify HEAD
[INFO] Working directory: <https://builds.apache.org/job/Tez-Build-Hadoop3/ws/hadoop-shim-impls/hadoop-shim-2.8>
[INFO] Storing buildScmBranch: UNKNOWN
[INFO] 
[INFO] --- build-helper-maven-plugin:1.8:maven-version (maven-version) @ hadoop-shim-2.8 ---
[INFO] 
[INFO] --- maven-resources-plugin:2.6:resources (default-resources) @ hadoop-shim-2.8 ---
[INFO] Using 'UTF-8' encoding to copy filtered resources.
[INFO] Copying 1 resource
[INFO] 
[INFO] --- maven-compiler-plugin:3.1:compile (default-compile) @ hadoop-shim-2.8 ---
[INFO] Changes detected - recompiling the module!
[INFO] Compiling 2 source files to <https://builds.apache.org/job/Tez-Build-Hadoop3/ws/hadoop-shim-impls/hadoop-shim-2.8/target/classes>
[INFO] 
[INFO] --- maven-resources-plugin:2.6:testResources (default-testResources) @ hadoop-shim-2.8
---
[INFO] Using 'UTF-8' encoding to copy filtered resources.
[INFO] skip non existing resourceDirectory <https://builds.apache.org/job/Tez-Build-Hadoop3/ws/hadoop-shim-impls/hadoop-shim-2.8/src/test/resources>
[INFO] 
[INFO] --- maven-compiler-plugin:3.1:testCompile (default-testCompile) @ hadoop-shim-2.8 ---
[INFO] Changes detected - recompiling the module!
[INFO] Compiling 2 source files to <https://builds.apache.org/job/Tez-Build-Hadoop3/ws/hadoop-shim-impls/hadoop-shim-2.8/target/test-classes>
[INFO] 
[INFO] --- maven-surefire-plugin:3.0.0-M1:test (default-test) @ hadoop-shim-2.8 ---
[INFO] Tests are skipped.
[INFO] 
[INFO] ------------------------------------------------------------------------
[INFO] Skipping tez-dist
[INFO] This project has been banned from the build due to previous failures.
[INFO] ------------------------------------------------------------------------
[INFO] 
[INFO] ----------------------< org.apache.tez:tez-docs >-----------------------
[INFO] Building Tez 0.10.1-SNAPSHOT                                     [11/29]
[INFO] --------------------------------[ pom ]---------------------------------
[INFO] 
[INFO] --- maven-clean-plugin:3.0.0:clean (default-clean) @ tez-docs ---
[INFO] 
[INFO] --- buildnumber-maven-plugin:1.1:create (default) @ tez-docs ---
[INFO] Checking for local modifications: skipped.
[INFO] Updating project files from SCM: skipped.
[INFO] Executing: /bin/sh -c cd <https://builds.apache.org/job/Tez-Build-Hadoop3/ws/docs>
&& git rev-parse --verify HEAD
[INFO] Working directory: <https://builds.apache.org/job/Tez-Build-Hadoop3/ws/docs>
[INFO] Storing buildNumber: 5b81017a4d11c09cfa0180e3d56e22c22744559b at timestamp: 1579668038254
[INFO] Executing: /bin/sh -c cd <https://builds.apache.org/job/Tez-Build-Hadoop3/ws/docs>
&& git rev-parse --verify HEAD
[INFO] Working directory: <https://builds.apache.org/job/Tez-Build-Hadoop3/ws/docs>
[INFO] Storing buildScmBranch: UNKNOWN
[INFO] 
[INFO] --- build-helper-maven-plugin:1.8:maven-version (maven-version) @ tez-docs ---
[INFO] ------------------------------------------------------------------------
[INFO] Reactor Summary for tez 0.10.1-SNAPSHOT:
[INFO] 
[INFO] tez ................................................ SUCCESS [  1.087 s]
[INFO] hadoop-shim ........................................ SUCCESS [  1.656 s]
[INFO] tez-api ............................................ FAILURE [  0.242 s]
[INFO] tez-build-tools .................................... SUCCESS [  0.036 s]
[INFO] tez-common ......................................... SKIPPED
[INFO] tez-runtime-internals .............................. SKIPPED
[INFO] tez-runtime-library ................................ SKIPPED
[INFO] tez-mapreduce ...................................... SKIPPED
[INFO] tez-examples ....................................... SKIPPED
[INFO] tez-dag ............................................ SKIPPED
[INFO] tez-tests .......................................... SKIPPED
[INFO] tez-ext-service-tests .............................. SKIPPED
[INFO] tez-ui ............................................. SUCCESS [01:15 min]
[INFO] tez-plugins ........................................ SUCCESS [  0.017 s]
[INFO] tez-protobuf-history-plugin ........................ SKIPPED
[INFO] tez-yarn-timeline-history .......................... SKIPPED
[INFO] tez-yarn-timeline-history-with-acls ................ SKIPPED
[INFO] tez-yarn-timeline-cache-plugin ..................... SKIPPED
[INFO] tez-yarn-timeline-history-with-fs .................. SKIPPED
[INFO] tez-history-parser ................................. SKIPPED
[INFO] tez-aux-services ................................... SKIPPED
[INFO] tez-tools .......................................... SUCCESS [  0.017 s]
[INFO] tez-perf-analyzer .................................. SUCCESS [  0.016 s]
[INFO] tez-job-analyzer ................................... SKIPPED
[INFO] tez-javadoc-tools .................................. SKIPPED
[INFO] hadoop-shim-impls .................................. SUCCESS [  0.017 s]
[INFO] hadoop-shim-2.8 .................................... SUCCESS [  0.293 s]
[INFO] tez-dist ........................................... SKIPPED
[INFO] Tez ................................................ SUCCESS [  0.028 s]
[INFO] ------------------------------------------------------------------------
[INFO] BUILD FAILURE
[INFO] ------------------------------------------------------------------------
[INFO] Total time:  01:19 min
[INFO] Finished at: 2020-01-22T04:40:38Z
[INFO] ------------------------------------------------------------------------
[ERROR] Failed to execute goal org.apache.hadoop:hadoop-maven-plugins:3.0.0-alpha2:protoc
(compile-protoc) on project tez-api: org.apache.maven.plugin.MojoExecutionException: protoc
version is 'libprotoc 3.0.0', expected version is '2.5.0' -> [Help 1]
[ERROR] 
[ERROR] To see the full stack trace of the errors, re-run Maven with the -e switch.
[ERROR] Re-run Maven using the -X switch to enable full debug logging.
[ERROR] 
[ERROR] For more information about the errors and possible solutions, please read the following
articles:
[ERROR] [Help 1] http://cwiki.apache.org/confluence/display/MAVEN/MojoExecutionException
[ERROR] 
[ERROR] After correcting the problems, you can resume the build with the command
[ERROR]   mvn <args> -rf :tez-api
Build step 'Execute shell' marked build as failure

Mime
View raw message