thrift-user mailing list archives

Site index · List index
Message view « Date » · « Thread »
Top « Date » · « Thread »
From C Potter <cabin.pot...@gmail.com>
Subject problem building on mac
Date Sat, 28 Dec 2013 14:37:57 GMT
Hi,

I downloaded and ran configure according to the readme.  Next, I tried to
build, but ran into these problems.  Anybody have any ideas?

/Users/trentjeff/Downloads/thrift-0.9.1/lib/rb/Rakefile:23
(See full trace by running task with --trace)
make[4]: *** [install-exec-hook] Error 1
make[3]: *** [install-exec-am] Error 2
make[2]: *** [install-am] Error 2
make[1]: *** [install-recursive] Error 1
make: *** [install-recursive] Error 1

Mime
  • Unnamed multipart/alternative (inline, None, 0 bytes)
View raw message