tika-dev mailing list archives

Site index · List index
Message view « Date » · « Thread »
Top « Date » · « Thread »
From Apache Hudson Server <hud...@hudson.zones.apache.org>
Subject Build failed in Hudson: Tika-trunk #265
Date Sun, 07 Feb 2010 00:11:58 GMT
See <http://hudson.zones.apache.org/hudson/job/Tika-trunk/265/>

------------------------------------------
[...truncated 878 lines...]
[HUDSON] Recording test results
[INFO] [bundle:bundle]
[TASKS] Skipping maven reporter: there is already a result available.
[INFO] [install:install]
[INFO] Installing <http://hudson.zones.apache.org/hudson/job/Tika-trunk/ws/trunk/tika-app/target/tika-app-0.7-SNAPSHOT.jar>
to /export/home/hudson/.m2/repository/org/apache/tika/tika-app/0.7-SNAPSHOT/tika-app-0.7-SNAPSHOT.jar
[TASKS] Skipping maven reporter: there is already a result available.
[INFO] [bundle:install]
[INFO] Parsing file:/export/home/hudson/.m2/repository/repository.xml
[Fatal Error] :-1:-1: Premature end of file.
org.xml.sax.SAXParseException: Premature end of file.
	at com.sun.org.apache.xerces.internal.parsers.DOMParser.parse(DOMParser.java:264)
	at com.sun.org.apache.xerces.internal.jaxp.DocumentBuilderImpl.parse(DocumentBuilderImpl.java:292)
	at javax.xml.parsers.DocumentBuilder.parse(DocumentBuilder.java:172)
	at org.apache.felix.obrplugin.ObrUpdate.parseFile(ObrUpdate.java:347)
	at org.apache.felix.obrplugin.ObrUpdate.parseRepositoryXml(ObrUpdate.java:324)
	at org.apache.felix.obrplugin.ObrInstall.execute(ObrInstall.java:140)
	at org.apache.maven.plugin.DefaultPluginManager.executeMojo(DefaultPluginManager.java:451)
	at hudson.maven.agent.PluginManagerInterceptor.executeMojo(PluginManagerInterceptor.java:182)
	at org.apache.maven.lifecycle.DefaultLifecycleExecutor.executeGoals(DefaultLifecycleExecutor.java:558)
	at org.apache.maven.lifecycle.DefaultLifecycleExecutor.executeGoalWithLifecycle(DefaultLifecycleExecutor.java:499)
	at org.apache.maven.lifecycle.DefaultLifecycleExecutor.executeGoal(DefaultLifecycleExecutor.java:478)
	at org.apache.maven.lifecycle.DefaultLifecycleExecutor.executeGoalAndHandleFailures(DefaultLifecycleExecutor.java:330)
	at org.apache.maven.lifecycle.DefaultLifecycleExecutor.executeTaskSegments(DefaultLifecycleExecutor.java:291)
	at org.apache.maven.lifecycle.DefaultLifecycleExecutor.execute(DefaultLifecycleExecutor.java:142)
	at org.apache.maven.lifecycle.LifecycleExecutorInterceptor.execute(LifecycleExecutorInterceptor.java:65)
	at org.apache.maven.DefaultMaven.doExecute(DefaultMaven.java:336)
	at org.apache.maven.DefaultMaven.execute(DefaultMaven.java:129)
	at org.apache.maven.cli.MavenCli.main(MavenCli.java:287)
	at sun.reflect.NativeMethodAccessorImpl.invoke0(Native Method)
	at sun.reflect.NativeMethodAccessorImpl.invoke(NativeMethodAccessorImpl.java:39)
	at sun.reflect.DelegatingMethodAccessorImpl.invoke(DelegatingMethodAccessorImpl.java:25)
	at java.lang.reflect.Method.invoke(Method.java:585)
	at org.codehaus.classworlds.Launcher.launchEnhanced(Launcher.java:315)
	at org.codehaus.classworlds.Launcher.launch(Launcher.java:255)
	at hudson.maven.agent.Main.launch(Main.java:165)
	at hudson.maven.MavenBuilder.call(MavenBuilder.java:159)
	at hudson.maven.MavenModuleSetBuild$Builder.call(MavenModuleSetBuild.java:688)
	at hudson.maven.MavenModuleSetBuild$Builder.call(MavenModuleSetBuild.java:632)
	at hudson.remoting.UserRequest.perform(UserRequest.java:104)
	at hudson.remoting.UserRequest.perform(UserRequest.java:48)
	at hudson.remoting.Request$2.run(Request.java:270)
	at java.util.concurrent.Executors$RunnableAdapter.call(Executors.java:417)
	at java.util.concurrent.FutureTask$Sync.innerRun(FutureTask.java:269)
	at java.util.concurrent.FutureTask.run(FutureTask.java:123)
	at java.util.concurrent.ThreadPoolExecutor$Worker.runTask(ThreadPoolExecutor.java:650)
	at java.util.concurrent.ThreadPoolExecutor$Worker.run(ThreadPoolExecutor.java:675)
	at java.lang.Thread.run(Thread.java:595)
[INFO] Writing OBR metadata
[TASKS] Skipping maven reporter: there is already a result available.
[INFO] [deploy:deploy]
[INFO] Retrieving previous build number from apache.snapshots.https
Uploading: https://repository.apache.org/content/repositories/snapshots/org/apache/tika/tika-app/0.7-SNAPSHOT/tika-app-0.7-20100207.000741-11.jar
15347K uploaded
[INFO] Retrieving previous metadata from apache.snapshots.https
[INFO] Uploading repository metadata for: 'artifact org.apache.tika:tika-app'
[INFO] Uploading project information for tika-app 0.7-20100207.000741-11
[INFO] Retrieving previous metadata from apache.snapshots.https
[INFO] Uploading repository metadata for: 'snapshot org.apache.tika:tika-app:0.7-SNAPSHOT'
[TASKS] Skipping maven reporter: there is already a result available.
[INFO] [bundle:deploy]
[INFO] Remote OBR update disabled (enable with -DremoteOBR)
[TASKS] Skipping maven reporter: there is already a result available.
[HUDSON] Archiving <http://hudson.zones.apache.org/hudson/job/Tika-trunk/ws/trunk/tika-app/pom.xml>
to /export/home/hudson/hudson/jobs/Tika-trunk/modules/org.apache.tika$tika-app/builds/2010-02-07_00-07-23/archive/org.apache.tika/tika-app/0.7-SNAPSHOT/pom.xml
[HUDSON] Archiving <http://hudson.zones.apache.org/hudson/job/Tika-trunk/ws/trunk/tika-app/target/tika-app-0.7-SNAPSHOT.jar>
to /export/home/hudson/hudson/jobs/Tika-trunk/modules/org.apache.tika$tika-app/builds/2010-02-07_00-07-23/archive/org.apache.tika/tika-app/0.7-20100207.000741-11/tika-app-0.7-SNAPSHOT.jar
[INFO] ------------------------------------------------------------------------
[INFO] Building Apache Tika OSGi bundle
[INFO]    task-segment: [clean, deploy]
[INFO] ------------------------------------------------------------------------
[INFO] [clean:clean]
[TASKS] Skipping non-existent folder '<http://hudson.zones.apache.org/hudson/job/Tika-trunk/ws/trunk/tika-bundle/src/main/java'...>
[TASKS] Skipping non-existent folder '<http://hudson.zones.apache.org/hudson/job/Tika-trunk/ws/trunk/tika-bundle/src/main/resources'...>
[INFO] [remote-resources:process {execution: default}]
[TASKS] Skipping maven reporter: there is already a result available.
[INFO] [resources:resources]
[INFO] Using 'UTF-8' encoding to copy filtered resources.
[INFO] skip non existing resourceDirectory <http://hudson.zones.apache.org/hudson/job/Tika-trunk/ws/trunk/tika-bundle/src/main/resources>
[INFO] Copying 3 resources
[TASKS] Skipping maven reporter: there is already a result available.
[INFO] [compiler:compile]
[INFO] No sources to compile
[INFO] [resources:testResources]
[INFO] Using 'UTF-8' encoding to copy filtered resources.
[INFO] skip non existing resourceDirectory <http://hudson.zones.apache.org/hudson/job/Tika-trunk/ws/trunk/tika-bundle/src/test/resources>
[INFO] Copying 3 resources
[TASKS] Skipping maven reporter: there is already a result available.
[TASKS] Skipping maven reporter: there is already a result available.
[INFO] [compiler:testCompile]
[INFO] No sources to compile
[TASKS] Skipping maven reporter: there is already a result available.
[INFO] [surefire:test]
[INFO] Surefire report directory: <http://hudson.zones.apache.org/hudson/job/Tika-trunk/ws/trunk/tika-bundle/target/surefire-reports>

-------------------------------------------------------
 T E S T S
-------------------------------------------------------
There are no tests to run.

Results :

Tests run: 0, Failures: 0, Errors: 0, Skipped: 0

[TASKS] Skipping maven reporter: there is already a result available.
[HUDSON] Recording test results
[INFO] [bundle:bundle]
[TASKS] Skipping maven reporter: there is already a result available.
[INFO] [install:install]
[INFO] Installing <http://hudson.zones.apache.org/hudson/job/Tika-trunk/ws/trunk/tika-bundle/target/tika-bundle-0.7-SNAPSHOT.jar>
to /export/home/hudson/.m2/repository/org/apache/tika/tika-bundle/0.7-SNAPSHOT/tika-bundle-0.7-SNAPSHOT.jar
[TASKS] Skipping maven reporter: there is already a result available.
[INFO] [bundle:install]
[INFO] Parsing file:/export/home/hudson/.m2/repository/repository.xml
[Fatal Error] :-1:-1: Premature end of file.
org.xml.sax.SAXParseException: Premature end of file.
	at com.sun.org.apache.xerces.internal.parsers.DOMParser.parse(DOMParser.java:264)
	at com.sun.org.apache.xerces.internal.jaxp.DocumentBuilderImpl.parse(DocumentBuilderImpl.java:292)
	at javax.xml.parsers.DocumentBuilder.parse(DocumentBuilder.java:172)
	at org.apache.felix.obrplugin.ObrUpdate.parseFile(ObrUpdate.java:347)
	at org.apache.felix.obrplugin.ObrUpdate.parseRepositoryXml(ObrUpdate.java:324)
	at org.apache.felix.obrplugin.ObrInstall.execute(ObrInstall.java:140)
	at org.apache.maven.plugin.DefaultPluginManager.executeMojo(DefaultPluginManager.java:451)
	at hudson.maven.agent.PluginManagerInterceptor.executeMojo(PluginManagerInterceptor.java:182)
	at org.apache.maven.lifecycle.DefaultLifecycleExecutor.executeGoals(DefaultLifecycleExecutor.java:558)
	at org.apache.maven.lifecycle.DefaultLifecycleExecutor.executeGoalWithLifecycle(DefaultLifecycleExecutor.java:499)
	at org.apache.maven.lifecycle.DefaultLifecycleExecutor.executeGoal(DefaultLifecycleExecutor.java:478)
	at org.apache.maven.lifecycle.DefaultLifecycleExecutor.executeGoalAndHandleFailures(DefaultLifecycleExecutor.java:330)
	at org.apache.maven.lifecycle.DefaultLifecycleExecutor.executeTaskSegments(DefaultLifecycleExecutor.java:291)
	at org.apache.maven.lifecycle.DefaultLifecycleExecutor.execute(DefaultLifecycleExecutor.java:142)
	at org.apache.maven.lifecycle.LifecycleExecutorInterceptor.execute(LifecycleExecutorInterceptor.java:65)
	at org.apache.maven.DefaultMaven.doExecute(DefaultMaven.java:336)
	at org.apache.maven.DefaultMaven.execute(DefaultMaven.java:129)
	at org.apache.maven.cli.MavenCli.main(MavenCli.java:287)
	at sun.reflect.NativeMethodAccessorImpl.invoke0(Native Method)
	at sun.reflect.NativeMethodAccessorImpl.invoke(NativeMethodAccessorImpl.java:39)
	at sun.reflect.DelegatingMethodAccessorImpl.invoke(DelegatingMethodAccessorImpl.java:25)
	at java.lang.reflect.Method.invoke(Method.java:585)
	at org.codehaus.classworlds.Launcher.launchEnhanced(Launcher.java:315)
	at org.codehaus.classworlds.Launcher.launch(Launcher.java:255)
	at hudson.maven.agent.Main.launch(Main.java:165)
	at hudson.maven.MavenBuilder.call(MavenBuilder.java:159)
	at hudson.maven.MavenModuleSetBuild$Builder.call(MavenModuleSetBuild.java:688)
	at hudson.maven.MavenModuleSetBuild$Builder.call(MavenModuleSetBuild.java:632)
	at hudson.remoting.UserRequest.perform(UserRequest.java:104)
	at hudson.remoting.UserRequest.perform(UserRequest.java:48)
	at hudson.remoting.Request$2.run(Request.java:270)
	at java.util.concurrent.Executors$RunnableAdapter.call(Executors.java:417)
	at java.util.concurrent.FutureTask$Sync.innerRun(FutureTask.java:269)
	at java.util.concurrent.FutureTask.run(FutureTask.java:123)
	at java.util.concurrent.ThreadPoolExecutor$Worker.runTask(ThreadPoolExecutor.java:650)
	at java.util.concurrent.ThreadPoolExecutor$Worker.run(ThreadPoolExecutor.java:675)
	at java.lang.Thread.run(Thread.java:595)
[INFO] Writing OBR metadata
[TASKS] Skipping maven reporter: there is already a result available.
[INFO] [deploy:deploy]
[INFO] Retrieving previous build number from apache.snapshots.https
Uploading: https://repository.apache.org/content/repositories/snapshots/org/apache/tika/tika-bundle/0.7-SNAPSHOT/tika-bundle-0.7-20100207.000741-11.jar
10231K uploaded
[INFO] Retrieving previous metadata from apache.snapshots.https
[INFO] Uploading repository metadata for: 'artifact org.apache.tika:tika-bundle'
[INFO] Retrieving previous metadata from apache.snapshots.https
[INFO] Uploading repository metadata for: 'snapshot org.apache.tika:tika-bundle:0.7-SNAPSHOT'
[INFO] Uploading project information for tika-bundle 0.7-20100207.000741-11
[TASKS] Skipping maven reporter: there is already a result available.
[INFO] [bundle:deploy]
[INFO] Remote OBR update disabled (enable with -DremoteOBR)
[TASKS] Skipping maven reporter: there is already a result available.
[HUDSON] Archiving <http://hudson.zones.apache.org/hudson/job/Tika-trunk/ws/trunk/tika-bundle/pom.xml>
to /export/home/hudson/hudson/jobs/Tika-trunk/modules/org.apache.tika$tika-bundle/builds/2010-02-07_00-07-23/archive/org.apache.tika/tika-bundle/0.7-SNAPSHOT/pom.xml
[HUDSON] Archiving <http://hudson.zones.apache.org/hudson/job/Tika-trunk/ws/trunk/tika-bundle/target/tika-bundle-0.7-SNAPSHOT.jar>
to /export/home/hudson/hudson/jobs/Tika-trunk/modules/org.apache.tika$tika-bundle/builds/2010-02-07_00-07-23/archive/org.apache.tika/tika-bundle/0.7-20100207.000741-11/tika-bundle-0.7-SNAPSHOT.jar
[INFO] ------------------------------------------------------------------------
[INFO] Building Apache Tika
[INFO]    task-segment: [clean, deploy]
[INFO] ------------------------------------------------------------------------
[INFO] [clean:clean]
[TASKS] Skipping non-existent folder '<http://hudson.zones.apache.org/hudson/job/Tika-trunk/ws/trunk/src/main/java'...>
[TASKS] Skipping non-existent folder '<http://hudson.zones.apache.org/hudson/job/Tika-trunk/ws/trunk/src/main/resources'...>
[INFO] [remote-resources:process {execution: default}]
[TASKS] Skipping maven reporter: there is already a result available.
[INFO] [site:attach-descriptor]
[TASKS] Skipping maven reporter: there is already a result available.
[INFO] [install:install]
[INFO] Installing <http://hudson.zones.apache.org/hudson/job/Tika-trunk/ws/trunk/pom.xml>
to /export/home/hudson/.m2/repository/org/apache/tika/tika/0.7-SNAPSHOT/tika-0.7-SNAPSHOT.pom
[TASKS] Skipping maven reporter: there is already a result available.
[INFO] [deploy:deploy]
[INFO]  skipping artifact deployement 
[TASKS] Skipping maven reporter: there is already a result available.
[HUDSON] Archiving <http://hudson.zones.apache.org/hudson/job/Tika-trunk/ws/trunk/pom.xml>
to /export/home/hudson/hudson/jobs/Tika-trunk/modules/org.apache.tika$tika/builds/2010-02-07_00-07-23/archive/org.apache.tika/tika/0.7-SNAPSHOT/pom.xml
[INFO] 
[INFO] 
[INFO] ------------------------------------------------------------------------
[INFO] Reactor Summary:
[INFO] ------------------------------------------------------------------------
[INFO] Apache Tika parent .................................... SUCCESS [32.964s]
[INFO] Apache Tika core ...................................... SUCCESS [39.838s]
[INFO] Apache Tika parsers ................................... SUCCESS [1:23.586s]
[INFO] Apache Tika application ............................... SUCCESS [1:08.230s]
[INFO] Apache Tika OSGi bundle ............................... SUCCESS [36.128s]
[INFO] Apache Tika ........................................... SUCCESS [0.591s]
[INFO] ------------------------------------------------------------------------
[INFO] ------------------------------------------------------------------------
[INFO] BUILD SUCCESSFUL
[INFO] ------------------------------------------------------------------------
[INFO] Total time: 4 minutes 24 seconds
[INFO] Finished at: Sun Feb 07 00:11:51 UTC 2010
[INFO] Final Memory: 28M/236M
[INFO] ------------------------------------------------------------------------
Waiting for Hudson to finish collecting data
channel stopped
[trunk] $ /home/hudson/tools/maven/latest2/bin/mvn -e -B -f pom.xml -Dsonar.jdbc.driver=org.postgresql.Driver
-Dsonar.jdbc.username=sonar -Dsonar.jdbc.password=fx02nt2h -Dsonar.jdbc.url=jdbc:postgresql://sonar.zitting.name/sonar
-Dsonar.host.url=http://sonar.zitting.name/ sonar:sonar
+ Error stacktraces are turned on.
[INFO] Scanning for projects...
[INFO] Reactor build order: 
[INFO]   Apache Tika parent
[INFO]   Apache Tika core
[INFO]   Apache Tika parsers
[INFO]   Apache Tika application
[INFO]   Apache Tika OSGi bundle
[INFO]   Apache Tika
[INFO] Searching repository for plugin with prefix: 'sonar'.
[INFO] ------------------------------------------------------------------------
[ERROR] BUILD ERROR
[INFO] ------------------------------------------------------------------------
[INFO] The plugin 'org.apache.maven.plugins:maven-sonar-plugin' does not exist or no valid
version could be found
[INFO] ------------------------------------------------------------------------
[INFO] Trace
org.apache.maven.lifecycle.LifecycleExecutionException: The plugin 'org.apache.maven.plugins:maven-sonar-plugin'
does not exist or no valid version could be found
	at org.apache.maven.lifecycle.DefaultLifecycleExecutor.verifyPlugin(DefaultLifecycleExecutor.java:1303)
	at org.apache.maven.lifecycle.DefaultLifecycleExecutor.getMojoDescriptor(DefaultLifecycleExecutor.java:1542)
	at org.apache.maven.lifecycle.DefaultLifecycleExecutor.segmentTaskListByAggregationNeeds(DefaultLifecycleExecutor.java:405)
	at org.apache.maven.lifecycle.DefaultLifecycleExecutor.execute(DefaultLifecycleExecutor.java:137)
	at org.apache.maven.DefaultMaven.doExecute(DefaultMaven.java:336)
	at org.apache.maven.DefaultMaven.execute(DefaultMaven.java:129)
	at org.apache.maven.cli.MavenCli.main(MavenCli.java:287)
	at sun.reflect.NativeMethodAccessorImpl.invoke0(Native Method)
	at sun.reflect.NativeMethodAccessorImpl.invoke(NativeMethodAccessorImpl.java:39)
	at sun.reflect.DelegatingMethodAccessorImpl.invoke(DelegatingMethodAccessorImpl.java:25)
	at java.lang.reflect.Method.invoke(Method.java:585)
	at org.codehaus.classworlds.Launcher.launchEnhanced(Launcher.java:315)
	at org.codehaus.classworlds.Launcher.launch(Launcher.java:255)
	at org.codehaus.classworlds.Launcher.mainWithExitCode(Launcher.java:430)
	at org.codehaus.classworlds.Launcher.main(Launcher.java:375)
Caused by: org.apache.maven.plugin.version.PluginVersionNotFoundException: The plugin 'org.apache.maven.plugins:maven-sonar-plugin'
does not exist or no valid version could be found
	at org.apache.maven.plugin.version.DefaultPluginVersionManager.resolvePluginVersion(DefaultPluginVersionManager.java:229)
	at org.apache.maven.plugin.version.DefaultPluginVersionManager.resolvePluginVersion(DefaultPluginVersionManager.java:91)
	at org.apache.maven.plugin.DefaultPluginManager.verifyPlugin(DefaultPluginManager.java:171)
	at org.apache.maven.lifecycle.DefaultLifecycleExecutor.verifyPlugin(DefaultLifecycleExecutor.java:1274)
	... 14 more
[INFO] ------------------------------------------------------------------------
[INFO] Total time: 2 seconds
[INFO] Finished at: Sun Feb 07 00:11:57 UTC 2010
[INFO] Final Memory: 5M/162M
[INFO] ------------------------------------------------------------------------


Mime
View raw message