tika-dev mailing list archives

Site index · List index
Message view « Date » · « Thread »
Top « Date » · « Thread »
From Apache Hudson Server <hud...@hudson.zones.apache.org>
Subject Build failed in Hudson: Tika-trunk #319
Date Wed, 14 Jul 2010 23:17:22 GMT
See <http://hudson.zones.apache.org/hudson/job/Tika-trunk/319/changes>

Changes:

[nick] TIKA-451 - Inconsistent date format for Metadata.CREATION_DATE and Metadata.LAST_MODIFIED
Make CREATION_DATE and LAST_MODIFIED Date property instances, and add support for getting
and setting Dates (+getting ints), as discussed in TIKA-451
Unit tests for getting and settings ints and dates are included. Work to update the existing
parsers to make use of the new Date setter is still outstanding

------------------------------------------
[...truncated 589 lines...]
[INFO] [remote-resources:process {execution: default}]
[TASKS] Skipping maven reporter: there is already a result available.
[INFO] [resources:resources]
[INFO] Using 'UTF-8' encoding to copy filtered resources.
[INFO] Copying 19 resources
[INFO] Copying 3 resources
[TASKS] Skipping maven reporter: there is already a result available.
[INFO] [compiler:compile]
[INFO] Compiling 101 source files to <http://hudson.zones.apache.org/hudson/job/Tika-trunk/ws/trunk/tika-core/target/classes>
[TASKS] Skipping maven reporter: there is already a result available.[INFO] [resources:testResources]
[INFO] Using 'UTF-8' encoding to copy filtered resources.
[INFO] Copying 28 resources
[INFO] Copying 3 resources

[INFO] [TASKS] Skipping maven reporter: there is already a result available.[compiler:testCompile]
[INFO] Compiling 23 source files to <http://hudson.zones.apache.org/hudson/job/Tika-trunk/ws/trunk/tika-core/target/test-classes>

[TASKS] Skipping maven reporter: there is already a result available.
[INFO] [surefire:test]
[INFO] Surefire report directory: <http://hudson.zones.apache.org/hudson/job/Tika-trunk/ws/trunk/tika-core/target/surefire-reports>

-------------------------------------------------------
 T E S T S
-------------------------------------------------------
Running org.apache.tika.TestRereadableInputStream
Tests run: 3, Failures: 0, Errors: 0, Skipped: 0, Time elapsed: 0.03 sec
Running org.apache.tika.sax.SecureContentHandlerTest
Tests run: 6, Failures: 0, Errors: 0, Skipped: 0, Time elapsed: 0.24 sec
Running org.apache.tika.sax.xpath.XPathParserTest
Tests run: 7, Failures: 0, Errors: 0, Skipped: 0, Time elapsed: 0.011 sec
Running org.apache.tika.io.TikaInputStreamTest
Tests run: 2, Failures: 0, Errors: 0, Skipped: 0, Time elapsed: 0.027 sec
Running org.apache.tika.mime.MediaTypeTest
Tests run: 7, Failures: 0, Errors: 0, Skipped: 0, Time elapsed: 0.01 sec
Running org.apache.tika.metadata.TestMetadata
Tests run: 10, Failures: 0, Errors: 0, Skipped: 0, Time elapsed: 0.018 sec
Running org.apache.tika.language.LanguageIdentifierTest
Tests run: 3, Failures: 0, Errors: 0, Skipped: 0, Time elapsed: 2.092 sec
Running org.apache.tika.utils.CharsetUtilsTest
Tests run: 4, Failures: 0, Errors: 0, Skipped: 0, Time elapsed: 0.033 sec
Running org.apache.tika.mime.MimeDetectionTest
Tests run: 3, Failures: 0, Errors: 0, Skipped: 0, Time elapsed: 0.988 sec
Running org.apache.tika.sax.SafeContentHandlerTest
Tests run: 5, Failures: 0, Errors: 0, Skipped: 0, Time elapsed: 0.006 sec
Running org.apache.tika.metadata.TestMetadataHelper
Tests run: 1, Failures: 0, Errors: 0, Skipped: 0, Time elapsed: 0.003 sec
Running org.apache.tika.detect.TypeDetectorTest
Tests run: 1, Failures: 0, Errors: 0, Skipped: 0, Time elapsed: 0.004 sec
Running org.apache.tika.sax.XHTMLContentHandlerTest
Tests run: 1, Failures: 0, Errors: 0, Skipped: 0, Time elapsed: 0.006 sec
Running org.apache.tika.sax.OfflineContentHandlerTest
Tests run: 2, Failures: 0, Errors: 0, Skipped: 0, Time elapsed: 0.005 sec
Running org.apache.tika.language.LanguageProfileTest
Tests run: 1, Failures: 0, Errors: 0, Skipped: 0, Time elapsed: 0.003 sec
Running org.apache.tika.language.ProfilingWriterTest
Tests run: 1, Failures: 0, Errors: 0, Skipped: 0, Time elapsed: 0.004 sec
Running org.apache.tika.TikaTest
Tests run: 1, Failures: 0, Errors: 0, Skipped: 0, Time elapsed: 0.144 sec
Running org.apache.tika.detect.NameDetectorTest
Tests run: 1, Failures: 0, Errors: 0, Skipped: 0, Time elapsed: 0.005 sec
Running org.apache.tika.detect.MagicDetectorTest
Tests run: 4, Failures: 0, Errors: 0, Skipped: 0, Time elapsed: 0.005 sec
Running org.apache.tika.detect.TextDetectorTest
Tests run: 2, Failures: 0, Errors: 0, Skipped: 0, Time elapsed: 0.003 sec
Running org.apache.tika.sax.BodyContentHandlerTest
Tests run: 1, Failures: 0, Errors: 0, Skipped: 0, Time elapsed: 0.001 sec
Running org.apache.tika.utils.RegexUtilsTest
Tests run: 3, Failures: 0, Errors: 0, Skipped: 0, Time elapsed: 0.005 sec

Results :

Tests run: 69, Failures: 0, Errors: 0, Skipped: 0

[TASKS] Skipping maven reporter: there is already a result available.
[HUDSON] Recording test results
[INFO] [bundle:bundle]
[TASKS] Skipping maven reporter: there is already a result available.[INFO] [install:install]
[INFO] Installing <http://hudson.zones.apache.org/hudson/job/Tika-trunk/ws/trunk/tika-core/target/tika-core-0.8-SNAPSHOT.jar>
to /home/hudson/.m2/repository/org/apache/tika/tika-core/0.8-SNAPSHOT/tika-core-0.8-SNAPSHOT.jar

[TASKS] Skipping maven reporter: there is already a result available.[INFO] [bundle:install]
[INFO] Parsing file:/home/hudson/.m2/repository/repository.xml
[Fatal Error] :-1:-1: Premature end of file.
org.xml.sax.SAXParseException: Premature end of file.
	at com.sun.org.apache.xerces.internal.parsers.DOMParser.parse(DOMParser.java:264)
	at com.sun.org.apache.xerces.internal.jaxp.DocumentBuilderImpl.parse(DocumentBuilderImpl.java:292)
	at javax.xml.parsers.DocumentBuilder.parse(DocumentBuilder.java:172)
	at org.apache.felix.obrplugin.ObrUpdate.parseFile(ObrUpdate.java:347)
	at org.apache.felix.obrplugin.ObrUpdate.parseRepositoryXml(ObrUpdate.java:324)
	at org.apache.felix.obrplugin.ObrInstall.execute(ObrInstall.java:140)
	at org.apache.maven.plugin.DefaultPluginManager.executeMojo(DefaultPluginManager.java:451)
	at hudson.maven.agent.PluginManagerInterceptor.executeMojo(PluginManagerInterceptor.java:182)
	at org.apache.maven.lifecycle.DefaultLifecycleExecutor.executeGoals(DefaultLifecycleExecutor.java:558)
	at org.apache.maven.lifecycle.DefaultLifecycleExecutor.executeGoalWithLifecycle(DefaultLifecycleExecutor.java:499)
	at org.apache.maven.lifecycle.DefaultLifecycleExecutor.executeGoal(DefaultLifecycleExecutor.java:478)
	at org.apache.maven.lifecycle.DefaultLifecycleExecutor.executeGoalAndHandleFailures(DefaultLifecycleExecutor.java:330)
	at org.apache.maven.lifecycle.DefaultLifecycleExecutor.executeTaskSegments(DefaultLifecycleExecutor.java:291)
	at org.apache.maven.lifecycle.DefaultLifecycleExecutor.execute(DefaultLifecycleExecutor.java:142)
	at org.apache.maven.lifecycle.LifecycleExecutorInterceptor.execute(LifecycleExecutorInterceptor.java:65)
	at org.apache.maven.DefaultMaven.doExecute(DefaultMaven.java:336)
	at org.apache.maven.DefaultMaven.execute(DefaultMaven.java:129)
	at org.apache.maven.cli.MavenCli.main(MavenCli.java:287)
	at sun.reflect.NativeMethodAccessorImpl.invoke0(Native Method)
	at sun.reflect.NativeMethodAccessorImpl.invoke(NativeMethodAccessorImpl.java:39)
	at sun.reflect.DelegatingMethodAccessorImpl.invoke(DelegatingMethodAccessorImpl.java:25)
	at java.lang.reflect.Method.invoke(Method.java:592)
	at org.codehaus.classworlds.Launcher.launchEnhanced(Launcher.java:315)
	at org.codehaus.classworlds.Launcher.launch(Launcher.java:255)
	at hudson.maven.agent.Main.launch(Main.java:165)
	at hudson.maven.MavenBuilder.call(MavenBuilder.java:165)
	at hudson.maven.MavenModuleSetBuild$Builder.call(MavenModuleSetBuild.java:696)
	at hudson.maven.MavenModuleSetBuild$Builder.call(MavenModuleSetBuild.java:640)
	at hudson.remoting.UserRequest.perform(UserRequest.java:114)
	at hudson.remoting.UserRequest.perform(UserRequest.java:48)
	at hudson.remoting.Request$2.run(Request.java:270)
	at java.util.concurrent.Executors$RunnableAdapter.call(Executors.java:417)
	at java.util.concurrent.FutureTask$Sync.innerRun(FutureTask.java:269)
	at java.util.concurrent.FutureTask.run(FutureTask.java:123)
	at java.util.concurrent.ThreadPoolExecutor$Worker.runTask(ThreadPoolExecutor.java:651)
	at java.util.concurrent.ThreadPoolExecutor$Worker.run(ThreadPoolExecutor.java:676)
	at java.lang.Thread.run(Thread.java:595)
[INFO] Writing OBR metadata

[TASKS] Skipping maven reporter: there is already a result available.[INFO] [deploy:deploy]
[INFO] Retrieving previous build number from apache.snapshots.https

Uploading: https://repository.apache.org/content/repositories/snapshots/org/apache/tika/tika-core/0.8-SNAPSHOT/tika-core-0.8-20100714.230240-25.jar
272K uploaded
[INFO] Uploading project information for tika-core 0.8-20100714.230240-25
[INFO] Retrieving previous metadata from apache.snapshots.https
[INFO] Uploading repository metadata for: 'snapshot org.apache.tika:tika-core:0.8-SNAPSHOT'
[INFO] Retrieving previous metadata from apache.snapshots.https
[INFO] Uploading repository metadata for: 'artifact org.apache.tika:tika-core'
[TASKS] Skipping maven reporter: there is already a result available.[INFO] [bundle:deploy]
[INFO] Remote OBR update disabled (enable with -DremoteOBR)

[TASKS] Skipping maven reporter: there is already a result available.
[HUDSON] Archiving <http://hudson.zones.apache.org/hudson/job/Tika-trunk/ws/trunk/tika-core/pom.xml>
to /export/home/hudson/hudson/jobs/Tika-trunk/modules/org.apache.tika$tika-core/builds/2010-07-14_23-02-08/archive/org.apache.tika/tika-core/0.8-SNAPSHOT/pom.xml
[HUDSON] Archiving <http://hudson.zones.apache.org/hudson/job/Tika-trunk/ws/trunk/tika-core/target/tika-core-0.8-SNAPSHOT.jar>
to /export/home/hudson/hudson/jobs/Tika-trunk/modules/org.apache.tika$tika-core/builds/2010-07-14_23-02-08/archive/org.apache.tika/tika-core/0.8-20100714.230240-25/tika-core-0.8-SNAPSHOT.jar
[INFO] ------------------------------------------------------------------------
[INFO] Building Apache Tika parsers
[INFO]    task-segment: [clean, deploy]
[INFO] ------------------------------------------------------------------------
[INFO] [clean:clean]
[TASKS] Scanning folder '<http://hudson.zones.apache.org/hudson/job/Tika-trunk/ws/trunk/tika-parsers/src/main/java'>
for tasks ... 
[TASKS] Found 49.
[TASKS] Scanning folder '<http://hudson.zones.apache.org/hudson/job/Tika-trunk/ws/trunk/tika-parsers/src/test/java'>
for tasks ... 
[TASKS] Found 16.
[TASKS] Scanning folder '<http://hudson.zones.apache.org/hudson/job/Tika-trunk/ws/trunk/tika-parsers/src/main/resources'>
for tasks ... 
[TASKS] Found 0.
[TASKS] Scanning folder '<http://hudson.zones.apache.org/hudson/job/Tika-trunk/ws/trunk/tika-parsers/src/test/resources'>
for tasks ... 
[TASKS] Found 0.
Downloading: http://download.java.net/maven/2//org/apache/pdfbox/pdfbox/1.2.1/pdfbox-1.2.1.pom
Downloading: http://ulisse.pin.unifi.it:8081/nexus/content/groups/open.repos/org/apache/pdfbox/pdfbox/1.2.1/pdfbox-1.2.1.pom
Downloading: http://repo1.maven.org/maven2/org/apache/pdfbox/pdfbox/1.2.1/pdfbox-1.2.1.pom
Downloading: http://download.java.net/maven/2//org/apache/pdfbox/pdfbox-parent/1.2.1/pdfbox-parent-1.2.1.pom
Downloading: http://ulisse.pin.unifi.it:8081/nexus/content/groups/open.repos/org/apache/pdfbox/pdfbox-parent/1.2.1/pdfbox-parent-1.2.1.pom
Downloading: http://repo1.maven.org/maven2/org/apache/pdfbox/pdfbox-parent/1.2.1/pdfbox-parent-1.2.1.pom
Downloading: http://download.java.net/maven/2//org/apache/pdfbox/fontbox/1.2.1/fontbox-1.2.1.pom
Downloading: http://ulisse.pin.unifi.it:8081/nexus/content/groups/open.repos/org/apache/pdfbox/fontbox/1.2.1/fontbox-1.2.1.pom
Downloading: http://repo1.maven.org/maven2/org/apache/pdfbox/fontbox/1.2.1/fontbox-1.2.1.pom
Downloading: http://download.java.net/maven/2//org/apache/pdfbox/jempbox/1.2.1/jempbox-1.2.1.pom
Downloading: http://ulisse.pin.unifi.it:8081/nexus/content/groups/open.repos/org/apache/pdfbox/jempbox/1.2.1/jempbox-1.2.1.pom
Downloading: http://repo1.maven.org/maven2/org/apache/pdfbox/jempbox/1.2.1/jempbox-1.2.1.pom
Downloading: http://download.java.net/maven/2//org/apache/poi/poi/3.7-beta1/poi-3.7-beta1.pom
Downloading: http://ulisse.pin.unifi.it:8081/nexus/content/groups/open.repos/org/apache/poi/poi/3.7-beta1/poi-3.7-beta1.pom
Downloading: http://repo1.maven.org/maven2/org/apache/poi/poi/3.7-beta1/poi-3.7-beta1.pom
Downloading: http://download.java.net/maven/2//org/apache/poi/poi-scratchpad/3.7-beta1/poi-scratchpad-3.7-beta1.pom
Downloading: http://ulisse.pin.unifi.it:8081/nexus/content/groups/open.repos/org/apache/poi/poi-scratchpad/3.7-beta1/poi-scratchpad-3.7-beta1.pom
Downloading: http://repo1.maven.org/maven2/org/apache/poi/poi-scratchpad/3.7-beta1/poi-scratchpad-3.7-beta1.pom
Downloading: http://download.java.net/maven/2//org/apache/poi/poi-ooxml/3.7-beta1/poi-ooxml-3.7-beta1.pom
Downloading: http://ulisse.pin.unifi.it:8081/nexus/content/groups/open.repos/org/apache/poi/poi-ooxml/3.7-beta1/poi-ooxml-3.7-beta1.pom
Downloading: http://repo1.maven.org/maven2/org/apache/poi/poi-ooxml/3.7-beta1/poi-ooxml-3.7-beta1.pom
Downloading: http://download.java.net/maven/2//org/apache/poi/poi-ooxml-schemas/3.7-beta1/poi-ooxml-schemas-3.7-beta1.pom
Downloading: http://ulisse.pin.unifi.it:8081/nexus/content/groups/open.repos/org/apache/poi/poi-ooxml-schemas/3.7-beta1/poi-ooxml-schemas-3.7-beta1.pom
Downloading: http://repo1.maven.org/maven2/org/apache/poi/poi-ooxml-schemas/3.7-beta1/poi-ooxml-schemas-3.7-beta1.pom
Downloading: http://download.java.net/maven/2//de/l3s/boilerpipe/boilerpipe/1.0.4/boilerpipe-1.0.4.pom
1K downloaded
[INFO] snapshot org.apache.tika:tika-core:0.8-SNAPSHOT: checking for updates from maven2-repository.dev.java.net
[INFO] snapshot org.apache.tika:tika-core:0.8-SNAPSHOT: checking for updates from netcdf-m2-repo
[WARNING] repository metadata for: 'snapshot org.apache.tika:tika-core:0.8-SNAPSHOT' could
not be retrieved from repository: netcdf-m2-repo due to an error: Error transferring file
[INFO] Repository 'netcdf-m2-repo' will be blacklisted
[INFO] snapshot org.apache.tika:tika-core:0.8-SNAPSHOT: checking for updates from apache.snapshots
Downloading: http://download.java.net/maven/2//org/apache/pdfbox/pdfbox/1.2.1/pdfbox-1.2.1.jar
Downloading: http://repo1.maven.org/maven2/org/apache/pdfbox/pdfbox/1.2.1/pdfbox-1.2.1.jar
Downloading: http://download.java.net/maven/2//org/apache/pdfbox/fontbox/1.2.1/fontbox-1.2.1.jar
Downloading: http://repo1.maven.org/maven2/org/apache/pdfbox/fontbox/1.2.1/fontbox-1.2.1.jar
Downloading: http://download.java.net/maven/2//org/apache/pdfbox/jempbox/1.2.1/jempbox-1.2.1.jar
Downloading: http://repo1.maven.org/maven2/org/apache/pdfbox/jempbox/1.2.1/jempbox-1.2.1.jar
Downloading: http://download.java.net/maven/2//org/apache/poi/poi/3.7-beta1/poi-3.7-beta1.jar
Downloading: http://repo1.maven.org/maven2/org/apache/poi/poi/3.7-beta1/poi-3.7-beta1.jar
Downloading: http://download.java.net/maven/2//org/apache/poi/poi-scratchpad/3.7-beta1/poi-scratchpad-3.7-beta1.jar
Downloading: http://repo1.maven.org/maven2/org/apache/poi/poi-scratchpad/3.7-beta1/poi-scratchpad-3.7-beta1.jar
Downloading: http://download.java.net/maven/2//org/apache/poi/poi-ooxml/3.7-beta1/poi-ooxml-3.7-beta1.jar
Downloading: http://repo1.maven.org/maven2/org/apache/poi/poi-ooxml/3.7-beta1/poi-ooxml-3.7-beta1.jar
Downloading: http://download.java.net/maven/2//org/apache/poi/poi-ooxml-schemas/3.7-beta1/poi-ooxml-schemas-3.7-beta1.jar
Downloading: http://repo1.maven.org/maven2/org/apache/poi/poi-ooxml-schemas/3.7-beta1/poi-ooxml-schemas-3.7-beta1.jar
Downloading: http://download.java.net/maven/2//de/l3s/boilerpipe/boilerpipe/1.0.4/boilerpipe-1.0.4.jar
71K downloaded
[INFO] [remote-resources:process {execution: default}]
[TASKS] Skipping maven reporter: there is already a result available.
[INFO] [resources:resources]
[INFO] Using 'UTF-8' encoding to copy filtered resources.
[INFO] Copying 1 resource
[INFO] Copying 3 resources
[TASKS] Skipping maven reporter: there is already a result available.[INFO] [compiler:compile]

[INFO] Compiling 79 source files to <http://hudson.zones.apache.org/hudson/job/Tika-trunk/ws/trunk/tika-parsers/target/classes>
[TASKS] Skipping maven reporter: there is already a result available.
[HUDSON] Archiving <http://hudson.zones.apache.org/hudson/job/Tika-trunk/ws/trunk/tika-parsers/pom.xml>
to /export/home/hudson/hudson/jobs/Tika-trunk/modules/org.apache.tika$tika-parsers/builds/2010-07-14_23-02-08/archive/org.apache.tika/tika-parsers/0.8-SNAPSHOT/pom.xml
[INFO] ------------------------------------------------------------------------
[ERROR] BUILD FAILURE
[INFO] ------------------------------------------------------------------------
[INFO] Compilation failure

<http://hudson.zones.apache.org/hudson/job/Tika-trunk/ws/trunk/tika-parsers/src/main/java/org/apache/tika/parser/microsoft/ooxml/MetadataExtractor.java>:[77,8]
cannot find symbol
symbol  : method addProperty(org.apache.tika.metadata.Metadata,org.apache.tika.metadata.Property,java.lang.String)
location: class org.apache.tika.parser.microsoft.ooxml.MetadataExtractor

<http://hudson.zones.apache.org/hudson/job/Tika-trunk/ws/trunk/tika-parsers/src/main/java/org/apache/tika/parser/odf/OpenDocumentMetaParser.java>:[74,13]
getMeta(org.xml.sax.ContentHandler,org.apache.tika.metadata.Metadata,java.lang.String,java.lang.String)
in org.apache.tika.parser.odf.OpenDocumentMetaParser cannot be applied to (org.xml.sax.ContentHandler,org.apache.tika.metadata.Metadata,org.apache.tika.metadata.Property,java.lang.String)

<http://hudson.zones.apache.org/hudson/job/Tika-trunk/ws/trunk/tika-parsers/src/main/java/org/apache/tika/parser/odf/OpenDocumentMetaParser.java>:[76,13]
getMeta(org.xml.sax.ContentHandler,org.apache.tika.metadata.Metadata,java.lang.String,java.lang.String)
in org.apache.tika.parser.odf.OpenDocumentMetaParser cannot be applied to (org.xml.sax.ContentHandler,org.apache.tika.metadata.Metadata,org.apache.tika.metadata.Property,java.lang.String)

<http://hudson.zones.apache.org/hudson/job/Tika-trunk/ws/trunk/tika-parsers/src/main/java/org/apache/tika/parser/microsoft/SummaryExtractor.java>:[94,8]
cannot find symbol
symbol  : method set(org.apache.tika.metadata.Property,java.util.Date)
location: class org.apache.tika.parser.microsoft.SummaryExtractor

<http://hudson.zones.apache.org/hudson/job/Tika-trunk/ws/trunk/tika-parsers/src/main/java/org/apache/tika/parser/microsoft/SummaryExtractor.java>:[96,8]
cannot find symbol
symbol  : method set(org.apache.tika.metadata.Property,long)
location: class org.apache.tika.parser.microsoft.SummaryExtractor

<http://hudson.zones.apache.org/hudson/job/Tika-trunk/ws/trunk/tika-parsers/src/main/java/org/apache/tika/parser/pdf/PDFParser.java>:[112,12]
cannot find symbol
symbol  : method addMetadata(org.apache.tika.metadata.Metadata,org.apache.tika.metadata.Property,java.util.Calendar)
location: class org.apache.tika.parser.pdf.PDFParser

<http://hudson.zones.apache.org/hudson/job/Tika-trunk/ws/trunk/tika-parsers/src/main/java/org/apache/tika/parser/pdf/PDFParser.java>:[118,12]
cannot find symbol
symbol  : method addMetadata(org.apache.tika.metadata.Metadata,org.apache.tika.metadata.Property,java.util.Calendar)
location: class org.apache.tika.parser.pdf.PDFParser


[INFO] ------------------------------------------------------------------------
[INFO] For more information, run Maven with the -e switch
[INFO] ------------------------------------------------------------------------
[INFO] Total time: 14 minutes 54 seconds
[INFO] Finished at: Wed Jul 14 23:17:19 UTC 2010
[INFO] Final Memory: 29M/209M
[INFO] ------------------------------------------------------------------------
Waiting for Hudson to finish collecting data
Sending e-mails to: dev@tika.apache.org
channel stopped


Mime
View raw message