tika-dev mailing list archives

Site index · List index
Message view « Date » · « Thread »
Top « Date » · « Thread »
From Apache Jenkins Server <jenk...@builds.apache.org>
Subject Build failed in Jenkins: Tika-trunk #785
Date Fri, 27 Jan 2012 17:06:27 GMT
See <https://builds.apache.org/job/Tika-trunk/785/changes>

Changes:

[nick] TIKA-842 IPTC Metadata Properties, including full descriptions of all the properties
taken from the Specification, along with appropriate License/Notice information for this.

[nick] TIKA-851 Another mp4 audio alias

------------------------------------------
Started by an SCM change
Building remotely on ubuntu5
Updating http://svn.apache.org/repos/asf/tika/trunk
U         NOTICE.txt
U         LICENSE.txt
A         tika-core/src/main/java/org/apache/tika/metadata/IPTC.java
U         tika-core/src/main/java/org/apache/tika/metadata/Metadata.java
U         tika-core/src/main/appended-resources/META-INF/LICENSE
U         tika-core/src/main/resources/org/apache/tika/mime/tika-mimetypes.xml
At revision 1236762
Parsing POMs
Modules changed, recalculating dependency graph
[trunk] $ /home/hudson/tools/java/latest1.5/bin/java -cp /home/jenkins/jenkins-slave/maven3-agent.jar:/home/hudson/tools/maven/latest3/boot/plexus-classworlds-2.4.jar
org.jvnet.hudson.maven3.agent.Maven3Main /home/hudson/tools/maven/latest3 /home/jenkins/jenkins-slave/slave.jar
/home/jenkins/jenkins-slave/maven3-interceptor.jar 33931
<===[JENKINS REMOTING CAPACITY]===>   channel started
Executing Maven:  -B -f <https://builds.apache.org/job/Tika-trunk/ws/trunk/pom.xml>
clean deploy -DobrRepository=NONE -Ppedantic
[INFO] Scanning for projects...
[INFO] ------------------------------------------------------------------------
[INFO] Reactor Build Order:
[INFO] 
[INFO] Apache Tika parent
[INFO] Apache Tika core
[INFO] Apache Tika parsers
[INFO] Apache Tika application
[INFO] Apache Tika OSGi bundle
[INFO] Apache Tika
[INFO]                                                                         
[INFO] ------------------------------------------------------------------------
[INFO] Building Apache Tika parent 1.1-SNAPSHOT
[INFO] ------------------------------------------------------------------------
[INFO] 
[INFO] --- maven-clean-plugin:2.4.1:clean (default-clean) @ tika-parent ---
[INFO] Deleting <https://builds.apache.org/job/Tika-trunk/ws/trunk/tika-parent/target>
log4j:WARN No appenders could be found for logger (org.apache.commons.beanutils.converters.BooleanConverter).
log4j:WARN Please initialize the log4j system properly.
[TASKS] Skipping non-existent folder '<https://builds.apache.org/job/Tika-trunk/ws/trunk/tika-parent/src/main/java'...>
[TASKS] Skipping non-existent folder '<https://builds.apache.org/job/Tika-trunk/ws/trunk/tika-parent/src/test/java'...>
[TASKS] Skipping non-existent folder '<https://builds.apache.org/job/Tika-trunk/ws/trunk/tika-parent/src/main/resources'...>
[TASKS] Skipping non-existent folder '<https://builds.apache.org/job/Tika-trunk/ws/trunk/tika-parent/src/test/resources'...>
[TASKS] Using set difference to compute new warnings
[TASKS] Not changing build status, since no threshold has been exceeded
[INFO] 
[INFO] --- maven-remote-resources-plugin:1.2.1:process (default) @ tika-parent ---
[TASKS] Skipping maven reporter: there is already a result available.
[INFO] 
[INFO] --- maven-site-plugin:3.0:attach-descriptor (attach-descriptor) @ tika-parent ---
[TASKS] Skipping maven reporter: there is already a result available.
[INFO] 
[INFO] --- apache-rat-plugin:0.7:check (default) @ tika-parent ---
[INFO] No excludes
[PMD] Using set difference to compute new warnings
[PMD] Not changing build status, since no threshold has been exceeded
[TASKS] Skipping maven reporter: there is already a result available.
[INFO] 
[INFO] --- maven-install-plugin:2.3.1:install (default-install) @ tika-parent ---
[INFO] Installing <https://builds.apache.org/job/Tika-trunk/ws/trunk/tika-parent/pom.xml>
to /home/jenkins/.m2/repository/org/apache/tika/tika-parent/1.1-SNAPSHOT/tika-parent-1.1-SNAPSHOT.pom
[TASKS] Skipping maven reporter: there is already a result available.
[INFO] 
[INFO] --- maven-deploy-plugin:2.6:deploy (default-deploy) @ tika-parent ---
Downloading: https://repository.apache.org/content/repositories/snapshots/org/apache/tika/tika-parent/1.1-SNAPSHOT/maven-metadata.xml
Downloaded: https://repository.apache.org/content/repositories/snapshots/org/apache/tika/tika-parent/1.1-SNAPSHOT/maven-metadata.xml
(601 B at 0.7 KB/sec)
Uploading: https://repository.apache.org/content/repositories/snapshots/org/apache/tika/tika-parent/1.1-SNAPSHOT/tika-parent-1.1-20120127.170609-74.pom
Uploaded: https://repository.apache.org/content/repositories/snapshots/org/apache/tika/tika-parent/1.1-SNAPSHOT/tika-parent-1.1-20120127.170609-74.pom
(10 KB at 24.9 KB/sec)
Downloading: https://repository.apache.org/content/repositories/snapshots/org/apache/tika/tika-parent/maven-metadata.xml
Downloaded: https://repository.apache.org/content/repositories/snapshots/org/apache/tika/tika-parent/maven-metadata.xml
(512 B at 1.7 KB/sec)
Uploading: https://repository.apache.org/content/repositories/snapshots/org/apache/tika/tika-parent/1.1-SNAPSHOT/maven-metadata.xml
Uploaded: https://repository.apache.org/content/repositories/snapshots/org/apache/tika/tika-parent/1.1-SNAPSHOT/maven-metadata.xml
(601 B at 2.7 KB/sec)
Uploading: https://repository.apache.org/content/repositories/snapshots/org/apache/tika/tika-parent/maven-metadata.xml
Uploaded: https://repository.apache.org/content/repositories/snapshots/org/apache/tika/tika-parent/maven-metadata.xml
(512 B at 1.6 KB/sec)
[TASKS] Skipping maven reporter: there is already a result available.
[JENKINS] Archiving <https://builds.apache.org/job/Tika-trunk/ws/trunk/tika-parent/pom.xml>
to /home/hudson/hudson/jobs/Tika-trunk/modules/org.apache.tika$tika-parent/builds/2012-01-27_17-05-05/archive/org.apache.tika/tika-parent/1.1-SNAPSHOT/tika-parent-1.1-SNAPSHOT.pom
[INFO]                                                                         
[INFO] ------------------------------------------------------------------------
[INFO] Building Apache Tika core 1.1-SNAPSHOT
[INFO] ------------------------------------------------------------------------
[INFO] [INFO] Deleting <https://builds.apache.org/job/Tika-trunk/ws/trunk/tika-core/target>

[INFO] --- maven-clean-plugin:2.4.1:clean (default-clean) @ tika-core ---
[TASKS] Scanning folder '<https://builds.apache.org/job/Tika-trunk/ws/trunk/tika-core/src/main/java'>
for tasks ... 
[TASKS] Found 29.
[TASKS] Scanning folder '<https://builds.apache.org/job/Tika-trunk/ws/trunk/tika-core/src/test/java'>
for tasks ... 
[TASKS] Found 2.
[TASKS] Scanning folder '<https://builds.apache.org/job/Tika-trunk/ws/trunk/tika-core/src/main/resources'>
for tasks ... 
[TASKS] Found 0.
[TASKS] Scanning folder '<https://builds.apache.org/job/Tika-trunk/ws/trunk/tika-core/src/test/resources'>
for tasks ... 
[TASKS] Found 0.
[TASKS] Using set difference to compute new warnings
[TASKS] Not changing build status, since no threshold has been exceeded
[INFO] 
[INFO] --- maven-remote-resources-plugin:1.2.1:process (default) @ tika-core ---
[TASKS] Skipping maven reporter: there is already a result available.
[debug] execute contextualize
[INFO] 
[INFO] --- maven-resources-plugin:2.5:resources (default-resources) @ tika-core ---
[INFO] Using 'UTF-8' encoding to copy filtered resources.
[INFO] Copying 29 resources
[INFO] Copying 3 resources
[TASKS] Skipping maven reporter: there is already a result available.
[INFO] 
[INFO] --- maven-compiler-plugin:2.3.2:compile (default-compile) @ tika-core ---
[INFO] Compiling 157 source files to <https://builds.apache.org/job/Tika-trunk/ws/trunk/tika-core/target/classes>
[INFO] -------------------------------------------------------------
[ERROR] COMPILATION ERROR : 
[INFO] -------------------------------------------------------------
[ERROR] <https://builds.apache.org/job/Tika-trunk/ws/trunk/tika-core/src/main/java/org/apache/tika/sax/XHTMLContentHandler.java>:[176,48]
reference to TITLE is ambiguous, both variable TITLE in org.apache.tika.metadata.DublinCore
and variable TITLE in org.apache.tika.metadata.IPTC match
[INFO] 1 error
[INFO] -------------------------------------------------------------
[TASKS] Skipping maven reporter: there is already a result available.
[JENKINS] Archiving <https://builds.apache.org/job/Tika-trunk/ws/trunk/tika-core/pom.xml>
to /home/hudson/hudson/jobs/Tika-trunk/modules/org.apache.tika$tika-core/builds/2012-01-27_17-05-05/archive/org.apache.tika/tika-core/1.1-SNAPSHOT/tika-core-1.1-SNAPSHOT.pom
[INFO] ------------------------------------------------------------------------
[INFO] Reactor Summary:
[INFO] 
[INFO] Apache Tika parent ................................ SUCCESS [46.680s]
[INFO] Apache Tika core .................................. FAILURE [10.785s]
[INFO] Apache Tika parsers ............................... SKIPPED
[INFO] Apache Tika application ........................... SKIPPED
[INFO] Apache Tika OSGi bundle ........................... SKIPPED
[INFO] Apache Tika ....................................... SKIPPED
[INFO] ------------------------------------------------------------------------
[INFO] BUILD FAILURE
[INFO] ------------------------------------------------------------------------
[INFO] Total time: 1:01.273s
[INFO] Finished at: Fri Jan 27 17:06:24 UTC 2012
[INFO] Final Memory: 19M/264M
[INFO] ------------------------------------------------------------------------
mavenExecutionResult exceptions not empty
message : Failed to execute goal org.apache.maven.plugins:maven-compiler-plugin:2.3.2:compile
(default-compile) on project tika-core: Compilation failure
<https://builds.apache.org/job/Tika-trunk/ws/trunk/tika-core/src/main/java/org/apache/tika/sax/XHTMLContentHandler.java>:[176,48]
reference to TITLE is ambiguous, both variable TITLE in org.apache.tika.metadata.DublinCore
and variable TITLE in org.apache.tika.metadata.IPTC match

cause : Compilation failure
<https://builds.apache.org/job/Tika-trunk/ws/trunk/tika-core/src/main/java/org/apache/tika/sax/XHTMLContentHandler.java>:[176,48]
reference to TITLE is ambiguous, both variable TITLE in org.apache.tika.metadata.DublinCore
and variable TITLE in org.apache.tika.metadata.IPTC match

Stack trace : 
org.apache.maven.lifecycle.LifecycleExecutionException: Failed to execute goal org.apache.maven.plugins:maven-compiler-plugin:2.3.2:compile
(default-compile) on project tika-core: Compilation failure
<https://builds.apache.org/job/Tika-trunk/ws/trunk/tika-core/src/main/java/org/apache/tika/sax/XHTMLContentHandler.java>:[176,48]
reference to TITLE is ambiguous, both variable TITLE in org.apache.tika.metadata.DublinCore
and variable TITLE in org.apache.tika.metadata.IPTC match

	at org.apache.maven.lifecycle.internal.MojoExecutor.execute(MojoExecutor.java:213)
	at org.apache.maven.lifecycle.internal.MojoExecutor.execute(MojoExecutor.java:153)
	at org.apache.maven.lifecycle.internal.MojoExecutor.execute(MojoExecutor.java:145)
	at org.apache.maven.lifecycle.internal.LifecycleModuleBuilder.buildProject(LifecycleModuleBuilder.java:84)
	at org.apache.maven.lifecycle.internal.LifecycleModuleBuilder.buildProject(LifecycleModuleBuilder.java:59)
	at org.apache.maven.lifecycle.internal.LifecycleStarter.singleThreadedBuild(LifecycleStarter.java:183)
	at org.apache.maven.lifecycle.internal.LifecycleStarter.execute(LifecycleStarter.java:161)
	at org.apache.maven.DefaultMaven.doExecute(DefaultMaven.java:319)
	at org.apache.maven.DefaultMaven.execute(DefaultMaven.java:156)
	at org.jvnet.hudson.maven3.launcher.Maven3Launcher.main(Maven3Launcher.java:79)
	at sun.reflect.NativeMethodAccessorImpl.invoke0(Native Method)
	at sun.reflect.NativeMethodAccessorImpl.invoke(NativeMethodAccessorImpl.java:39)
	at sun.reflect.DelegatingMethodAccessorImpl.invoke(DelegatingMethodAccessorImpl.java:25)
	at java.lang.reflect.Method.invoke(Method.java:592)
	at org.codehaus.plexus.classworlds.launcher.Launcher.launchStandard(Launcher.java:329)
	at org.codehaus.plexus.classworlds.launcher.Launcher.launch(Launcher.java:239)
	at org.jvnet.hudson.maven3.agent.Maven3Main.launch(Maven3Main.java:158)
	at hudson.maven.Maven3Builder.call(Maven3Builder.java:104)
	at hudson.maven.Maven3Builder.call(Maven3Builder.java:70)
	at hudson.remoting.UserRequest.perform(UserRequest.java:118)
	at hudson.remoting.UserRequest.perform(UserRequest.java:48)
	at hudson.remoting.Request$2.run(Request.java:287)
	at java.util.concurrent.Executors$RunnableAdapter.call(Executors.java:417)
	at java.util.concurrent.FutureTask$Sync.innerRun(FutureTask.java:269)
	at java.util.concurrent.FutureTask.run(FutureTask.java:123)
	at java.util.concurrent.ThreadPoolExecutor$Worker.runTask(ThreadPoolExecutor.java:651)
	at java.util.concurrent.ThreadPoolExecutor$Worker.run(ThreadPoolExecutor.java:676)
	at java.lang.Thread.run(Thread.java:595)
Caused by: org.apache.maven.plugin.CompilationFailureException: Compilation failure
<https://builds.apache.org/job/Tika-trunk/ws/trunk/tika-core/src/main/java/org/apache/tika/sax/XHTMLContentHandler.java>:[176,48]
reference to TITLE is ambiguous, both variable TITLE in org.apache.tika.metadata.DublinCore
and variable TITLE in org.apache.tika.metadata.IPTC match

	at org.apache.maven.plugin.AbstractCompilerMojo.execute(AbstractCompilerMojo.java:656)
	at org.apache.maven.plugin.CompilerMojo.execute(CompilerMojo.java:128)
	at org.apache.maven.plugin.DefaultBuildPluginManager.executeMojo(DefaultBuildPluginManager.java:101)
	at org.apache.maven.lifecycle.internal.MojoExecutor.execute(MojoExecutor.java:209)
	... 27 more
[PMD] Aggregating results of Apache Tika parent
[PMD] Using set difference to compute new warnings
[PMD] Not changing build status, since no threshold has been exceeded
[TASKS] Aggregating results of Apache Tika parent
[TASKS] Using set difference to compute new warnings
[TASKS] Not changing build status, since no threshold has been exceeded
[TASKS] Aggregating results of Apache Tika core
[TASKS] Using set difference to compute new warnings
[TASKS] Not changing build status, since no threshold has been exceeded
channel stopped


Mime
View raw message