tika-dev mailing list archives

Site index · List index
Message view « Date » · « Thread »
Top « Date » · « Thread »
From Apache Jenkins Server <jenk...@builds.apache.org>
Subject Build failed in Jenkins: Tika-trunk #819
Date Mon, 26 Mar 2012 12:32:55 GMT
See <https://builds.apache.org/job/Tika-trunk/819/changes>

Changes:

[maxcom] tika-server: remove java.net repository

------------------------------------------
[...truncated 676 lines...]

Tests run: 0, Failures: 0, Errors: 0, Skipped: 0

[JENKINS] Recording test results[INFO] Unpacking /home/jenkins/jenkins-slave/maven-repositories/1/edu/ucar/netcdf/4.2-min/netcdf-4.2-min.jar
to
  <https://builds.apache.org/job/Tika-trunk/ws/trunk/tika-bundle/target/classes>
   with includes null and excludes:ucar/nc2/iosp/fysat/Fysat*.class,
                ucar/nc2/dataset/transform/VOceanSG1*class,
                ucar/unidata/geoloc/vertical/OceanSG*.class,
                META-INF/**,CHANGES,README

[INFO] 
[INFO] --- maven-dependency-plugin:2.1:unpack-dependencies (default) @ tika-bundle ---
[INFO] 
[INFO] --- maven-bundle-plugin:2.3.4:bundle (default-bundle) @ tika-bundle ---
[INFO] 
[INFO] --- maven-site-plugin:3.0:attach-descriptor (attach-descriptor) @ tika-bundle ---
[INFO] [INFO] No excludes

[INFO] --- apache-rat-plugin:0.7:check (default) @ tika-bundle ---
[PMD] No report found for mojo check
[INFO] Installing <https://builds.apache.org/job/Tika-trunk/ws/trunk/tika-bundle/target/tika-bundle-1.2-SNAPSHOT.jar>
to /home/jenkins/jenkins-slave/maven-repositories/1/org/apache/tika/tika-bundle/1.2-SNAPSHOT/tika-bundle-1.2-SNAPSHOT.jar
[INFO] 
[INFO] --- maven-install-plugin:2.3.1:install (default-install) @ tika-bundle ---
[INFO] Installing <https://builds.apache.org/job/Tika-trunk/ws/trunk/tika-bundle/pom.xml>
to /home/jenkins/jenkins-slave/maven-repositories/1/org/apache/tika/tika-bundle/1.2-SNAPSHOT/tika-bundle-1.2-SNAPSHOT.pom
[INFO] [INFO] Local OBR update disabled (enable with -DobrRepository)

[INFO] --- maven-bundle-plugin:2.3.4:install (default-install) @ tika-bundle ---
[INFO] Downloading: https://repository.apache.org/content/repositories/snapshots/org/apache/tika/tika-bundle/1.2-SNAPSHOT/maven-metadata.xml

[INFO] --- maven-deploy-plugin:2.6:deploy (default-deploy) @ tika-bundle ---
Downloaded: https://repository.apache.org/content/repositories/snapshots/org/apache/tika/tika-bundle/1.2-SNAPSHOT/maven-metadata.xml
(773 B at 2.6 KB/sec)
Uploading: https://repository.apache.org/content/repositories/snapshots/org/apache/tika/tika-bundle/1.2-SNAPSHOT/tika-bundle-1.2-20120326.122612-11.jar
Uploaded: https://repository.apache.org/content/repositories/snapshots/org/apache/tika/tika-bundle/1.2-SNAPSHOT/tika-bundle-1.2-20120326.122612-11.jar
(21661 KB at 3381.2 KB/sec)
Uploading: https://repository.apache.org/content/repositories/snapshots/org/apache/tika/tika-bundle/1.2-SNAPSHOT/tika-bundle-1.2-20120326.122612-11.pom
Uploaded: https://repository.apache.org/content/repositories/snapshots/org/apache/tika/tika-bundle/1.2-SNAPSHOT/tika-bundle-1.2-20120326.122612-11.pom
(8 KB at 46.2 KB/sec)
Downloading: https://repository.apache.org/content/repositories/snapshots/org/apache/tika/tika-bundle/maven-metadata.xml
Downloaded: https://repository.apache.org/content/repositories/snapshots/org/apache/tika/tika-bundle/maven-metadata.xml
(342 B at 1.5 KB/sec)
Uploading: https://repository.apache.org/content/repositories/snapshots/org/apache/tika/tika-bundle/1.2-SNAPSHOT/maven-metadata.xml
Uploaded: https://repository.apache.org/content/repositories/snapshots/org/apache/tika/tika-bundle/1.2-SNAPSHOT/maven-metadata.xml
(773 B at 3.7 KB/sec)
Uploading: https://repository.apache.org/content/repositories/snapshots/org/apache/tika/tika-bundle/maven-metadata.xml
Uploaded: https://repository.apache.org/content/repositories/snapshots/org/apache/tika/tika-bundle/maven-metadata.xml
(342 B at 2.2 KB/sec)
[INFO] [INFO] Remote OBR update disabled (enable with -DremoteOBR)

[INFO] --- maven-bundle-plugin:2.3.4:deploy (default-deploy) @ tika-bundle ---
[JENKINS] Archiving <https://builds.apache.org/job/Tika-trunk/ws/trunk/tika-bundle/pom.xml>
to /home/hudson/hudson/jobs/Tika-trunk/modules/org.apache.tika$tika-bundle/builds/2012-03-26_12-04-53/archive/org.apache.tika/tika-bundle/1.2-SNAPSHOT/tika-bundle-1.2-SNAPSHOT.pom
[JENKINS] Archiving <https://builds.apache.org/job/Tika-trunk/ws/trunk/tika-bundle/target/tika-bundle-1.2-SNAPSHOT.jar>
to /home/hudson/hudson/jobs/Tika-trunk/modules/org.apache.tika$tika-bundle/builds/2012-03-26_12-04-53/archive/org.apache.tika/tika-bundle/1.2-20120326.122612-11/tika-bundle-1.2-20120326.122612-11.jar
[INFO]                                                                         
Downloading: http://repo1.maven.org/maven2/javax/ws/rs/jsr311-api/1.1/jsr311-api-1.1.pom
Downloaded: http://repo1.maven.org/maven2/javax/ws/rs/jsr311-api/1.1/jsr311-api-1.1.pom (6
KB at 14.4 KB/sec)
Downloading: http://repo1.maven.org/maven2/com/sun/jersey/jersey-test-framework/jersey-test-framework-grizzly/1.7/jersey-test-framework-grizzly-1.7.pom
Downloaded: http://repo1.maven.org/maven2/com/sun/jersey/jersey-test-framework/jersey-test-framework-grizzly/1.7/jersey-test-framework-grizzly-1.7.pom
(6 KB at 11.1 KB/sec)
Downloading: http://repo1.maven.org/maven2/com/sun/jersey/jersey-test-framework/1.7/jersey-test-framework-1.7.pom
Downloaded: http://repo1.maven.org/maven2/com/sun/jersey/jersey-test-framework/1.7/jersey-test-framework-1.7.pom
(3 KB at 6.5 KB/sec)
Downloading: http://repo1.maven.org/maven2/com/sun/grizzly/grizzly-servlet-webserver/1.9.31/grizzly-servlet-webserver-1.9.31.pom
Downloaded: http://repo1.maven.org/maven2/com/sun/grizzly/grizzly-servlet-webserver/1.9.31/grizzly-servlet-webserver-1.9.31.pom
(7 KB at 12.5 KB/sec)
Downloading: http://repo1.maven.org/maven2/com/sun/grizzly/grizzly-project/1.9.31/grizzly-project-1.9.31.pom
Downloaded: http://repo1.maven.org/maven2/com/sun/grizzly/grizzly-project/1.9.31/grizzly-project-1.9.31.pom
(20 KB at 38.3 KB/sec)
Downloading: http://repo1.maven.org/maven2/com/sun/grizzly/grizzly-http/1.9.31/grizzly-http-1.9.31.pom
Downloaded: http://repo1.maven.org/maven2/com/sun/grizzly/grizzly-http/1.9.31/grizzly-http-1.9.31.pom
(5 KB at 9.4 KB/sec)
Downloading: http://repo1.maven.org/maven2/com/sun/grizzly/grizzly-framework/1.9.31/grizzly-framework-1.9.31.pom
Downloaded: http://repo1.maven.org/maven2/com/sun/grizzly/grizzly-framework/1.9.31/grizzly-framework-1.9.31.pom
(6 KB at 10.6 KB/sec)
Downloading: http://repo1.maven.org/maven2/com/sun/grizzly/grizzly-utils/1.9.31/grizzly-utils-1.9.31.pom
Downloaded: http://repo1.maven.org/maven2/com/sun/grizzly/grizzly-utils/1.9.31/grizzly-utils-1.9.31.pom
(7 KB at 13.0 KB/sec)
Downloading: http://repo1.maven.org/maven2/com/sun/grizzly/grizzly-lzma/1.9.31/grizzly-lzma-1.9.31.pom
Downloaded: http://repo1.maven.org/maven2/com/sun/grizzly/grizzly-lzma/1.9.31/grizzly-lzma-1.9.31.pom
(5 KB at 8.4 KB/sec)
Downloading: http://repo1.maven.org/maven2/com/sun/grizzly/grizzly-rcm/1.9.31/grizzly-rcm-1.9.31.pom
Downloaded: http://repo1.maven.org/maven2/com/sun/grizzly/grizzly-rcm/1.9.31/grizzly-rcm-1.9.31.pom
(5 KB at 8.6 KB/sec)
Downloading: http://repo1.maven.org/maven2/com/sun/grizzly/grizzly-portunif/1.9.31/grizzly-portunif-1.9.31.pom
[INFO] ------------------------------------------------------------------------
[INFO] Building Apache Tika server 1.2-SNAPSHOT
[INFO] ------------------------------------------------------------------------
Downloaded: http://repo1.maven.org/maven2/com/sun/grizzly/grizzly-portunif/1.9.31/grizzly-portunif-1.9.31.pom
(5 KB at 8.7 KB/sec)
Downloading: http://repo1.maven.org/maven2/com/sun/grizzly/grizzly-http-servlet/1.9.31/grizzly-http-servlet-1.9.31.pom
Downloaded: http://repo1.maven.org/maven2/com/sun/grizzly/grizzly-http-servlet/1.9.31/grizzly-http-servlet-1.9.31.pom
(6 KB at 11.2 KB/sec)
Downloading: http://repo1.maven.org/maven2/com/sun/jersey/jersey-test-framework/jersey-test-framework-core/1.7/jersey-test-framework-core-1.7.pom
Downloaded: http://repo1.maven.org/maven2/com/sun/jersey/jersey-test-framework/jersey-test-framework-core/1.7/jersey-test-framework-core-1.7.pom
(7 KB at 13.0 KB/sec)
Downloading: http://repo1.maven.org/maven2/com/sun/jersey/jersey-grizzly/1.7/jersey-grizzly-1.7.pom
Downloaded: http://repo1.maven.org/maven2/com/sun/jersey/jersey-grizzly/1.7/jersey-grizzly-1.7.pom
(7 KB at 15.1 KB/sec)
Downloading: http://repo1.maven.org/maven2/org/eclipse/jetty/jetty-server/8.0.0.M3/jetty-server-8.0.0.M3.pom
Downloaded: http://repo1.maven.org/maven2/org/eclipse/jetty/jetty-server/8.0.0.M3/jetty-server-8.0.0.M3.pom
(4 KB at 7.6 KB/sec)
Downloading: http://repo1.maven.org/maven2/org/eclipse/jetty/jetty-project/8.0.0.M3/jetty-project-8.0.0.M3.pom
Downloaded: http://repo1.maven.org/maven2/org/eclipse/jetty/jetty-project/8.0.0.M3/jetty-project-8.0.0.M3.pom
(20 KB at 38.7 KB/sec)
Downloading: http://repo1.maven.org/maven2/org/eclipse/jetty/jetty-parent/17/jetty-parent-17.pom
Downloaded: http://repo1.maven.org/maven2/org/eclipse/jetty/jetty-parent/17/jetty-parent-17.pom
(17 KB at 32.3 KB/sec)
Downloading: http://repo1.maven.org/maven2/org/eclipse/jetty/jetty-continuation/8.0.0.M3/jetty-continuation-8.0.0.M3.pom
Downloaded: http://repo1.maven.org/maven2/org/eclipse/jetty/jetty-continuation/8.0.0.M3/jetty-continuation-8.0.0.M3.pom
(3 KB at 5.9 KB/sec)
Downloading: http://repo1.maven.org/maven2/org/eclipse/jetty/jetty-http/8.0.0.M3/jetty-http-8.0.0.M3.pom
Downloaded: http://repo1.maven.org/maven2/org/eclipse/jetty/jetty-http/8.0.0.M3/jetty-http-8.0.0.M3.pom
(3 KB at 4.8 KB/sec)
Downloading: http://repo1.maven.org/maven2/org/eclipse/jetty/jetty-io/8.0.0.M3/jetty-io-8.0.0.M3.pom
Downloaded: http://repo1.maven.org/maven2/org/eclipse/jetty/jetty-io/8.0.0.M3/jetty-io-8.0.0.M3.pom
(3 KB at 4.2 KB/sec)
Downloading: http://repo1.maven.org/maven2/org/eclipse/jetty/jetty-util/8.0.0.M3/jetty-util-8.0.0.M3.pom
Downloaded: http://repo1.maven.org/maven2/org/eclipse/jetty/jetty-util/8.0.0.M3/jetty-util-8.0.0.M3.pom
(4 KB at 5.6 KB/sec)
Downloading: http://repo1.maven.org/maven2/org/eclipse/jetty/jetty-servlet/8.0.0.M3/jetty-servlet-8.0.0.M3.pom
Downloaded: http://repo1.maven.org/maven2/org/eclipse/jetty/jetty-servlet/8.0.0.M3/jetty-servlet-8.0.0.M3.pom
(3 KB at 5.8 KB/sec)
Downloading: http://repo1.maven.org/maven2/org/eclipse/jetty/jetty-security/8.0.0.M3/jetty-security-8.0.0.M3.pom
Downloaded: http://repo1.maven.org/maven2/org/eclipse/jetty/jetty-security/8.0.0.M3/jetty-security-8.0.0.M3.pom
(3 KB at 5.4 KB/sec)
Downloading: http://repo1.maven.org/maven2/net/sf/opencsv/opencsv/2.0/opencsv-2.0.pom
Downloaded: http://repo1.maven.org/maven2/net/sf/opencsv/opencsv/2.0/opencsv-2.0.pom (6 KB
at 11.3 KB/sec)
Downloading: http://repo1.maven.org/maven2/javax/ws/rs/jsr311-api/1.1/jsr311-api-1.1.jar
Downloading: http://repo1.maven.org/maven2/com/sun/jersey/jersey-test-framework/jersey-test-framework-grizzly/1.7/jersey-test-framework-grizzly-1.7.jar
Downloading: http://repo1.maven.org/maven2/com/sun/grizzly/grizzly-servlet-webserver/1.9.31/grizzly-servlet-webserver-1.9.31.jar
Downloading: http://repo1.maven.org/maven2/com/sun/grizzly/grizzly-http/1.9.31/grizzly-http-1.9.31.jar
Downloading: http://repo1.maven.org/maven2/com/sun/grizzly/grizzly-framework/1.9.31/grizzly-framework-1.9.31.jar
Downloaded: http://repo1.maven.org/maven2/javax/ws/rs/jsr311-api/1.1/jsr311-api-1.1.jar (45
KB at 30.3 KB/sec)
Downloading: http://repo1.maven.org/maven2/com/sun/grizzly/grizzly-rcm/1.9.31/grizzly-rcm-1.9.31.jar
Downloaded: http://repo1.maven.org/maven2/com/sun/jersey/jersey-test-framework/jersey-test-framework-grizzly/1.7/jersey-test-framework-grizzly-1.7.jar
(13 KB at 7.3 KB/sec)
Downloading: http://repo1.maven.org/maven2/com/sun/grizzly/grizzly-portunif/1.9.31/grizzly-portunif-1.9.31.jar
Downloaded: http://repo1.maven.org/maven2/com/sun/grizzly/grizzly-framework/1.9.31/grizzly-framework-1.9.31.jar
(239 KB at 121.1 KB/sec)
Downloading: http://repo1.maven.org/maven2/com/sun/grizzly/grizzly-utils/1.9.31/grizzly-utils-1.9.31.jar
Downloaded: http://repo1.maven.org/maven2/com/sun/grizzly/grizzly-servlet-webserver/1.9.31/grizzly-servlet-webserver-1.9.31.jar
(1096 KB at 477.1 KB/sec)
Downloading: http://repo1.maven.org/maven2/com/sun/grizzly/grizzly-lzma/1.9.31/grizzly-lzma-1.9.31.jar
Downloaded: http://repo1.maven.org/maven2/com/sun/grizzly/grizzly-http/1.9.31/grizzly-http-1.9.31.jar
(175 KB at 63.5 KB/sec)
Downloading: http://repo1.maven.org/maven2/com/sun/grizzly/grizzly-http-servlet/1.9.31/grizzly-http-servlet-1.9.31.jar
Downloaded: http://repo1.maven.org/maven2/com/sun/grizzly/grizzly-rcm/1.9.31/grizzly-rcm-1.9.31.jar
(11 KB at 4.5 KB/sec)
Downloading: http://repo1.maven.org/maven2/com/sun/jersey/jersey-test-framework/jersey-test-framework-core/1.7/jersey-test-framework-core-1.7.jar
Downloaded: http://repo1.maven.org/maven2/com/sun/grizzly/grizzly-portunif/1.9.31/grizzly-portunif-1.9.31.jar
(20 KB at 7.7 KB/sec)
Downloading: http://repo1.maven.org/maven2/com/sun/jersey/jersey-grizzly/1.7/jersey-grizzly-1.7.jar
Downloaded: http://repo1.maven.org/maven2/com/sun/grizzly/grizzly-lzma/1.9.31/grizzly-lzma-1.9.31.jar
(55 KB at 24.6 KB/sec)
Downloading: http://repo1.maven.org/maven2/org/eclipse/jetty/jetty-server/8.0.0.M3/jetty-server-8.0.0.M3.jar
Downloaded: http://repo1.maven.org/maven2/com/sun/grizzly/grizzly-utils/1.9.31/grizzly-utils-1.9.31.jar
(490 KB at 162.5 KB/sec)
Downloading: http://repo1.maven.org/maven2/org/eclipse/jetty/jetty-continuation/8.0.0.M3/jetty-continuation-8.0.0.M3.jar
Downloaded: http://repo1.maven.org/maven2/com/sun/grizzly/grizzly-http-servlet/1.9.31/grizzly-http-servlet-1.9.31.jar
(49 KB at 19.5 KB/sec)
Downloading: http://repo1.maven.org/maven2/org/eclipse/jetty/jetty-http/8.0.0.M3/jetty-http-8.0.0.M3.jar
Downloaded: http://repo1.maven.org/maven2/com/sun/jersey/jersey-test-framework/jersey-test-framework-core/1.7/jersey-test-framework-core-1.7.jar
(28 KB at 12.1 KB/sec)
Downloading: http://repo1.maven.org/maven2/org/eclipse/jetty/jetty-io/8.0.0.M3/jetty-io-8.0.0.M3.jar
Downloaded: http://repo1.maven.org/maven2/com/sun/jersey/jersey-grizzly/1.7/jersey-grizzly-1.7.jar
(18 KB at 7.0 KB/sec)
Downloading: http://repo1.maven.org/maven2/org/eclipse/jetty/jetty-util/8.0.0.M3/jetty-util-8.0.0.M3.jar
Downloaded: http://repo1.maven.org/maven2/org/eclipse/jetty/jetty-server/8.0.0.M3/jetty-server-8.0.0.M3.jar
(307 KB at 111.3 KB/sec)
Downloading: http://repo1.maven.org/maven2/org/eclipse/jetty/jetty-servlet/8.0.0.M3/jetty-servlet-8.0.0.M3.jar
Downloaded: http://repo1.maven.org/maven2/org/eclipse/jetty/jetty-continuation/8.0.0.M3/jetty-continuation-8.0.0.M3.jar
(21 KB at 8.3 KB/sec)
Downloading: http://repo1.maven.org/maven2/org/eclipse/jetty/jetty-security/8.0.0.M3/jetty-security-8.0.0.M3.jar
Downloaded: http://repo1.maven.org/maven2/org/eclipse/jetty/jetty-http/8.0.0.M3/jetty-http-8.0.0.M3.jar
(111 KB at 40.4 KB/sec)
Downloading: http://repo1.maven.org/maven2/net/sf/opencsv/opencsv/2.0/opencsv-2.0.jar
Downloaded: http://repo1.maven.org/maven2/org/eclipse/jetty/jetty-io/8.0.0.M3/jetty-io-8.0.0.M3.jar
(92 KB at 36.6 KB/sec)
Downloaded: http://repo1.maven.org/maven2/org/eclipse/jetty/jetty-util/8.0.0.M3/jetty-util-8.0.0.M3.jar
(222 KB at 89.5 KB/sec)
Downloaded: http://repo1.maven.org/maven2/org/eclipse/jetty/jetty-servlet/8.0.0.M3/jetty-servlet-8.0.0.M3.jar
(85 KB at 37.8 KB/sec)
Downloaded: http://repo1.maven.org/maven2/org/eclipse/jetty/jetty-security/8.0.0.M3/jetty-security-8.0.0.M3.jar
(85 KB at 37.3 KB/sec)
Downloaded: http://repo1.maven.org/maven2/net/sf/opencsv/opencsv/2.0/opencsv-2.0.jar (15 KB
at 7.3 KB/sec)
[INFO] 
[INFO] --- maven-clean-plugin:2.4.1:clean (default-clean) @ tika-server ---
[TASKS] Scanning folder '<https://builds.apache.org/job/Tika-trunk/ws/trunk/tika-server'>
for files matching the pattern '**/*.java' - excludes: 
[TASKS] Found 11 files to scan for tasks
Found 0 open tasks.
[INFO] 
[INFO] --- maven-remote-resources-plugin:1.2.1:process (default) @ tika-server ---
[debug] execute contextualize
[INFO] [INFO] Using 'UTF-8' encoding to copy filtered resources.
[INFO] Copying 2 resources
[INFO] Copying 3 resources

[INFO] --- maven-resources-plugin:2.5:resources (default-resources) @ tika-server ---
[INFO] [INFO] Compiling 8 source files to <https://builds.apache.org/job/Tika-trunk/ws/trunk/tika-server/target/classes>

[INFO] --- maven-compiler-plugin:2.3.2:compile (default-compile) @ tika-server ---
[INFO] -------------------------------------------------------------
[ERROR] COMPILATION ERROR : 
[INFO] -------------------------------------------------------------
[ERROR] <https://builds.apache.org/job/Tika-trunk/ws/trunk/tika-server/src/main/java/org/apache/tika/server/TarWriter.java>:[23,-1]
cannot access javax.ws.rs.Produces
bad class file: /home/jenkins/jenkins-slave/maven-repositories/1/com/sun/jersey/jersey-core/1.7/jersey-core-1.7.jar(javax/ws/rs/Produces.class)
class file has wrong version 50.0, should be 49.0
[INFO] 1 error
[INFO] -------------------------------------------------------------
[JENKINS] Archiving <https://builds.apache.org/job/Tika-trunk/ws/trunk/tika-server/pom.xml>
to /home/hudson/hudson/jobs/Tika-trunk/modules/org.apache.tika$tika-server/builds/2012-03-26_12-04-53/archive/org.apache.tika/tika-server/1.2-SNAPSHOT/tika-server-1.2-SNAPSHOT.pom
[INFO] ------------------------------------------------------------------------
[INFO] Reactor Summary:
[INFO] 
[INFO] Apache Tika parent ................................ SUCCESS [1:43.875s]
[INFO] Apache Tika core .................................. SUCCESS [4:24.498s]
[INFO] Apache Tika parsers ............................... SUCCESS [4:59.511s]
[INFO] Apache Tika application ........................... SUCCESS [1:32.106s]
[INFO] Apache Tika OSGi bundle ........................... SUCCESS [56.547s]
[INFO] Apache Tika server ................................ FAILURE [24.302s]
[INFO] Apache Tika ....................................... SKIPPED
[INFO] ------------------------------------------------------------------------
[INFO] BUILD FAILURE
[INFO] ------------------------------------------------------------------------
[INFO] Total time: 27:22.040s
[INFO] Finished at: Mon Mar 26 12:32:48 UTC 2012
[INFO] Final Memory: 41M/343M
[INFO] ------------------------------------------------------------------------
Waiting for Jenkins to finish collecting data
mavenExecutionResult exceptions not empty
message : Failed to execute goal org.apache.maven.plugins:maven-compiler-plugin:2.3.2:compile
(default-compile) on project tika-server: Compilation failure
<https://builds.apache.org/job/Tika-trunk/ws/trunk/tika-server/src/main/java/org/apache/tika/server/TarWriter.java>:[23,-1]
cannot access javax.ws.rs.Produces
bad class file: /home/jenkins/jenkins-slave/maven-repositories/1/com/sun/jersey/jersey-core/1.7/jersey-core-1.7.jar(javax/ws/rs/Produces.class)
class file has wrong version 50.0, should be 49.0

cause : Compilation failure
<https://builds.apache.org/job/Tika-trunk/ws/trunk/tika-server/src/main/java/org/apache/tika/server/TarWriter.java>:[23,-1]
cannot access javax.ws.rs.Produces
bad class file: /home/jenkins/jenkins-slave/maven-repositories/1/com/sun/jersey/jersey-core/1.7/jersey-core-1.7.jar(javax/ws/rs/Produces.class)
class file has wrong version 50.0, should be 49.0

Stack trace : 
org.apache.maven.lifecycle.LifecycleExecutionException: Failed to execute goal org.apache.maven.plugins:maven-compiler-plugin:2.3.2:compile
(default-compile) on project tika-server: Compilation failure
<https://builds.apache.org/job/Tika-trunk/ws/trunk/tika-server/src/main/java/org/apache/tika/server/TarWriter.java>:[23,-1]
cannot access javax.ws.rs.Produces
bad class file: /home/jenkins/jenkins-slave/maven-repositories/1/com/sun/jersey/jersey-core/1.7/jersey-core-1.7.jar(javax/ws/rs/Produces.class)
class file has wrong version 50.0, should be 49.0

	at org.apache.maven.lifecycle.internal.MojoExecutor.execute(MojoExecutor.java:213)
	at org.apache.maven.lifecycle.internal.MojoExecutor.execute(MojoExecutor.java:153)
	at org.apache.maven.lifecycle.internal.MojoExecutor.execute(MojoExecutor.java:145)
	at org.apache.maven.lifecycle.internal.LifecycleModuleBuilder.buildProject(LifecycleModuleBuilder.java:84)
	at org.apache.maven.lifecycle.internal.LifecycleModuleBuilder.buildProject(LifecycleModuleBuilder.java:59)
	at org.apache.maven.lifecycle.internal.LifecycleStarter.singleThreadedBuild(LifecycleStarter.java:183)
	at org.apache.maven.lifecycle.internal.LifecycleStarter.execute(LifecycleStarter.java:161)
	at org.apache.maven.DefaultMaven.doExecute(DefaultMaven.java:319)
	at org.apache.maven.DefaultMaven.execute(DefaultMaven.java:156)
	at org.jvnet.hudson.maven3.launcher.Maven3Launcher.main(Maven3Launcher.java:79)
	at sun.reflect.NativeMethodAccessorImpl.invoke0(Native Method)
	at sun.reflect.NativeMethodAccessorImpl.invoke(NativeMethodAccessorImpl.java:39)
	at sun.reflect.DelegatingMethodAccessorImpl.invoke(DelegatingMethodAccessorImpl.java:25)
	at java.lang.reflect.Method.invoke(Method.java:592)
	at org.codehaus.plexus.classworlds.launcher.Launcher.launchStandard(Launcher.java:329)
	at org.codehaus.plexus.classworlds.launcher.Launcher.launch(Launcher.java:239)
	at org.jvnet.hudson.maven3.agent.Maven3Main.launch(Maven3Main.java:158)
	at hudson.maven.Maven3Builder.call(Maven3Builder.java:104)
	at hudson.maven.Maven3Builder.call(Maven3Builder.java:70)
	at hudson.remoting.UserRequest.perform(UserRequest.java:118)
	at hudson.remoting.UserRequest.perform(UserRequest.java:48)
	at hudson.remoting.Request$2.run(Request.java:287)
	at hudson.remoting.InterceptingExecutorService$1.call(InterceptingExecutorService.java:72)
	at java.util.concurrent.FutureTask$Sync.innerRun(FutureTask.java:269)
	at java.util.concurrent.FutureTask.run(FutureTask.java:123)
	at java.util.concurrent.ThreadPoolExecutor$Worker.runTask(ThreadPoolExecutor.java:651)
	at java.util.concurrent.ThreadPoolExecutor$Worker.run(ThreadPoolExecutor.java:676)
	at java.lang.Thread.run(Thread.java:595)
Caused by: org.apache.maven.plugin.CompilationFailureException: Compilation failure
<https://builds.apache.org/job/Tika-trunk/ws/trunk/tika-server/src/main/java/org/apache/tika/server/TarWriter.java>:[23,-1]
cannot access javax.ws.rs.Produces
bad class file: /home/jenkins/jenkins-slave/maven-repositories/1/com/sun/jersey/jersey-core/1.7/jersey-core-1.7.jar(javax/ws/rs/Produces.class)
class file has wrong version 50.0, should be 49.0

	at org.apache.maven.plugin.AbstractCompilerMojo.execute(AbstractCompilerMojo.java:656)
	at org.apache.maven.plugin.CompilerMojo.execute(CompilerMojo.java:128)
	at org.apache.maven.plugin.DefaultBuildPluginManager.executeMojo(DefaultBuildPluginManager.java:101)
	at org.apache.maven.lifecycle.internal.MojoExecutor.execute(MojoExecutor.java:209)
	... 27 more
[TASKS] Aggregating results of Apache Tika parent
[TASKS] Using set difference to compute new warnings
[TASKS] Aggregating results of Apache Tika core
[TASKS] Using set difference to compute new warnings
[TASKS] Aggregating results of Apache Tika parsers
[TASKS] Using set difference to compute new warnings
[TASKS] Aggregating results of Apache Tika application
[TASKS] Using set difference to compute new warnings
[TASKS] Aggregating results of Apache Tika OSGi bundle
[TASKS] Using set difference to compute new warnings
[TASKS] Aggregating results of Apache Tika server
[TASKS] Using set difference to compute new warnings
channel stopped

Mime
View raw message