tika-dev mailing list archives

Site index · List index
Message view « Date » · « Thread »
Top « Date » · « Thread »
From Apache Jenkins Server <jenk...@builds.apache.org>
Subject Build failed in Jenkins: Tika-trunk #843
Date Sat, 28 Apr 2012 19:03:29 GMT
See <https://builds.apache.org/job/Tika-trunk/843/changes>

Changes:

[nick] TIKA-858 Fix Java 1.6isms

------------------------------------------
[...truncated 232 lines...]
-------------------------------------------------------
Running org.apache.tika.TikaIT
Tests run: 1, Failures: 0, Errors: 0, Skipped: 0, Time elapsed: 0.213 sec

Results :

Tests run: 1, Failures: 0, Errors: 0, Skipped: 0

mojoSucceeded org.apache.maven.plugins:maven-failsafe-plugin:2.10(default)
[JENKINS] Recording test results
mojoStarted org.apache.rat:apache-rat-plugin:0.7(default)
[INFO] 
[INFO] --- apache-rat-plugin:0.7:check (default) @ tika-core ---
[INFO] Exclude: src/test/resources/org/apache/tika/**
mojoSucceeded org.apache.rat:apache-rat-plugin:0.7(default)
[PMD] No report found for mojo check
forkedProjectStarted org.apache.tika:tika-core:1.2-SNAPSHOT
mojoStarted org.apache.maven.plugins:maven-remote-resources-plugin:1.2.1(default)
[INFO] 
[INFO] --- maven-remote-resources-plugin:1.2.1:process (default) @ tika-core ---
mojoSucceeded org.apache.maven.plugins:maven-remote-resources-plugin:1.2.1(default)
mojoStarted org.apache.maven.plugins:maven-resources-plugin:2.5(default-resources)[debug]
execute contextualize
[INFO] Using 'UTF-8' encoding to copy filtered resources.
[INFO] Copying 29 resources
[INFO] Copying 3 resources
[INFO] Copying 3 resources

[INFO] 
[INFO] --- maven-resources-plugin:2.5:resources (default-resources) @ tika-core ---
mojoSucceeded org.apache.maven.plugins:maven-resources-plugin:2.5(default-resources)
mojoStarted org.apache.maven.plugins:maven-compiler-plugin:2.3.2(default-compile)
[INFO] 
[INFO] --- maven-compiler-plugin:2.3.2:compile (default-compile) @ tika-core ---
[INFO] Nothing to compile - all classes are up to date
mojoSucceeded org.apache.maven.plugins:maven-compiler-plugin:2.3.2(default-compile)
forkedProjectSucceeded org.apache.tika:tika-core:1.2-SNAPSHOTApr 28, 2012 7:02:51 PM hudson.maven.ExecutedMojo
<init>
WARNING: Failed to getClass for org.codehaus.mojo.clirr.ClirrCheckMojo

[PMD] No report found for mojo check
mojoStarted org.codehaus.mojo:clirr-maven-plugin:2.3(default)
[INFO] 
[INFO] --- clirr-maven-plugin:2.3:check (default) @ tika-core ---
[INFO] Succeeded with 0 errors; 0 warnings; and 0 other changes.
mojoSucceeded org.codehaus.mojo:clirr-maven-plugin:2.3(default)
[PMD] No report found for mojo check
mojoStarted org.apache.maven.plugins:maven-failsafe-plugin:2.10(default)[INFO] Failsafe report
directory: <https://builds.apache.org/job/Tika-trunk/ws/trunk/tika-core/target/failsafe-reports>

[INFO] 
[INFO] --- maven-failsafe-plugin:2.10:verify (default) @ tika-core ---
mojoSucceeded org.apache.maven.plugins:maven-failsafe-plugin:2.10(default)
mojoStarted org.apache.maven.plugins:maven-install-plugin:2.3.1(default-install)[INFO] Installing
<https://builds.apache.org/job/Tika-trunk/ws/trunk/tika-core/target/tika-core-1.2-SNAPSHOT.jar>
to /home/hudson/hudson-slave/maven-repositories/0/org/apache/tika/tika-core/1.2-SNAPSHOT/tika-core-1.2-SNAPSHOT.jar
[INFO] Installing <https://builds.apache.org/job/Tika-trunk/ws/trunk/tika-core/pom.xml>
to /home/hudson/hudson-slave/maven-repositories/0/org/apache/tika/tika-core/1.2-SNAPSHOT/tika-core-1.2-SNAPSHOT.pom

[INFO] 
[INFO] --- maven-install-plugin:2.3.1:install (default-install) @ tika-core ---
mojoSucceeded org.apache.maven.plugins:maven-install-plugin:2.3.1(default-install)
mojoStarted org.apache.felix:maven-bundle-plugin:2.3.4(default-install)[INFO] Local OBR update
disabled (enable with -DobrRepository)

[INFO] 
[INFO] --- maven-bundle-plugin:2.3.4:install (default-install) @ tika-core ---
mojoSucceeded org.apache.felix:maven-bundle-plugin:2.3.4(default-install)
mojoStarted org.apache.maven.plugins:maven-deploy-plugin:2.6(default-deploy)Downloading: https://repository.apache.org/content/repositories/snapshots/org/apache/tika/tika-core/1.2-SNAPSHOT/maven-metadata.xml

[INFO] 
[INFO] --- maven-deploy-plugin:2.6:deploy (default-deploy) @ tika-core ---
Downloaded: https://repository.apache.org/content/repositories/snapshots/org/apache/tika/tika-core/1.2-SNAPSHOT/maven-metadata.xml
(771 B at 2.1 KB/sec)
Uploading: https://repository.apache.org/content/repositories/snapshots/org/apache/tika/tika-core/1.2-SNAPSHOT/tika-core-1.2-20120428.190254-34.jar
Uploaded: https://repository.apache.org/content/repositories/snapshots/org/apache/tika/tika-core/1.2-SNAPSHOT/tika-core-1.2-20120428.190254-34.jar
(434 KB at 354.0 KB/sec)
Uploading: https://repository.apache.org/content/repositories/snapshots/org/apache/tika/tika-core/1.2-SNAPSHOT/tika-core-1.2-20120428.190254-34.pom
Uploaded: https://repository.apache.org/content/repositories/snapshots/org/apache/tika/tika-core/1.2-SNAPSHOT/tika-core-1.2-20120428.190254-34.pom
(5 KB at 29.6 KB/sec)
Downloading: https://repository.apache.org/content/repositories/snapshots/org/apache/tika/tika-core/maven-metadata.xml
Downloaded: https://repository.apache.org/content/repositories/snapshots/org/apache/tika/tika-core/maven-metadata.xml
(340 B at 1.0 KB/sec)
Uploading: https://repository.apache.org/content/repositories/snapshots/org/apache/tika/tika-core/1.2-SNAPSHOT/maven-metadata.xml
Uploaded: https://repository.apache.org/content/repositories/snapshots/org/apache/tika/tika-core/1.2-SNAPSHOT/maven-metadata.xml
(771 B at 3.0 KB/sec)
Uploading: https://repository.apache.org/content/repositories/snapshots/org/apache/tika/tika-core/maven-metadata.xml
Uploaded: https://repository.apache.org/content/repositories/snapshots/org/apache/tika/tika-core/maven-metadata.xml
(340 B at 0.7 KB/sec)
mojoSucceeded org.apache.maven.plugins:maven-deploy-plugin:2.6(default-deploy)
mojoStarted org.apache.felix:maven-bundle-plugin:2.3.4(default-deploy)[INFO] Remote OBR update
disabled (enable with -DremoteOBR)

[INFO] 
[INFO] --- maven-bundle-plugin:2.3.4:deploy (default-deploy) @ tika-core ---
mojoSucceeded org.apache.felix:maven-bundle-plugin:2.3.4(default-deploy)
projectSucceeded org.apache.tika:tika-core:1.2-SNAPSHOT
projectStarted org.apache.tika:tika-parsers:1.2-SNAPSHOT
[INFO]                                                                         
[INFO] ------------------------------------------------------------------------
[INFO] Building Apache Tika parsers 1.2-SNAPSHOT
[INFO] ------------------------------------------------------------------------
Downloading: http://repo1.maven.org/maven2/org/apache/poi/poi/3.8/poi-3.8.pom
Downloaded: http://repo1.maven.org/maven2/org/apache/poi/poi/3.8/poi-3.8.pom (3 KB at 7.6
KB/sec)
Downloading: http://repo1.maven.org/maven2/org/apache/poi/poi-scratchpad/3.8/poi-scratchpad-3.8.pom
Downloaded: http://repo1.maven.org/maven2/org/apache/poi/poi-scratchpad/3.8/poi-scratchpad-3.8.pom
(3 KB at 4.6 KB/sec)
Downloading: http://repo1.maven.org/maven2/org/apache/poi/poi-ooxml/3.8/poi-ooxml-3.8.pom
Downloaded: http://repo1.maven.org/maven2/org/apache/poi/poi-ooxml/3.8/poi-ooxml-3.8.pom (3
KB at 4.8 KB/sec)
Downloading: http://repo1.maven.org/maven2/org/apache/poi/poi-ooxml-schemas/3.8/poi-ooxml-schemas-3.8.pom
Downloaded: http://repo1.maven.org/maven2/org/apache/poi/poi-ooxml-schemas/3.8/poi-ooxml-schemas-3.8.pom
(3 KB at 5.8 KB/sec)
Downloading: http://repo1.maven.org/maven2/com/googlecode/mp4parser/isoparser/1.0-RC-1/isoparser-1.0-RC-1.pom
Downloaded: http://repo1.maven.org/maven2/com/googlecode/mp4parser/isoparser/1.0-RC-1/isoparser-1.0-RC-1.pom
(7 KB at 20.9 KB/sec)
Downloading: http://repo1.maven.org/maven2/org/aspectj/aspectjrt/1.6.11/aspectjrt-1.6.11.pom
Downloaded: http://repo1.maven.org/maven2/org/aspectj/aspectjrt/1.6.11/aspectjrt-1.6.11.pom
(2 KB at 2.1 KB/sec)
Downloading: http://repo1.maven.org/maven2/org/apache/poi/poi/3.8/poi-3.8.jar
Downloading: http://repo1.maven.org/maven2/org/apache/poi/poi-scratchpad/3.8/poi-scratchpad-3.8.jar
Downloading: http://repo1.maven.org/maven2/org/apache/poi/poi-ooxml/3.8/poi-ooxml-3.8.jar
Downloading: http://repo1.maven.org/maven2/org/apache/poi/poi-ooxml-schemas/3.8/poi-ooxml-schemas-3.8.jar
Downloading: http://repo1.maven.org/maven2/com/googlecode/mp4parser/isoparser/1.0-RC-1/isoparser-1.0-RC-1.jar
Downloaded: http://repo1.maven.org/maven2/org/apache/poi/poi/3.8/poi-3.8.jar (1778 KB at 1361.1
KB/sec)
Downloading: http://repo1.maven.org/maven2/org/aspectj/aspectjrt/1.6.11/aspectjrt-1.6.11.jar
Downloaded: http://repo1.maven.org/maven2/org/apache/poi/poi-scratchpad/3.8/poi-scratchpad-3.8.jar
(1160 KB at 726.2 KB/sec)
Downloaded: http://repo1.maven.org/maven2/org/apache/poi/poi-ooxml/3.8/poi-ooxml-3.8.jar (912
KB at 436.4 KB/sec)
Downloaded: http://repo1.maven.org/maven2/com/googlecode/mp4parser/isoparser/1.0-RC-1/isoparser-1.0-RC-1.jar
(510 KB at 219.3 KB/sec)
Downloaded: http://repo1.maven.org/maven2/org/apache/poi/poi-ooxml-schemas/3.8/poi-ooxml-schemas-3.8.jar
(4597 KB at 1799.0 KB/sec)
Downloaded: http://repo1.maven.org/maven2/org/aspectj/aspectjrt/1.6.11/aspectjrt-1.6.11.jar
(114 KB at 74.8 KB/sec)
[INFO] Deleting <https://builds.apache.org/job/Tika-trunk/ws/trunk/tika-parsers/target>
mojoStarted org.apache.maven.plugins:maven-clean-plugin:2.4.1(default-clean)
[INFO] 
[INFO] --- maven-clean-plugin:2.4.1:clean (default-clean) @ tika-parsers ---
mojoSucceeded org.apache.maven.plugins:maven-clean-plugin:2.4.1(default-clean)
[TASKS] Scanning folder '<https://builds.apache.org/job/Tika-trunk/ws/trunk/tika-parsers'>
for files matching the pattern '**/*.java' - excludes: 
[TASKS] Found 197 files to scan for tasks
Found 129 open tasks.
[TASKS] Computing warning deltas based on reference build #840
mojoStarted org.apache.maven.plugins:maven-remote-resources-plugin:1.2.1(default)
[INFO] 
[INFO] --- maven-remote-resources-plugin:1.2.1:process (default) @ tika-parsers ---
mojoSucceeded org.apache.maven.plugins:maven-remote-resources-plugin:1.2.1(default)
mojoStarted org.apache.maven.plugins:maven-resources-plugin:2.5(default-resources)[debug]
execute contextualize
[INFO] Using 'UTF-8' encoding to copy filtered resources.

[INFO] 
[INFO] --- maven-resources-plugin:2.5:resources (default-resources) @ tika-parsers ---
[INFO] Copying 3 resources
[INFO] Copying 3 resources
mojoSucceeded org.apache.maven.plugins:maven-resources-plugin:2.5(default-resources)
mojoStarted org.apache.maven.plugins:maven-compiler-plugin:2.3.2(default-compile)
[INFO] 
[INFO] --- maven-compiler-plugin:2.3.2:compile (default-compile) @ tika-parsers ---
[INFO] Compiling 125 source files to <https://builds.apache.org/job/Tika-trunk/ws/trunk/tika-parsers/target/classes>
[INFO] -------------------------------------------------------------
[ERROR] COMPILATION ERROR : 
[INFO] -------------------------------------------------------------
[ERROR] <https://builds.apache.org/job/Tika-trunk/ws/trunk/tika-parsers/src/main/java/org/apache/tika/parser/iptc/IptcAnpaParser.java>:[471,34]
cannot find symbol
symbol  : method isEmpty()
location: class java.lang.String
[ERROR] <https://builds.apache.org/job/Tika-trunk/ws/trunk/tika-parsers/src/main/java/org/apache/tika/parser/iptc/IptcAnpaParser.java>:[522,32]
cannot find symbol
symbol  : method isEmpty()
location: class java.lang.String
[ERROR] <https://builds.apache.org/job/Tika-trunk/ws/trunk/tika-parsers/src/main/java/org/apache/tika/parser/iptc/IptcAnpaParser.java>:[690,24]
cannot find symbol
symbol  : method isEmpty()
location: class java.lang.String
[ERROR] <https://builds.apache.org/job/Tika-trunk/ws/trunk/tika-parsers/src/main/java/org/apache/tika/parser/iptc/IptcAnpaParser.java>:[690,48]
cannot find symbol
symbol  : method isEmpty()
location: class java.lang.String
mojoFailed org.apache.maven.plugins:maven-compiler-plugin:2.3.2(default-compile)[ERROR] <https://builds.apache.org/job/Tika-trunk/ws/trunk/tika-parsers/src/main/java/org/apache/tika/parser/iptc/IptcAnpaParser.java>:[690,74]
cannot find symbol
symbol  : method isEmpty()
location: class java.lang.String
[ERROR] <https://builds.apache.org/job/Tika-trunk/ws/trunk/tika-parsers/src/main/java/org/apache/tika/parser/iptc/IptcAnpaParser.java>:[690,99]
cannot find symbol
symbol  : method isEmpty()
location: class java.lang.String
[ERROR] <https://builds.apache.org/job/Tika-trunk/ws/trunk/tika-parsers/src/main/java/org/apache/tika/parser/iptc/IptcAnpaParser.java>:[690,124]
cannot find symbol
symbol  : method isEmpty()
location: class java.lang.String
[ERROR] <https://builds.apache.org/job/Tika-trunk/ws/trunk/tika-parsers/src/main/java/org/apache/tika/parser/iptc/IptcAnpaParser.java>:[729,26]
cannot find symbol
symbol  : method isEmpty()
location: class java.lang.String
[ERROR] <https://builds.apache.org/job/Tika-trunk/ws/trunk/tika-parsers/src/main/java/org/apache/tika/parser/iptc/IptcAnpaParser.java>:[765,26]
cannot find symbol
symbol  : method isEmpty()
location: class java.lang.String
[ERROR] <https://builds.apache.org/job/Tika-trunk/ws/trunk/tika-parsers/src/main/java/org/apache/tika/parser/iptc/IptcAnpaParser.java>:[765,53]
cannot find symbol
symbol  : method isEmpty()
location: class java.lang.String
[ERROR] <https://builds.apache.org/job/Tika-trunk/ws/trunk/tika-parsers/src/main/java/org/apache/tika/parser/iptc/IptcAnpaParser.java>:[803,43]
cannot find symbol
symbol  : method getBytes(java.nio.charset.Charset)
location: class java.lang.String
[INFO] 11 errors 
[INFO] -------------------------------------------------------------

projectFailed org.apache.tika:tika-parsers:1.2-SNAPSHOT
sessionEnded
[INFO] ------------------------------------------------------------------------
[INFO] Reactor Summary:
[INFO] 
[INFO] Apache Tika parent ................................ SUCCESS [32.529s]
[INFO] Apache Tika core .................................. SUCCESS [42.261s]
[INFO] Apache Tika parsers ............................... FAILURE [23.657s]
[INFO] Apache Tika application ........................... SKIPPED
[INFO] Apache Tika OSGi bundle ........................... SKIPPED
[INFO] Apache Tika ....................................... SKIPPED
[INFO] ------------------------------------------------------------------------
[INFO] BUILD FAILURE
[INFO] ------------------------------------------------------------------------
[INFO] Total time: 1:42.638s
[INFO] Finished at: Sat Apr 28 19:03:21 UTC 2012
[INFO] Final Memory: 28M/162M
[INFO] ------------------------------------------------------------------------
Projects to build: [MavenProject: org.apache.tika:tika-parent:1.2-SNAPSHOT @ <https://builds.apache.org/job/Tika-trunk/ws/trunk/tika-parent/pom.xml,>
MavenProject: org.apache.tika:tika-core:1.2-SNAPSHOT @ <https://builds.apache.org/job/Tika-trunk/ws/trunk/tika-core/pom.xml,>
MavenProject: org.apache.tika:tika-parsers:1.2-SNAPSHOT @ <https://builds.apache.org/job/Tika-trunk/ws/trunk/tika-parsers/pom.xml,>
MavenProject: org.apache.tika:tika-app:1.2-SNAPSHOT @ <https://builds.apache.org/job/Tika-trunk/ws/trunk/tika-app/pom.xml,>
MavenProject: org.apache.tika:tika-bundle:1.2-SNAPSHOT @ <https://builds.apache.org/job/Tika-trunk/ws/trunk/tika-bundle/pom.xml,>
MavenProject: org.apache.tika:tika:1.2-SNAPSHOT @ <https://builds.apache.org/job/Tika-trunk/ws/trunk/pom.xml]>
[JENKINS] Archiving <https://builds.apache.org/job/Tika-trunk/ws/trunk/pom.xml> to /home/hudson/hudson/jobs/Tika-trunk/modules/org.apache.tika$tika/builds/2012-04-28_19-01-20/archive/org.apache.tika/tika/1.2-SNAPSHOT/tika-1.2-SNAPSHOT.pom
[JENKINS] Archiving <https://builds.apache.org/job/Tika-trunk/ws/trunk/tika-parent/pom.xml>
to /home/hudson/hudson/jobs/Tika-trunk/modules/org.apache.tika$tika-parent/builds/2012-04-28_19-01-20/archive/org.apache.tika/tika-parent/1.2-SNAPSHOT/tika-parent-1.2-SNAPSHOT.pom
[JENKINS] Archiving <https://builds.apache.org/job/Tika-trunk/ws/trunk/tika-parsers/pom.xml>
to /home/hudson/hudson/jobs/Tika-trunk/modules/org.apache.tika$tika-parsers/builds/2012-04-28_19-01-20/archive/org.apache.tika/tika-parsers/1.2-SNAPSHOT/tika-parsers-1.2-SNAPSHOT.pom
[JENKINS] Archiving <https://builds.apache.org/job/Tika-trunk/ws/trunk/tika-app/pom.xml>
to /home/hudson/hudson/jobs/Tika-trunk/modules/org.apache.tika$tika-app/builds/2012-04-28_19-01-20/archive/org.apache.tika/tika-app/1.2-SNAPSHOT/tika-app-1.2-SNAPSHOT.pom
[JENKINS] Archiving <https://builds.apache.org/job/Tika-trunk/ws/trunk/tika-core/pom.xml>
to /home/hudson/hudson/jobs/Tika-trunk/modules/org.apache.tika$tika-core/builds/2012-04-28_19-01-20/archive/org.apache.tika/tika-core/1.2-SNAPSHOT/tika-core-1.2-SNAPSHOT.pom
[JENKINS] Archiving <https://builds.apache.org/job/Tika-trunk/ws/trunk/tika-core/target/tika-core-1.2-SNAPSHOT.jar>
to /home/hudson/hudson/jobs/Tika-trunk/modules/org.apache.tika$tika-core/builds/2012-04-28_19-01-20/archive/org.apache.tika/tika-core/1.2-20120428.190254-34/tika-core-1.2-20120428.190254-34.jar
[JENKINS] Archiving <https://builds.apache.org/job/Tika-trunk/ws/trunk/tika-bundle/pom.xml>
to /home/hudson/hudson/jobs/Tika-trunk/modules/org.apache.tika$tika-bundle/builds/2012-04-28_19-01-20/archive/org.apache.tika/tika-bundle/1.2-SNAPSHOT/tika-bundle-1.2-SNAPSHOT.pom
Waiting for Jenkins to finish collecting data
mavenExecutionResult exceptions not empty
message : Failed to execute goal org.apache.maven.plugins:maven-compiler-plugin:2.3.2:compile
(default-compile) on project tika-parsers: Compilation failure
cause : Compilation failure
Stack trace : 
org.apache.maven.lifecycle.LifecycleExecutionException: Failed to execute goal org.apache.maven.plugins:maven-compiler-plugin:2.3.2:compile
(default-compile) on project tika-parsers: Compilation failure
	at org.apache.maven.lifecycle.internal.MojoExecutor.execute(MojoExecutor.java:213)
	at org.apache.maven.lifecycle.internal.MojoExecutor.execute(MojoExecutor.java:153)
	at org.apache.maven.lifecycle.internal.MojoExecutor.execute(MojoExecutor.java:145)
	at org.apache.maven.lifecycle.internal.LifecycleModuleBuilder.buildProject(LifecycleModuleBuilder.java:84)
	at org.apache.maven.lifecycle.internal.LifecycleModuleBuilder.buildProject(LifecycleModuleBuilder.java:59)
	at org.apache.maven.lifecycle.internal.LifecycleStarter.singleThreadedBuild(LifecycleStarter.java:183)
	at org.apache.maven.lifecycle.internal.LifecycleStarter.execute(LifecycleStarter.java:161)
	at org.apache.maven.DefaultMaven.doExecute(DefaultMaven.java:319)
	at org.apache.maven.DefaultMaven.execute(DefaultMaven.java:156)
	at org.jvnet.hudson.maven3.launcher.Maven3Launcher.main(Maven3Launcher.java:79)
	at sun.reflect.NativeMethodAccessorImpl.invoke0(Native Method)
	at sun.reflect.NativeMethodAccessorImpl.invoke(NativeMethodAccessorImpl.java:39)
	at sun.reflect.DelegatingMethodAccessorImpl.invoke(DelegatingMethodAccessorImpl.java:25)
	at java.lang.reflect.Method.invoke(Method.java:592)
	at org.codehaus.plexus.classworlds.launcher.Launcher.launchStandard(Launcher.java:329)
	at org.codehaus.plexus.classworlds.launcher.Launcher.launch(Launcher.java:239)
	at org.jvnet.hudson.maven3.agent.Maven3Main.launch(Maven3Main.java:158)
	at hudson.maven.Maven3Builder.call(Maven3Builder.java:98)
	at hudson.maven.Maven3Builder.call(Maven3Builder.java:64)
	at hudson.remoting.UserRequest.perform(UserRequest.java:118)
	at hudson.remoting.UserRequest.perform(UserRequest.java:48)
	at hudson.remoting.Request$2.run(Request.java:287)
	at hudson.remoting.InterceptingExecutorService$1.call(InterceptingExecutorService.java:72)
	at java.util.concurrent.FutureTask$Sync.innerRun(FutureTask.java:269)
	at java.util.concurrent.FutureTask.run(FutureTask.java:123)
	at java.util.concurrent.ThreadPoolExecutor$Worker.runTask(ThreadPoolExecutor.java:651)
	at java.util.concurrent.ThreadPoolExecutor$Worker.run(ThreadPoolExecutor.java:676)
	at java.lang.Thread.run(Thread.java:595)
Caused by: org.apache.maven.plugin.CompilationFailureException: Compilation failure
	at org.apache.maven.plugin.AbstractCompilerMojo.execute(AbstractCompilerMojo.java:656)
	at org.apache.maven.plugin.CompilerMojo.execute(CompilerMojo.java:128)
	at org.apache.maven.plugin.DefaultBuildPluginManager.executeMojo(DefaultBuildPluginManager.java:101)
	at org.apache.maven.lifecycle.internal.MojoExecutor.execute(MojoExecutor.java:209)
	... 27 more
[TASKS] Aggregating results of Apache Tika parent
[TASKS] Using set difference to compute new warnings
[TASKS] Aggregating results of Apache Tika core
[TASKS] Using set difference to compute new warnings
[TASKS] Aggregating results of Apache Tika parsers
[TASKS] Using set difference to compute new warnings
channel stopped

Mime
View raw message