tika-dev mailing list archives

Site index · List index
Message view « Date » · « Thread »
Top « Date » · « Thread »
From Apache Jenkins Server <jenk...@builds.apache.org>
Subject Build failed in Jenkins: Tika-trunk #829
Date Wed, 04 Apr 2012 10:12:40 GMT
See <https://builds.apache.org/job/Tika-trunk/829/changes>

Changes:

[maxcom] TIKA-593: share/bundle plugin configuration

------------------------------------------
[...truncated 684 lines...]
Downloaded: http://repo1.maven.org/maven2/org/apache/cxf/cxf-rt-transports-common/2.5.2/cxf-rt-transports-common-2.5.2.jar
(18 KB at 8.2 KB/sec)
Downloaded: http://repo1.maven.org/maven2/org/apache/cxf/cxf-rt-transports-http-jetty/2.5.2/cxf-rt-transports-http-jetty-2.5.2.jar
(68 KB at 30.1 KB/sec)
[INFO] [INFO] Deleting <https://builds.apache.org/job/Tika-trunk/ws/trunk/tika-server/target>

[INFO] --- maven-clean-plugin:2.4.1:clean (default-clean) @ tika-server ---
[TASKS] Scanning folder '<https://builds.apache.org/job/Tika-trunk/ws/trunk/tika-server'>
for files matching the pattern '**/*.java' - excludes: 
[TASKS] Found 12 files to scan for tasks
Found 0 open tasks.
[TASKS] Computing warning deltas based on reference build #826
[INFO] 
[INFO] --- maven-remote-resources-plugin:1.2.1:process (default) @ tika-server ---
[INFO] 
[INFO] --- maven-resources-plugin:2.5:resources (default-resources) @ tika-server ---
[debug] execute contextualize
[INFO] Using 'UTF-8' encoding to copy filtered resources.
[INFO] Copying 2 resources
[INFO] Copying 3 resources
[INFO] 
[INFO] --- maven-compiler-plugin:2.3.2:compile (default-compile) @ tika-server ---
[INFO] Compiling 8 source files to <https://builds.apache.org/job/Tika-trunk/ws/trunk/tika-server/target/classes>
[debug] execute contextualize
[INFO] [INFO] Using 'UTF-8' encoding to copy filtered resources.

[INFO] --- maven-resources-plugin:2.5:testResources (default-testResources) @ tika-server
---
[INFO] Copying 8 resources
[INFO] Copying 3 resources
[INFO] [INFO] Compiling 4 source files to <https://builds.apache.org/job/Tika-trunk/ws/trunk/tika-server/target/test-classes>

[INFO] --- maven-compiler-plugin:2.3.2:testCompile (default-testCompile) @ tika-server ---
[INFO] 
[INFO] --- maven-surefire-plugin:2.12:test (default-test) @ tika-server ---
[INFO] Surefire report directory: <https://builds.apache.org/job/Tika-trunk/ws/trunk/tika-server/target/surefire-reports>

-------------------------------------------------------
 T E S T S
-------------------------------------------------------
Running org.apache.tika.server.TikaResourceTest
Tests run: 4, Failures: 0, Errors: 0, Skipped: 0, Time elapsed: 1.611 sec
Running org.apache.tika.server.UnpackerResourceTest
Tests run: 10, Failures: 0, Errors: 0, Skipped: 0, Time elapsed: 1.995 sec
Running org.apache.tika.server.MetadataResourceTest
Tests run: 1, Failures: 0, Errors: 0, Skipped: 0, Time elapsed: 0.018 sec

Results :

Tests run: 15, Failures: 0, Errors: 0, Skipped: 0

[JENKINS] Recording test results
[INFO] 
[INFO] --- maven-bundle-plugin:2.3.5:bundle (default-bundle) @ tika-server ---
[JENKINS] Archiving <https://builds.apache.org/job/Tika-trunk/ws/trunk/tika-server/pom.xml>
to /home/hudson/hudson/jobs/Tika-trunk/modules/org.apache.tika$tika-server/builds/2012-04-04_10-04-26/archive/org.apache.tika/tika-server/1.2-SNAPSHOT/tika-server-1.2-SNAPSHOT.pom
[INFO] ------------------------------------------------------------------------
[INFO] Reactor Summary:
[INFO] 
[INFO] Apache Tika parent ................................ SUCCESS [31.709s]
[INFO] Apache Tika core .................................. SUCCESS [35.565s]
[INFO] Apache Tika parsers ............................... SUCCESS [1:08.323s]
[INFO] Apache Tika application ........................... SUCCESS [41.300s]
[INFO] Apache Tika OSGi bundle ........................... SUCCESS [28.310s]
[INFO] Apache Tika server ................................ FAILURE [18.922s]
[INFO] Apache Tika ....................................... SKIPPED
[INFO] ------------------------------------------------------------------------
[INFO] BUILD FAILURE
[INFO] ------------------------------------------------------------------------
[INFO] Total time: 7:53.496s
[INFO] Finished at: Wed Apr 04 10:12:38 UTC 2012
[INFO] Final Memory: 54M/431M
[INFO] ------------------------------------------------------------------------
Waiting for Jenkins to finish collecting data
mavenExecutionResult exceptions not empty
message : Failed to execute goal org.apache.felix:maven-bundle-plugin:2.3.5:bundle (default-bundle)
on project tika-server: Execution default-bundle of goal org.apache.felix:maven-bundle-plugin:2.3.5:bundle
failed: An API incompatibility was encountered while executing org.apache.felix:maven-bundle-plugin:2.3.5:bundle:
java.lang.NoSuchMethodError: java.lang.String.getBytes(Ljava/nio/charset/Charset;)[B
-----------------------------------------------------
realm =    plugin>org.apache.felix:maven-bundle-plugin:2.3.5
strategy = org.codehaus.plexus.classworlds.strategy.SelfFirstStrategy
urls[0] = file:/home/jenkins/jenkins-slave/maven-repositories/1/org/apache/felix/maven-bundle-plugin/2.3.5/maven-bundle-plugin-2.3.5.jar
urls[1] = file:/home/jenkins/jenkins-slave/maven-repositories/1/biz/aQute/bndlib/1.43.0/bndlib-1.43.0.jar
urls[2] = file:/home/jenkins/jenkins-slave/maven-repositories/1/org/apache/felix/org.apache.felix.bundlerepository/1.6.6/org.apache.felix.bundlerepository-1.6.6.jar
urls[3] = file:/home/jenkins/jenkins-slave/maven-repositories/1/org/osgi/org.osgi.core/4.1.0/org.osgi.core-4.1.0.jar
urls[4] = file:/home/jenkins/jenkins-slave/maven-repositories/1/org/easymock/easymock/2.4/easymock-2.4.jar
urls[5] = file:/home/jenkins/jenkins-slave/maven-repositories/1/org/apache/maven/reporting/maven-reporting-api/2.0.7/maven-reporting-api-2.0.7.jar
urls[6] = file:/home/jenkins/jenkins-slave/maven-repositories/1/org/apache/maven/doxia/doxia-sink-api/1.0-alpha-7/doxia-sink-api-1.0-alpha-7.jar
urls[7] = file:/home/jenkins/jenkins-slave/maven-repositories/1/junit/junit/3.8.1/junit-3.8.1.jar
urls[8] = file:/home/jenkins/jenkins-slave/maven-repositories/1/commons-cli/commons-cli/1.0/commons-cli-1.0.jar
urls[9] = file:/home/jenkins/jenkins-slave/maven-repositories/1/org/codehaus/plexus/plexus-interactivity-api/1.0-alpha-4/plexus-interactivity-api-1.0-alpha-4.jar
urls[10] = file:/home/jenkins/jenkins-slave/maven-repositories/1/org/apache/maven/maven-archiver/2.4.1/maven-archiver-2.4.1.jar
urls[11] = file:/home/jenkins/jenkins-slave/maven-repositories/1/org/codehaus/plexus/plexus-archiver/1.0/plexus-archiver-1.0.jar
urls[12] = file:/home/jenkins/jenkins-slave/maven-repositories/1/org/codehaus/plexus/plexus-io/1.0/plexus-io-1.0.jar
urls[13] = file:/home/jenkins/jenkins-slave/maven-repositories/1/org/codehaus/plexus/plexus-interpolation/1.13/plexus-interpolation-1.13.jar
urls[14] = file:/home/jenkins/jenkins-slave/maven-repositories/1/org/apache/maven/shared/maven-dependency-tree/1.2/maven-dependency-tree-1.2.jar
urls[15] = file:/home/jenkins/jenkins-slave/maven-repositories/1/org/codehaus/plexus/plexus-utils/2.1/plexus-utils-2.1.jar
Number of foreign imports: 1
import: Entry[import  from realm ClassRealm[project>org.apache.tika:tika-server:1.2-SNAPSHOT,
parent: ClassRealm[maven.api, parent: null]]]

-----------------------------------------------------

cause : Execution default-bundle of goal org.apache.felix:maven-bundle-plugin:2.3.5:bundle
failed: An API incompatibility was encountered while executing org.apache.felix:maven-bundle-plugin:2.3.5:bundle:
java.lang.NoSuchMethodError: java.lang.String.getBytes(Ljava/nio/charset/Charset;)[B
-----------------------------------------------------
realm =    plugin>org.apache.felix:maven-bundle-plugin:2.3.5
strategy = org.codehaus.plexus.classworlds.strategy.SelfFirstStrategy
urls[0] = file:/home/jenkins/jenkins-slave/maven-repositories/1/org/apache/felix/maven-bundle-plugin/2.3.5/maven-bundle-plugin-2.3.5.jar
urls[1] = file:/home/jenkins/jenkins-slave/maven-repositories/1/biz/aQute/bndlib/1.43.0/bndlib-1.43.0.jar
urls[2] = file:/home/jenkins/jenkins-slave/maven-repositories/1/org/apache/felix/org.apache.felix.bundlerepository/1.6.6/org.apache.felix.bundlerepository-1.6.6.jar
urls[3] = file:/home/jenkins/jenkins-slave/maven-repositories/1/org/osgi/org.osgi.core/4.1.0/org.osgi.core-4.1.0.jar
urls[4] = file:/home/jenkins/jenkins-slave/maven-repositories/1/org/easymock/easymock/2.4/easymock-2.4.jar
urls[5] = file:/home/jenkins/jenkins-slave/maven-repositories/1/org/apache/maven/reporting/maven-reporting-api/2.0.7/maven-reporting-api-2.0.7.jar
urls[6] = file:/home/jenkins/jenkins-slave/maven-repositories/1/org/apache/maven/doxia/doxia-sink-api/1.0-alpha-7/doxia-sink-api-1.0-alpha-7.jar
urls[7] = file:/home/jenkins/jenkins-slave/maven-repositories/1/junit/junit/3.8.1/junit-3.8.1.jar
urls[8] = file:/home/jenkins/jenkins-slave/maven-repositories/1/commons-cli/commons-cli/1.0/commons-cli-1.0.jar
urls[9] = file:/home/jenkins/jenkins-slave/maven-repositories/1/org/codehaus/plexus/plexus-interactivity-api/1.0-alpha-4/plexus-interactivity-api-1.0-alpha-4.jar
urls[10] = file:/home/jenkins/jenkins-slave/maven-repositories/1/org/apache/maven/maven-archiver/2.4.1/maven-archiver-2.4.1.jar
urls[11] = file:/home/jenkins/jenkins-slave/maven-repositories/1/org/codehaus/plexus/plexus-archiver/1.0/plexus-archiver-1.0.jar
urls[12] = file:/home/jenkins/jenkins-slave/maven-repositories/1/org/codehaus/plexus/plexus-io/1.0/plexus-io-1.0.jar
urls[13] = file:/home/jenkins/jenkins-slave/maven-repositories/1/org/codehaus/plexus/plexus-interpolation/1.13/plexus-interpolation-1.13.jar
urls[14] = file:/home/jenkins/jenkins-slave/maven-repositories/1/org/apache/maven/shared/maven-dependency-tree/1.2/maven-dependency-tree-1.2.jar
urls[15] = file:/home/jenkins/jenkins-slave/maven-repositories/1/org/codehaus/plexus/plexus-utils/2.1/plexus-utils-2.1.jar
Number of foreign imports: 1
import: Entry[import  from realm ClassRealm[project>org.apache.tika:tika-server:1.2-SNAPSHOT,
parent: ClassRealm[maven.api, parent: null]]]

-----------------------------------------------------

Stack trace : 
org.apache.maven.lifecycle.LifecycleExecutionException: Failed to execute goal org.apache.felix:maven-bundle-plugin:2.3.5:bundle
(default-bundle) on project tika-server: Execution default-bundle of goal org.apache.felix:maven-bundle-plugin:2.3.5:bundle
failed: An API incompatibility was encountered while executing org.apache.felix:maven-bundle-plugin:2.3.5:bundle:
java.lang.NoSuchMethodError: java.lang.String.getBytes(Ljava/nio/charset/Charset;)[B
-----------------------------------------------------
realm =    plugin>org.apache.felix:maven-bundle-plugin:2.3.5
strategy = org.codehaus.plexus.classworlds.strategy.SelfFirstStrategy
urls[0] = file:/home/jenkins/jenkins-slave/maven-repositories/1/org/apache/felix/maven-bundle-plugin/2.3.5/maven-bundle-plugin-2.3.5.jar
urls[1] = file:/home/jenkins/jenkins-slave/maven-repositories/1/biz/aQute/bndlib/1.43.0/bndlib-1.43.0.jar
urls[2] = file:/home/jenkins/jenkins-slave/maven-repositories/1/org/apache/felix/org.apache.felix.bundlerepository/1.6.6/org.apache.felix.bundlerepository-1.6.6.jar
urls[3] = file:/home/jenkins/jenkins-slave/maven-repositories/1/org/osgi/org.osgi.core/4.1.0/org.osgi.core-4.1.0.jar
urls[4] = file:/home/jenkins/jenkins-slave/maven-repositories/1/org/easymock/easymock/2.4/easymock-2.4.jar
urls[5] = file:/home/jenkins/jenkins-slave/maven-repositories/1/org/apache/maven/reporting/maven-reporting-api/2.0.7/maven-reporting-api-2.0.7.jar
urls[6] = file:/home/jenkins/jenkins-slave/maven-repositories/1/org/apache/maven/doxia/doxia-sink-api/1.0-alpha-7/doxia-sink-api-1.0-alpha-7.jar
urls[7] = file:/home/jenkins/jenkins-slave/maven-repositories/1/junit/junit/3.8.1/junit-3.8.1.jar
urls[8] = file:/home/jenkins/jenkins-slave/maven-repositories/1/commons-cli/commons-cli/1.0/commons-cli-1.0.jar
urls[9] = file:/home/jenkins/jenkins-slave/maven-repositories/1/org/codehaus/plexus/plexus-interactivity-api/1.0-alpha-4/plexus-interactivity-api-1.0-alpha-4.jar
urls[10] = file:/home/jenkins/jenkins-slave/maven-repositories/1/org/apache/maven/maven-archiver/2.4.1/maven-archiver-2.4.1.jar
urls[11] = file:/home/jenkins/jenkins-slave/maven-repositories/1/org/codehaus/plexus/plexus-archiver/1.0/plexus-archiver-1.0.jar
urls[12] = file:/home/jenkins/jenkins-slave/maven-repositories/1/org/codehaus/plexus/plexus-io/1.0/plexus-io-1.0.jar
urls[13] = file:/home/jenkins/jenkins-slave/maven-repositories/1/org/codehaus/plexus/plexus-interpolation/1.13/plexus-interpolation-1.13.jar
urls[14] = file:/home/jenkins/jenkins-slave/maven-repositories/1/org/apache/maven/shared/maven-dependency-tree/1.2/maven-dependency-tree-1.2.jar
urls[15] = file:/home/jenkins/jenkins-slave/maven-repositories/1/org/codehaus/plexus/plexus-utils/2.1/plexus-utils-2.1.jar
Number of foreign imports: 1
import: Entry[import  from realm ClassRealm[project>org.apache.tika:tika-server:1.2-SNAPSHOT,
parent: ClassRealm[maven.api, parent: null]]]

-----------------------------------------------------

	at org.apache.maven.lifecycle.internal.MojoExecutor.execute(MojoExecutor.java:225)
	at org.apache.maven.lifecycle.internal.MojoExecutor.execute(MojoExecutor.java:153)
	at org.apache.maven.lifecycle.internal.MojoExecutor.execute(MojoExecutor.java:145)
	at org.apache.maven.lifecycle.internal.LifecycleModuleBuilder.buildProject(LifecycleModuleBuilder.java:84)
	at org.apache.maven.lifecycle.internal.LifecycleModuleBuilder.buildProject(LifecycleModuleBuilder.java:59)
	at org.apache.maven.lifecycle.internal.LifecycleStarter.singleThreadedBuild(LifecycleStarter.java:183)
	at org.apache.maven.lifecycle.internal.LifecycleStarter.execute(LifecycleStarter.java:161)
	at org.apache.maven.DefaultMaven.doExecute(DefaultMaven.java:319)
	at org.apache.maven.DefaultMaven.execute(DefaultMaven.java:156)
	at org.jvnet.hudson.maven3.launcher.Maven3Launcher.main(Maven3Launcher.java:79)
	at sun.reflect.NativeMethodAccessorImpl.invoke0(Native Method)
	at sun.reflect.NativeMethodAccessorImpl.invoke(NativeMethodAccessorImpl.java:39)
	at sun.reflect.DelegatingMethodAccessorImpl.invoke(DelegatingMethodAccessorImpl.java:25)
	at java.lang.reflect.Method.invoke(Method.java:592)
	at org.codehaus.plexus.classworlds.launcher.Launcher.launchStandard(Launcher.java:329)
	at org.codehaus.plexus.classworlds.launcher.Launcher.launch(Launcher.java:239)
	at org.jvnet.hudson.maven3.agent.Maven3Main.launch(Maven3Main.java:158)
	at hudson.maven.Maven3Builder.call(Maven3Builder.java:104)
	at hudson.maven.Maven3Builder.call(Maven3Builder.java:70)
	at hudson.remoting.UserRequest.perform(UserRequest.java:118)
	at hudson.remoting.UserRequest.perform(UserRequest.java:48)
	at hudson.remoting.Request$2.run(Request.java:287)
	at hudson.remoting.InterceptingExecutorService$1.call(InterceptingExecutorService.java:72)
	at java.util.concurrent.FutureTask$Sync.innerRun(FutureTask.java:269)
	at java.util.concurrent.FutureTask.run(FutureTask.java:123)
	at java.util.concurrent.ThreadPoolExecutor$Worker.runTask(ThreadPoolExecutor.java:651)
	at java.util.concurrent.ThreadPoolExecutor$Worker.run(ThreadPoolExecutor.java:676)
	at java.lang.Thread.run(Thread.java:595)
Caused by: org.apache.maven.plugin.PluginExecutionException: Execution default-bundle of goal
org.apache.felix:maven-bundle-plugin:2.3.5:bundle failed: An API incompatibility was encountered
while executing org.apache.felix:maven-bundle-plugin:2.3.5:bundle: java.lang.NoSuchMethodError:
java.lang.String.getBytes(Ljava/nio/charset/Charset;)[B
-----------------------------------------------------
realm =    plugin>org.apache.felix:maven-bundle-plugin:2.3.5
strategy = org.codehaus.plexus.classworlds.strategy.SelfFirstStrategy
urls[0] = file:/home/jenkins/jenkins-slave/maven-repositories/1/org/apache/felix/maven-bundle-plugin/2.3.5/maven-bundle-plugin-2.3.5.jar
urls[1] = file:/home/jenkins/jenkins-slave/maven-repositories/1/biz/aQute/bndlib/1.43.0/bndlib-1.43.0.jar
urls[2] = file:/home/jenkins/jenkins-slave/maven-repositories/1/org/apache/felix/org.apache.felix.bundlerepository/1.6.6/org.apache.felix.bundlerepository-1.6.6.jar
urls[3] = file:/home/jenkins/jenkins-slave/maven-repositories/1/org/osgi/org.osgi.core/4.1.0/org.osgi.core-4.1.0.jar
urls[4] = file:/home/jenkins/jenkins-slave/maven-repositories/1/org/easymock/easymock/2.4/easymock-2.4.jar
urls[5] = file:/home/jenkins/jenkins-slave/maven-repositories/1/org/apache/maven/reporting/maven-reporting-api/2.0.7/maven-reporting-api-2.0.7.jar
urls[6] = file:/home/jenkins/jenkins-slave/maven-repositories/1/org/apache/maven/doxia/doxia-sink-api/1.0-alpha-7/doxia-sink-api-1.0-alpha-7.jar
urls[7] = file:/home/jenkins/jenkins-slave/maven-repositories/1/junit/junit/3.8.1/junit-3.8.1.jar
urls[8] = file:/home/jenkins/jenkins-slave/maven-repositories/1/commons-cli/commons-cli/1.0/commons-cli-1.0.jar
urls[9] = file:/home/jenkins/jenkins-slave/maven-repositories/1/org/codehaus/plexus/plexus-interactivity-api/1.0-alpha-4/plexus-interactivity-api-1.0-alpha-4.jar
urls[10] = file:/home/jenkins/jenkins-slave/maven-repositories/1/org/apache/maven/maven-archiver/2.4.1/maven-archiver-2.4.1.jar
urls[11] = file:/home/jenkins/jenkins-slave/maven-repositories/1/org/codehaus/plexus/plexus-archiver/1.0/plexus-archiver-1.0.jar
urls[12] = file:/home/jenkins/jenkins-slave/maven-repositories/1/org/codehaus/plexus/plexus-io/1.0/plexus-io-1.0.jar
urls[13] = file:/home/jenkins/jenkins-slave/maven-repositories/1/org/codehaus/plexus/plexus-interpolation/1.13/plexus-interpolation-1.13.jar
urls[14] = file:/home/jenkins/jenkins-slave/maven-repositories/1/org/apache/maven/shared/maven-dependency-tree/1.2/maven-dependency-tree-1.2.jar
urls[15] = file:/home/jenkins/jenkins-slave/maven-repositories/1/org/codehaus/plexus/plexus-utils/2.1/plexus-utils-2.1.jar
Number of foreign imports: 1
import: Entry[import  from realm ClassRealm[project>org.apache.tika:tika-server:1.2-SNAPSHOT,
parent: ClassRealm[maven.api, parent: null]]]

-----------------------------------------------------

	at org.apache.maven.plugin.DefaultBuildPluginManager.executeMojo(DefaultBuildPluginManager.java:139)
	at org.apache.maven.lifecycle.internal.MojoExecutor.execute(MojoExecutor.java:209)
	... 27 more
Caused by: org.apache.maven.plugin.PluginContainerException: An API incompatibility was encountered
while executing org.apache.felix:maven-bundle-plugin:2.3.5:bundle: java.lang.NoSuchMethodError:
java.lang.String.getBytes(Ljava/nio/charset/Charset;)[B
-----------------------------------------------------
realm =    plugin>org.apache.felix:maven-bundle-plugin:2.3.5
strategy = org.codehaus.plexus.classworlds.strategy.SelfFirstStrategy
urls[0] = file:/home/jenkins/jenkins-slave/maven-repositories/1/org/apache/felix/maven-bundle-plugin/2.3.5/maven-bundle-plugin-2.3.5.jar
urls[1] = file:/home/jenkins/jenkins-slave/maven-repositories/1/biz/aQute/bndlib/1.43.0/bndlib-1.43.0.jar
urls[2] = file:/home/jenkins/jenkins-slave/maven-repositories/1/org/apache/felix/org.apache.felix.bundlerepository/1.6.6/org.apache.felix.bundlerepository-1.6.6.jar
urls[3] = file:/home/jenkins/jenkins-slave/maven-repositories/1/org/osgi/org.osgi.core/4.1.0/org.osgi.core-4.1.0.jar
urls[4] = file:/home/jenkins/jenkins-slave/maven-repositories/1/org/easymock/easymock/2.4/easymock-2.4.jar
urls[5] = file:/home/jenkins/jenkins-slave/maven-repositories/1/org/apache/maven/reporting/maven-reporting-api/2.0.7/maven-reporting-api-2.0.7.jar
urls[6] = file:/home/jenkins/jenkins-slave/maven-repositories/1/org/apache/maven/doxia/doxia-sink-api/1.0-alpha-7/doxia-sink-api-1.0-alpha-7.jar
urls[7] = file:/home/jenkins/jenkins-slave/maven-repositories/1/junit/junit/3.8.1/junit-3.8.1.jar
urls[8] = file:/home/jenkins/jenkins-slave/maven-repositories/1/commons-cli/commons-cli/1.0/commons-cli-1.0.jar
urls[9] = file:/home/jenkins/jenkins-slave/maven-repositories/1/org/codehaus/plexus/plexus-interactivity-api/1.0-alpha-4/plexus-interactivity-api-1.0-alpha-4.jar
urls[10] = file:/home/jenkins/jenkins-slave/maven-repositories/1/org/apache/maven/maven-archiver/2.4.1/maven-archiver-2.4.1.jar
urls[11] = file:/home/jenkins/jenkins-slave/maven-repositories/1/org/codehaus/plexus/plexus-archiver/1.0/plexus-archiver-1.0.jar
urls[12] = file:/home/jenkins/jenkins-slave/maven-repositories/1/org/codehaus/plexus/plexus-io/1.0/plexus-io-1.0.jar
urls[13] = file:/home/jenkins/jenkins-slave/maven-repositories/1/org/codehaus/plexus/plexus-interpolation/1.13/plexus-interpolation-1.13.jar
urls[14] = file:/home/jenkins/jenkins-slave/maven-repositories/1/org/apache/maven/shared/maven-dependency-tree/1.2/maven-dependency-tree-1.2.jar
urls[15] = file:/home/jenkins/jenkins-slave/maven-repositories/1/org/codehaus/plexus/plexus-utils/2.1/plexus-utils-2.1.jar
Number of foreign imports: 1
import: Entry[import  from realm ClassRealm[project>org.apache.tika:tika-server:1.2-SNAPSHOT,
parent: ClassRealm[maven.api, parent: null]]]

-----------------------------------------------------

	at org.apache.maven.plugin.DefaultBuildPluginManager.executeMojo(DefaultBuildPluginManager.java:137)
	... 28 more
Caused by: java.lang.NoSuchMethodError: java.lang.String.getBytes(Ljava/nio/charset/Charset;)[B
	at aQute.lib.osgi.Jar.<clinit>(Jar.java:290)
	at org.apache.felix.bundleplugin.BundlePlugin.getClasspath(BundlePlugin.java:942)
	at org.apache.felix.bundleplugin.BundlePlugin.execute(BundlePlugin.java:261)
	at org.apache.felix.bundleplugin.BundlePlugin.execute(BundlePlugin.java:252)
	at org.apache.maven.plugin.DefaultBuildPluginManager.executeMojo(DefaultBuildPluginManager.java:101)
	... 28 more
[TASKS] Aggregating results of Apache Tika parent
[TASKS] Using set difference to compute new warnings
[TASKS] Aggregating results of Apache Tika core
[TASKS] Using set difference to compute new warnings
[TASKS] Aggregating results of Apache Tika parsers
[TASKS] Using set difference to compute new warnings
[TASKS] Aggregating results of Apache Tika application
[TASKS] Using set difference to compute new warnings
[TASKS] Aggregating results of Apache Tika OSGi bundle
[TASKS] Using set difference to compute new warnings
[TASKS] Aggregating results of Apache Tika server
[TASKS] Using set difference to compute new warnings
channel stopped

Mime
View raw message