tika-dev mailing list archives

Site index · List index
Message view « Date » · « Thread »
Top « Date » · « Thread »
From Apache Jenkins Server <jenk...@builds.apache.org>
Subject Build failed in Jenkins: Tika-trunk #833
Date Thu, 19 Apr 2012 14:07:27 GMT
See <https://builds.apache.org/job/Tika-trunk/833/changes>

Changes:

[jukka] TIKA-896: OSGi deployment without declarative services

Add missing Activator. Inline the separate OSGiDetector and -Parser classes.

------------------------------------------
[...truncated 439 lines...]
[INFO] [INFO] Exclude: src/main/java/org/apache/tika/parser/txt/Charset*.java
[INFO] Exclude: src/test/resources/test-documents/**

[INFO] --- apache-rat-plugin:0.7:check (default) @ tika-parsers ---
[PMD] No report found for mojo check
[INFO] [INFO] Installing <https://builds.apache.org/job/Tika-trunk/ws/trunk/tika-parsers/target/tika-parsers-1.2-SNAPSHOT.jar>
to /home/jenkins/jenkins-slave/maven-repositories/1/org/apache/tika/tika-parsers/1.2-SNAPSHOT/tika-parsers-1.2-SNAPSHOT.jar
[INFO] Installing <https://builds.apache.org/job/Tika-trunk/ws/trunk/tika-parsers/pom.xml>
to /home/jenkins/jenkins-slave/maven-repositories/1/org/apache/tika/tika-parsers/1.2-SNAPSHOT/tika-parsers-1.2-SNAPSHOT.pom

[INFO] --- maven-install-plugin:2.3.1:install (default-install) @ tika-parsers ---
[INFO] [INFO] Local OBR update disabled (enable with -DobrRepository)

[INFO] --- maven-bundle-plugin:2.3.4:install (default-install) @ tika-parsers ---
[INFO] Downloading: https://repository.apache.org/content/repositories/snapshots/org/apache/tika/tika-parsers/1.2-SNAPSHOT/maven-metadata.xml

[INFO] --- maven-deploy-plugin:2.6:deploy (default-deploy) @ tika-parsers ---
Downloaded: https://repository.apache.org/content/repositories/snapshots/org/apache/tika/tika-parsers/1.2-SNAPSHOT/maven-metadata.xml
(774 B at 1.8 KB/sec)
Uploading: https://repository.apache.org/content/repositories/snapshots/org/apache/tika/tika-parsers/1.2-SNAPSHOT/tika-parsers-1.2-20120419.140413-24.jar
Uploaded: https://repository.apache.org/content/repositories/snapshots/org/apache/tika/tika-parsers/1.2-SNAPSHOT/tika-parsers-1.2-20120419.140413-24.jar
(431 KB at 635.8 KB/sec)
Uploading: https://repository.apache.org/content/repositories/snapshots/org/apache/tika/tika-parsers/1.2-SNAPSHOT/tika-parsers-1.2-20120419.140413-24.pom
Uploaded: https://repository.apache.org/content/repositories/snapshots/org/apache/tika/tika-parsers/1.2-SNAPSHOT/tika-parsers-1.2-20120419.140413-24.pom
(9 KB at 49.0 KB/sec)
Downloading: https://repository.apache.org/content/repositories/snapshots/org/apache/tika/tika-parsers/maven-metadata.xml
Downloaded: https://repository.apache.org/content/repositories/snapshots/org/apache/tika/tika-parsers/maven-metadata.xml
(343 B at 1.4 KB/sec)
Uploading: https://repository.apache.org/content/repositories/snapshots/org/apache/tika/tika-parsers/1.2-SNAPSHOT/maven-metadata.xml
Uploaded: https://repository.apache.org/content/repositories/snapshots/org/apache/tika/tika-parsers/1.2-SNAPSHOT/maven-metadata.xml
(774 B at 2.8 KB/sec)
Uploading: https://repository.apache.org/content/repositories/snapshots/org/apache/tika/tika-parsers/maven-metadata.xml
Uploaded: https://repository.apache.org/content/repositories/snapshots/org/apache/tika/tika-parsers/maven-metadata.xml
(343 B at 1.6 KB/sec)
[INFO] [INFO] Remote OBR update disabled (enable with -DremoteOBR)

[INFO] --- maven-bundle-plugin:2.3.4:deploy (default-deploy) @ tika-parsers ---
[JENKINS] Archiving <https://builds.apache.org/job/Tika-trunk/ws/trunk/tika-parsers/pom.xml>
to /home/hudson/hudson/jobs/Tika-trunk/modules/org.apache.tika$tika-parsers/builds/2012-04-19_14-01-36/archive/org.apache.tika/tika-parsers/1.2-SNAPSHOT/tika-parsers-1.2-SNAPSHOT.pom
[JENKINS] Archiving <https://builds.apache.org/job/Tika-trunk/ws/trunk/tika-parsers/target/tika-parsers-1.2-SNAPSHOT.jar>
to /home/hudson/hudson/jobs/Tika-trunk/modules/org.apache.tika$tika-parsers/builds/2012-04-19_14-01-36/archive/org.apache.tika/tika-parsers/1.2-20120419.140413-24/tika-parsers-1.2-20120419.140413-24.jar
[INFO]                                                                         
[INFO] ------------------------------------------------------------------------
[INFO] Building Apache Tika application 1.2-SNAPSHOT
[INFO] ------------------------------------------------------------------------
[INFO] [INFO] Deleting <https://builds.apache.org/job/Tika-trunk/ws/trunk/tika-app/target>

[INFO] --- maven-clean-plugin:2.4.1:clean (default-clean) @ tika-app ---
[TASKS] Scanning folder '<https://builds.apache.org/job/Tika-trunk/ws/trunk/tika-app'>
for files matching the pattern '**/*.java' - excludes: 
[TASKS] Found 4 files to scan for tasks
Found 0 open tasks.
[TASKS] Computing warning deltas based on reference build #831
[INFO] 
[INFO] --- maven-remote-resources-plugin:1.2.1:process (default) @ tika-app ---
[debug] execute contextualize
[INFO] [INFO] Using 'UTF-8' encoding to copy filtered resources.
[INFO] Copying 1 resource

[INFO] --- maven-resources-plugin:2.5:resources (default-resources) @ tika-app ---
[INFO] Copying 2 resources
[INFO] Copying 3 resources
[INFO] [INFO] Compiling 3 source files to <https://builds.apache.org/job/Tika-trunk/ws/trunk/tika-app/target/classes>

[INFO] --- maven-compiler-plugin:2.3.2:compile (default-compile) @ tika-app ---
[debug] execute contextualize
[INFO] [INFO] Using 'UTF-8' encoding to copy filtered resources.
[INFO] Copying 3 resources
[INFO] Copying 3 resources

[INFO] --- maven-resources-plugin:2.5:testResources (default-testResources) @ tika-app ---
[INFO] [INFO] Compiling 1 source file to <https://builds.apache.org/job/Tika-trunk/ws/trunk/tika-app/target/test-classes>

[INFO] --- maven-compiler-plugin:2.3.2:testCompile (default-testCompile) @ tika-app ---
[INFO] [INFO] Surefire report directory: <https://builds.apache.org/job/Tika-trunk/ws/trunk/tika-app/target/surefire-reports>

-------------------------------------------------------
 T E S T S
-------------------------------------------------------

[INFO] --- maven-surefire-plugin:2.9:test (default-test) @ tika-app ---
Running org.apache.tika.cli.TikaCLITest
Tests run: 12, Failures: 0, Errors: 0, Skipped: 0, Time elapsed: 1.954 sec

Results :

Tests run: 12, Failures: 0, Errors: 0, Skipped: 0

[JENKINS] Recording test results
[INFO] 
[INFO] --- maven-dependency-plugin:2.1:unpack-dependencies (default) @ tika-app ---
[INFO] Unpacking /home/jenkins/jenkins-slave/maven-repositories/1/edu/ucar/netcdf/4.2-min/netcdf-4.2-min.jar
to
  <https://builds.apache.org/job/Tika-trunk/ws/trunk/tika-app/target/classes>
   with includes null and excludes:ucar/nc2/iosp/fysat/Fysat*.class,
                ucar/nc2/dataset/transform/VOceanSG1*class,
                ucar/unidata/geoloc/vertical/OceanSG*.class,
                META-INF/**,CHANGES,README
[INFO] 
[INFO] --- maven-bundle-plugin:2.3.4:bundle (default-bundle) @ tika-app ---
[INFO] 
[INFO] --- maven-site-plugin:3.0:attach-descriptor (attach-descriptor) @ tika-app ---
[INFO] [INFO] No excludes

[INFO] --- apache-rat-plugin:0.7:check (default) @ tika-app ---
[PMD] No report found for mojo check
[INFO] [INFO] Installing <https://builds.apache.org/job/Tika-trunk/ws/trunk/tika-app/target/tika-app-1.2-SNAPSHOT.jar>
to /home/jenkins/jenkins-slave/maven-repositories/1/org/apache/tika/tika-app/1.2-SNAPSHOT/tika-app-1.2-SNAPSHOT.jar

[INFO] --- maven-install-plugin:2.3.1:install (default-install) @ tika-app ---
[INFO] Installing <https://builds.apache.org/job/Tika-trunk/ws/trunk/tika-app/pom.xml>
to /home/jenkins/jenkins-slave/maven-repositories/1/org/apache/tika/tika-app/1.2-SNAPSHOT/tika-app-1.2-SNAPSHOT.pom
[INFO] Local OBR update disabled (enable with -DobrRepository)
[INFO] 
[INFO] --- maven-bundle-plugin:2.3.4:install (default-install) @ tika-app ---
[INFO] Downloading: https://repository.apache.org/content/repositories/snapshots/org/apache/tika/tika-app/1.2-SNAPSHOT/maven-metadata.xml

[INFO] --- maven-deploy-plugin:2.6:deploy (default-deploy) @ tika-app ---
Downloaded: https://repository.apache.org/content/repositories/snapshots/org/apache/tika/tika-app/1.2-SNAPSHOT/maven-metadata.xml
(770 B at 1.0 KB/sec)
Uploading: https://repository.apache.org/content/repositories/snapshots/org/apache/tika/tika-app/1.2-SNAPSHOT/tika-app-1.2-20120419.140449-24.jar
Uploaded: https://repository.apache.org/content/repositories/snapshots/org/apache/tika/tika-app/1.2-SNAPSHOT/tika-app-1.2-20120419.140449-24.jar
(25207 KB at 4403.7 KB/sec)
Uploading: https://repository.apache.org/content/repositories/snapshots/org/apache/tika/tika-app/1.2-SNAPSHOT/tika-app-1.2-20120419.140449-24.pom
Uploaded: https://repository.apache.org/content/repositories/snapshots/org/apache/tika/tika-app/1.2-SNAPSHOT/tika-app-1.2-20120419.140449-24.pom
(8 KB at 18.6 KB/sec)
Downloading: https://repository.apache.org/content/repositories/snapshots/org/apache/tika/tika-app/maven-metadata.xml
Downloaded: https://repository.apache.org/content/repositories/snapshots/org/apache/tika/tika-app/maven-metadata.xml
(339 B at 0.9 KB/sec)
Uploading: https://repository.apache.org/content/repositories/snapshots/org/apache/tika/tika-app/1.2-SNAPSHOT/maven-metadata.xml
Uploaded: https://repository.apache.org/content/repositories/snapshots/org/apache/tika/tika-app/1.2-SNAPSHOT/maven-metadata.xml
(770 B at 2.5 KB/sec)
Uploading: https://repository.apache.org/content/repositories/snapshots/org/apache/tika/tika-app/maven-metadata.xml
Uploaded: https://repository.apache.org/content/repositories/snapshots/org/apache/tika/tika-app/maven-metadata.xml
(339 B at 1.8 KB/sec)
[INFO] [INFO] Remote OBR update disabled (enable with -DremoteOBR)

[INFO] --- maven-bundle-plugin:2.3.4:deploy (default-deploy) @ tika-app ---
[JENKINS] Archiving <https://builds.apache.org/job/Tika-trunk/ws/trunk/tika-app/pom.xml>
to /home/hudson/hudson/jobs/Tika-trunk/modules/org.apache.tika$tika-app/builds/2012-04-19_14-01-36/archive/org.apache.tika/tika-app/1.2-SNAPSHOT/tika-app-1.2-SNAPSHOT.pom
[JENKINS] Archiving <https://builds.apache.org/job/Tika-trunk/ws/trunk/tika-app/target/tika-app-1.2-SNAPSHOT.jar>
to /home/hudson/hudson/jobs/Tika-trunk/modules/org.apache.tika$tika-app/builds/2012-04-19_14-01-36/archive/org.apache.tika/tika-app/1.2-20120419.140449-24/tika-app-1.2-20120419.140449-24.jar
[INFO]                                                                         
[INFO] ------------------------------------------------------------------------
[INFO] Building Apache Tika OSGi bundle 1.2-SNAPSHOT
[INFO] ------------------------------------------------------------------------
[INFO] Deleting <https://builds.apache.org/job/Tika-trunk/ws/trunk/tika-bundle/target>
[INFO] 
[INFO] --- maven-clean-plugin:2.4.1:clean (default-clean) @ tika-bundle ---
[TASKS] Scanning folder '<https://builds.apache.org/job/Tika-trunk/ws/trunk/tika-bundle'>
for files matching the pattern '**/*.java' - excludes: 
[TASKS] Found 1 files to scan for tasks
Found 0 open tasks.
[TASKS] Computing warning deltas based on reference build #831
[INFO] 
[INFO] --- maven-remote-resources-plugin:1.2.1:process (default) @ tika-bundle ---
[debug] execute contextualize
[INFO] [INFO] Using 'UTF-8' encoding to copy filtered resources.
[INFO] skip non existing resourceDirectory <https://builds.apache.org/job/Tika-trunk/ws/trunk/tika-bundle/src/main/resources>
[INFO] Copying 3 resources

[INFO] --- maven-resources-plugin:2.5:resources (default-resources) @ tika-bundle ---
[INFO] [INFO] No sources to compile

[INFO] --- maven-compiler-plugin:2.3.2:compile (default-compile) @ tika-bundle ---
[INFO] [debug] execute contextualize
[INFO] Using 'UTF-8' encoding to copy filtered resources.
[INFO] Copying 1 resource
[INFO] Copying 3 resources

[INFO] --- maven-resources-plugin:2.5:testResources (default-testResources) @ tika-bundle
---
[INFO] [INFO] Compiling 1 source file to <https://builds.apache.org/job/Tika-trunk/ws/trunk/tika-bundle/target/test-classes>

[INFO] --- maven-compiler-plugin:2.3.2:testCompile (default-testCompile) @ tika-bundle ---
[INFO] [INFO] Surefire report directory: <https://builds.apache.org/job/Tika-trunk/ws/trunk/tika-bundle/target/surefire-reports>

-------------------------------------------------------
 T E S T S
-------------------------------------------------------

[INFO] --- maven-surefire-plugin:2.9:test (default-test) @ tika-bundle ---

Results :

Tests run: 0, Failures: 0, Errors: 0, Skipped: 0

[JENKINS] Recording test results[INFO] Unpacking /home/jenkins/jenkins-slave/maven-repositories/1/edu/ucar/netcdf/4.2-min/netcdf-4.2-min.jar
to
  <https://builds.apache.org/job/Tika-trunk/ws/trunk/tika-bundle/target/classes>
   with includes null and excludes:ucar/nc2/iosp/fysat/Fysat*.class,
                ucar/nc2/dataset/transform/VOceanSG1*class,
                ucar/unidata/geoloc/vertical/OceanSG*.class,
                META-INF/**,CHANGES,README

[INFO] 
[INFO] --- maven-dependency-plugin:2.1:unpack-dependencies (default) @ tika-bundle ---
[INFO] 
[INFO] --- maven-bundle-plugin:2.3.4:bundle (default-bundle) @ tika-bundle ---
[ERROR] Error building bundle org.apache.tika:tika-bundle:bundle:1.2-SNAPSHOT : Bundle-Activator
not found on the bundle class path nor in imports: org.apache.tika.parser.internal.TikaActivator
[ERROR] Error(s) found in bundle configuration
[JENKINS] Archiving <https://builds.apache.org/job/Tika-trunk/ws/trunk/tika-bundle/pom.xml>
to /home/hudson/hudson/jobs/Tika-trunk/modules/org.apache.tika$tika-bundle/builds/2012-04-19_14-01-36/archive/org.apache.tika/tika-bundle/1.2-SNAPSHOT/tika-bundle-1.2-SNAPSHOT.pom
[INFO] ------------------------------------------------------------------------
[INFO] Reactor Summary:
[INFO] 
[INFO] Apache Tika parent ................................ SUCCESS [34.455s]
[INFO] Apache Tika core .................................. SUCCESS [36.621s]
[INFO] Apache Tika parsers ............................... SUCCESS [1:01.773s]
[INFO] Apache Tika application ........................... SUCCESS [38.512s]
[INFO] Apache Tika OSGi bundle ........................... FAILURE [23.310s]
[INFO] Apache Tika server ................................ SKIPPED
[INFO] Apache Tika ....................................... SKIPPED
[INFO] ------------------------------------------------------------------------
[INFO] BUILD FAILURE
[INFO] ------------------------------------------------------------------------
[INFO] Total time: 5:33.123s
[INFO] Finished at: Thu Apr 19 14:07:25 UTC 2012
[INFO] Final Memory: 41M/367M
[INFO] ------------------------------------------------------------------------
Waiting for Jenkins to finish collecting data
mavenExecutionResult exceptions not empty
message : Failed to execute goal org.apache.felix:maven-bundle-plugin:2.3.4:bundle (default-bundle)
on project tika-bundle: Error(s) found in bundle configuration
cause : Error(s) found in bundle configuration
Stack trace : 
org.apache.maven.lifecycle.LifecycleExecutionException: Failed to execute goal org.apache.felix:maven-bundle-plugin:2.3.4:bundle
(default-bundle) on project tika-bundle: Error(s) found in bundle configuration
	at org.apache.maven.lifecycle.internal.MojoExecutor.execute(MojoExecutor.java:217)
	at org.apache.maven.lifecycle.internal.MojoExecutor.execute(MojoExecutor.java:153)
	at org.apache.maven.lifecycle.internal.MojoExecutor.execute(MojoExecutor.java:145)
	at org.apache.maven.lifecycle.internal.LifecycleModuleBuilder.buildProject(LifecycleModuleBuilder.java:84)
	at org.apache.maven.lifecycle.internal.LifecycleModuleBuilder.buildProject(LifecycleModuleBuilder.java:59)
	at org.apache.maven.lifecycle.internal.LifecycleStarter.singleThreadedBuild(LifecycleStarter.java:183)
	at org.apache.maven.lifecycle.internal.LifecycleStarter.execute(LifecycleStarter.java:161)
	at org.apache.maven.DefaultMaven.doExecute(DefaultMaven.java:319)
	at org.apache.maven.DefaultMaven.execute(DefaultMaven.java:156)
	at org.jvnet.hudson.maven3.launcher.Maven3Launcher.main(Maven3Launcher.java:79)
	at sun.reflect.NativeMethodAccessorImpl.invoke0(Native Method)
	at sun.reflect.NativeMethodAccessorImpl.invoke(NativeMethodAccessorImpl.java:39)
	at sun.reflect.DelegatingMethodAccessorImpl.invoke(DelegatingMethodAccessorImpl.java:25)
	at java.lang.reflect.Method.invoke(Method.java:592)
	at org.codehaus.plexus.classworlds.launcher.Launcher.launchStandard(Launcher.java:329)
	at org.codehaus.plexus.classworlds.launcher.Launcher.launch(Launcher.java:239)
	at org.jvnet.hudson.maven3.agent.Maven3Main.launch(Maven3Main.java:158)
	at hudson.maven.Maven3Builder.call(Maven3Builder.java:104)
	at hudson.maven.Maven3Builder.call(Maven3Builder.java:70)
	at hudson.remoting.UserRequest.perform(UserRequest.java:118)
	at hudson.remoting.UserRequest.perform(UserRequest.java:48)
	at hudson.remoting.Request$2.run(Request.java:287)
	at hudson.remoting.InterceptingExecutorService$1.call(InterceptingExecutorService.java:72)
	at java.util.concurrent.FutureTask$Sync.innerRun(FutureTask.java:269)
	at java.util.concurrent.FutureTask.run(FutureTask.java:123)
	at java.util.concurrent.ThreadPoolExecutor$Worker.runTask(ThreadPoolExecutor.java:651)
	at java.util.concurrent.ThreadPoolExecutor$Worker.run(ThreadPoolExecutor.java:676)
	at java.lang.Thread.run(Thread.java:595)
Caused by: org.apache.maven.plugin.MojoExecutionException: Error(s) found in bundle configuration
	at org.apache.felix.bundleplugin.BundlePlugin.execute(BundlePlugin.java:341)
	at org.apache.felix.bundleplugin.BundlePlugin.execute(BundlePlugin.java:224)
	at org.apache.felix.bundleplugin.BundlePlugin.execute(BundlePlugin.java:215)
	at org.apache.maven.plugin.DefaultBuildPluginManager.executeMojo(DefaultBuildPluginManager.java:101)
	at org.apache.maven.lifecycle.internal.MojoExecutor.execute(MojoExecutor.java:209)
	... 27 more
Caused by: org.apache.maven.plugin.MojoFailureException: Error(s) found in bundle configuration
	at org.apache.felix.bundleplugin.BundlePlugin.execute(BundlePlugin.java:293)
	... 31 more
[TASKS] Aggregating results of Apache Tika parent
[TASKS] Using set difference to compute new warnings
[TASKS] Aggregating results of Apache Tika core
[TASKS] Using set difference to compute new warnings
[TASKS] Aggregating results of Apache Tika parsers
[TASKS] Using set difference to compute new warnings
[TASKS] Aggregating results of Apache Tika application
[TASKS] Using set difference to compute new warnings
[TASKS] Aggregating results of Apache Tika OSGi bundle
[TASKS] Using set difference to compute new warnings
channel stopped

Mime
View raw message