tika-dev mailing list archives

Site index · List index
Message view « Date » · « Thread »
Top « Date » · « Thread »
From Apache Jenkins Server <jenk...@builds.apache.org>
Subject Build failed in Jenkins: Tika-trunk #882
Date Sat, 30 Jun 2012 15:08:28 GMT
See <https://builds.apache.org/job/Tika-trunk/882/changes>

Changes:

[jukka] TIKA-747: Ogg Vorbis and FLAC Parsers

Use the shade plugin instead of the bundle plugin to merge all dependencies into the single
tika-app jar.
This way we can leverage shade's services resource transformer to merge the META-INF/services/
files from all upstream jars.

------------------------------------------
[...truncated 480 lines...]
Running org.apache.tika.TestParsers
Tests run: 4, Failures: 0, Errors: 0, Skipped: 0, Time elapsed: 0.282 sec

Results :

Tests run: 383, Failures: 0, Errors: 0, Skipped: 0

mojoSucceeded org.apache.maven.plugins:maven-surefire-plugin:2.9(default-test)
[JENKINS] Recording test results
mojoStarted org.apache.felix:maven-bundle-plugin:2.3.4(default-bundle)
[INFO] 
[INFO] --- maven-bundle-plugin:2.3.4:bundle (default-bundle) @ tika-parsers ---
mojoSucceeded org.apache.felix:maven-bundle-plugin:2.3.4(default-bundle)
mojoStarted org.apache.maven.plugins:maven-site-plugin:3.0(attach-descriptor)
[INFO] 
[INFO] --- maven-site-plugin:3.0:attach-descriptor (attach-descriptor) @ tika-parsers ---
mojoSucceeded org.apache.maven.plugins:maven-site-plugin:3.0(attach-descriptor)
mojoStarted org.apache.rat:apache-rat-plugin:0.7(default)[INFO] Exclude: src/main/java/org/apache/tika/parser/txt/Charset*.java
[INFO] Exclude: src/test/resources/test-documents/**

[INFO] 
[INFO] --- apache-rat-plugin:0.7:check (default) @ tika-parsers ---
mojoSucceeded org.apache.rat:apache-rat-plugin:0.7(default)
[PMD] No report found for mojo check
mojoStarted org.apache.maven.plugins:maven-install-plugin:2.3.1(default-install)[INFO] Installing
<https://builds.apache.org/job/Tika-trunk/ws/trunk/tika-parsers/target/tika-parsers-1.2-SNAPSHOT.jar>
to /home/hudson/hudson-slave/maven-repositories/1/org/apache/tika/tika-parsers/1.2-SNAPSHOT/tika-parsers-1.2-SNAPSHOT.jar
[INFO] Installing <https://builds.apache.org/job/Tika-trunk/ws/trunk/tika-parsers/pom.xml>
to /home/hudson/hudson-slave/maven-repositories/1/org/apache/tika/tika-parsers/1.2-SNAPSHOT/tika-parsers-1.2-SNAPSHOT.pom

[INFO] 
[INFO] --- maven-install-plugin:2.3.1:install (default-install) @ tika-parsers ---
mojoSucceeded org.apache.maven.plugins:maven-install-plugin:2.3.1(default-install)
mojoStarted org.apache.felix:maven-bundle-plugin:2.3.4(default-install)[INFO] Local OBR update
disabled (enable with -DobrRepository)

[INFO] 
[INFO] --- maven-bundle-plugin:2.3.4:install (default-install) @ tika-parsers ---
mojoSucceeded org.apache.felix:maven-bundle-plugin:2.3.4(default-install)
mojoStarted org.apache.maven.plugins:maven-deploy-plugin:2.6(default-deploy)Downloading: https://repository.apache.org/content/repositories/snapshots/org/apache/tika/tika-parsers/1.2-SNAPSHOT/maven-metadata.xml

[INFO] 
[INFO] --- maven-deploy-plugin:2.6:deploy (default-deploy) @ tika-parsers ---
Downloaded: https://repository.apache.org/content/repositories/snapshots/org/apache/tika/tika-parsers/1.2-SNAPSHOT/maven-metadata.xml
(774 B at 1.7 KB/sec)
Uploading: https://repository.apache.org/content/repositories/snapshots/org/apache/tika/tika-parsers/1.2-SNAPSHOT/tika-parsers-1.2-20120630.150553-69.jar
Uploaded: https://repository.apache.org/content/repositories/snapshots/org/apache/tika/tika-parsers/1.2-SNAPSHOT/tika-parsers-1.2-20120630.150553-69.jar
(461 KB at 674.0 KB/sec)
Uploading: https://repository.apache.org/content/repositories/snapshots/org/apache/tika/tika-parsers/1.2-SNAPSHOT/tika-parsers-1.2-20120630.150553-69.pom
Uploaded: https://repository.apache.org/content/repositories/snapshots/org/apache/tika/tika-parsers/1.2-SNAPSHOT/tika-parsers-1.2-20120630.150553-69.pom
(9 KB at 58.4 KB/sec)
Downloading: https://repository.apache.org/content/repositories/snapshots/org/apache/tika/tika-parsers/maven-metadata.xml
Downloaded: https://repository.apache.org/content/repositories/snapshots/org/apache/tika/tika-parsers/maven-metadata.xml
(343 B at 1.1 KB/sec)
Uploading: https://repository.apache.org/content/repositories/snapshots/org/apache/tika/tika-parsers/1.2-SNAPSHOT/maven-metadata.xml
Uploaded: https://repository.apache.org/content/repositories/snapshots/org/apache/tika/tika-parsers/1.2-SNAPSHOT/maven-metadata.xml
(774 B at 3.0 KB/sec)
Uploading: https://repository.apache.org/content/repositories/snapshots/org/apache/tika/tika-parsers/maven-metadata.xml
Uploaded: https://repository.apache.org/content/repositories/snapshots/org/apache/tika/tika-parsers/maven-metadata.xml
(343 B at 1.7 KB/sec)
mojoSucceeded org.apache.maven.plugins:maven-deploy-plugin:2.6(default-deploy)
mojoStarted org.apache.felix:maven-bundle-plugin:2.3.4(default-deploy)[INFO] Remote OBR update
disabled (enable with -DremoteOBR)

[INFO] 
[INFO] --- maven-bundle-plugin:2.3.4:deploy (default-deploy) @ tika-parsers ---
mojoSucceeded org.apache.felix:maven-bundle-plugin:2.3.4(default-deploy)
projectSucceeded org.apache.tika:tika-parsers:1.2-SNAPSHOT
projectStarted org.apache.tika:tika-app:1.2-SNAPSHOT
[INFO]                                                                         
[INFO] ------------------------------------------------------------------------
[INFO] Building Apache Tika application 1.2-SNAPSHOT
[INFO] ------------------------------------------------------------------------
Downloading: http://repo1.maven.org/maven2/org/apache/maven/plugins/maven-shade-plugin/1.7/maven-shade-plugin-1.7.pom
Downloaded: http://repo1.maven.org/maven2/org/apache/maven/plugins/maven-shade-plugin/1.7/maven-shade-plugin-1.7.pom
(6 KB at 26.9 KB/sec)
Downloading: http://repo1.maven.org/maven2/org/apache/maven/plugins/maven-shade-plugin/1.7/maven-shade-plugin-1.7.jar
Downloaded: http://repo1.maven.org/maven2/org/apache/maven/plugins/maven-shade-plugin/1.7/maven-shade-plugin-1.7.jar
(84 KB at 482.4 KB/sec)
mojoStarted org.apache.maven.plugins:maven-clean-plugin:2.4.1(default-clean)[INFO] Deleting
<https://builds.apache.org/job/Tika-trunk/ws/trunk/tika-app/target>

[INFO] 
[INFO] --- maven-clean-plugin:2.4.1:clean (default-clean) @ tika-app ---
mojoSucceeded org.apache.maven.plugins:maven-clean-plugin:2.4.1(default-clean)
[TASKS] Scanning folder '<https://builds.apache.org/job/Tika-trunk/ws/trunk/tika-app'>
for files matching the pattern '**/*.java' - excludes: 
[TASKS] Found 4 files to scan for tasks
Found 0 open tasks.
[TASKS] Computing warning deltas based on reference build #881
mojoStarted org.apache.maven.plugins:maven-remote-resources-plugin:1.2.1(default)
[INFO] 
[INFO] --- maven-remote-resources-plugin:1.2.1:process (default) @ tika-app ---
mojoSucceeded org.apache.maven.plugins:maven-remote-resources-plugin:1.2.1(default)
mojoStarted org.apache.maven.plugins:maven-resources-plugin:2.5(default-resources)
[INFO] 
[INFO] --- maven-resources-plugin:2.5:resources (default-resources) @ tika-app ---
[debug] execute contextualize
[INFO] Using 'UTF-8' encoding to copy filtered resources.
[INFO] Copying 1 resource
[INFO] Copying 2 resources
[INFO] Copying 3 resources
mojoSucceeded org.apache.maven.plugins:maven-resources-plugin:2.5(default-resources)
mojoStarted org.apache.maven.plugins:maven-compiler-plugin:2.3.2(default-compile)
[INFO] 
[INFO] --- maven-compiler-plugin:2.3.2:compile (default-compile) @ tika-app ---
[INFO] Compiling 3 source files to <https://builds.apache.org/job/Tika-trunk/ws/trunk/tika-app/target/classes>
mojoSucceeded org.apache.maven.plugins:maven-compiler-plugin:2.3.2(default-compile)
mojoStarted org.apache.maven.plugins:maven-resources-plugin:2.5(default-testResources)[debug]
execute contextualize
[INFO] Using 'UTF-8' encoding to copy filtered resources.

[INFO] 
[INFO] --- maven-resources-plugin:2.5:testResources (default-testResources) @ tika-app ---
[INFO] Copying 3 resources
[INFO] Copying 3 resources
mojoSucceeded org.apache.maven.plugins:maven-resources-plugin:2.5(default-testResources)
mojoStarted org.apache.maven.plugins:maven-compiler-plugin:2.3.2(default-testCompile)[INFO]
Compiling 1 source file to <https://builds.apache.org/job/Tika-trunk/ws/trunk/tika-app/target/test-classes>

[INFO] 
[INFO] --- maven-compiler-plugin:2.3.2:testCompile (default-testCompile) @ tika-app ---
mojoSucceeded org.apache.maven.plugins:maven-compiler-plugin:2.3.2(default-testCompile)
mojoStarted org.apache.maven.plugins:maven-surefire-plugin:2.9(default-test)
[INFO] 
[INFO] --- maven-surefire-plugin:2.9:test (default-test) @ tika-app ---
[INFO] Surefire report directory: <https://builds.apache.org/job/Tika-trunk/ws/trunk/tika-app/target/surefire-reports>

-------------------------------------------------------
 T E S T S
-------------------------------------------------------
Running org.apache.tika.cli.TikaCLITest
Tests run: 12, Failures: 0, Errors: 0, Skipped: 0, Time elapsed: 1.86 sec

Results :

Tests run: 12, Failures: 0, Errors: 0, Skipped: 0

mojoSucceeded org.apache.maven.plugins:maven-surefire-plugin:2.9(default-test)
[JENKINS] Recording test results
mojoStarted org.apache.maven.plugins:maven-jar-plugin:2.3.1(default-jar)
[INFO] 
[INFO] --- maven-jar-plugin:2.3.1:jar (default-jar) @ tika-app ---
[INFO] Building jar: <https://builds.apache.org/job/Tika-trunk/ws/trunk/tika-app/target/tika-app-1.2-SNAPSHOT.jar>
mojoSucceeded org.apache.maven.plugins:maven-jar-plugin:2.3.1(default-jar)
mojoStarted org.apache.maven.plugins:maven-site-plugin:3.0(attach-descriptor)
[INFO] 
[INFO] --- maven-site-plugin:3.0:attach-descriptor (attach-descriptor) @ tika-app ---
mojoSucceeded org.apache.maven.plugins:maven-site-plugin:3.0(attach-descriptor)
mojoStarted org.apache.maven.plugins:maven-shade-plugin:1.7(default)
[INFO] 
[INFO] --- maven-shade-plugin:1.7:shade (default) @ tika-app ---
[INFO] Including org.apache.tika:tika-parsers:jar:1.2-SNAPSHOT in the shaded jar.
[INFO] Including org.apache.tika:tika-core:jar:1.2-SNAPSHOT in the shaded jar.
[INFO] Including org.gagravarr:vorbis-java-tika:jar:0.1 in the shaded jar.
[INFO] Including org.gagravarr:vorbis-java-core:jar:tests:0.1 in the shaded jar.
[INFO] Including edu.ucar:netcdf:jar:4.2-min in the shaded jar.
[INFO] Including org.apache.james:apache-mime4j-core:jar:0.7.2 in the shaded jar.
[INFO] Including org.apache.james:apache-mime4j-dom:jar:0.7.2 in the shaded jar.
[INFO] Including org.apache.commons:commons-compress:jar:1.4.1 in the shaded jar.
[INFO] Including org.tukaani:xz:jar:1.0 in the shaded jar.
[INFO] Including commons-codec:commons-codec:jar:1.5 in the shaded jar.
[INFO] Including org.apache.pdfbox:pdfbox:jar:1.6.0 in the shaded jar.
[INFO] Including org.apache.pdfbox:fontbox:jar:1.6.0 in the shaded jar.
[INFO] Including org.apache.pdfbox:jempbox:jar:1.6.0 in the shaded jar.
[INFO] Including commons-logging:commons-logging:jar:1.1.1 in the shaded jar.
[INFO] Including org.bouncycastle:bcmail-jdk15:jar:1.45 in the shaded jar.
[INFO] Including org.bouncycastle:bcprov-jdk15:jar:1.45 in the shaded jar.
[INFO] Including org.apache.poi:poi:jar:3.8 in the shaded jar.
[INFO] Including org.apache.poi:poi-scratchpad:jar:3.8 in the shaded jar.
[INFO] Including org.apache.poi:poi-ooxml:jar:3.8 in the shaded jar.
[INFO] Including org.apache.poi:poi-ooxml-schemas:jar:3.8 in the shaded jar.
[INFO] Including org.apache.xmlbeans:xmlbeans:jar:2.3.0 in the shaded jar.
[INFO] Including dom4j:dom4j:jar:1.6.1 in the shaded jar.
[INFO] Including org.apache.geronimo.specs:geronimo-stax-api_1.0_spec:jar:1.0.1 in the shaded
jar.
[INFO] Including org.ccil.cowan.tagsoup:tagsoup:jar:1.2.1 in the shaded jar.
[INFO] Including asm:asm:jar:3.1 in the shaded jar.
[INFO] Including com.googlecode.mp4parser:isoparser:jar:1.0-RC-1 in the shaded jar.
[INFO] Including org.aspectj:aspectjrt:jar:1.6.11 in the shaded jar.
[INFO] Including com.drewnoakes:metadata-extractor:jar:2.4.0-beta-1 in the shaded jar.
[INFO] Including de.l3s.boilerpipe:boilerpipe:jar:1.1.0 in the shaded jar.
[INFO] Including rome:rome:jar:0.9 in the shaded jar.
[INFO] Including jdom:jdom:jar:1.0 in the shaded jar.
[INFO] Including org.gagravarr:vorbis-java-core:jar:0.1 in the shaded jar.
[INFO] Including org.slf4j:slf4j-log4j12:jar:1.5.6 in the shaded jar.
[INFO] Including org.slf4j:slf4j-api:jar:1.5.6 in the shaded jar.
[INFO] Including log4j:log4j:jar:1.2.14 in the shaded jar.
[INFO] Including com.google.code.gson:gson:jar:1.7.1 in the shaded jar.
[INFO] Replacing original artifact with shaded artifact.
[INFO] Replacing <https://builds.apache.org/job/Tika-trunk/ws/trunk/tika-app/target/tika-app-1.2-SNAPSHOT.jar>
with <https://builds.apache.org/job/Tika-trunk/ws/trunk/tika-app/target/tika-app-1.2-SNAPSHOT-shaded.jar>
mojoSucceeded org.apache.maven.plugins:maven-shade-plugin:1.7(default)
mojoStarted org.apache.rat:apache-rat-plugin:0.7(default)[INFO] No excludes

[INFO] 
[INFO] --- apache-rat-plugin:0.7:check (default) @ tika-app ---
mojoFailed org.apache.rat:apache-rat-plugin:0.7(default)
[PMD] No report found for mojo check
projectFailed org.apache.tika:tika-app:1.2-SNAPSHOT
sessionEnded
[INFO] ------------------------------------------------------------------------
[INFO] Reactor Summary:
[INFO] 
[INFO] Apache Tika parent ................................ SUCCESS [34.675s]
[INFO] Apache Tika core .................................. SUCCESS [35.632s]
[INFO] Apache Tika parsers ............................... SUCCESS [1:06.546s]
[INFO] Apache Tika application ........................... FAILURE [21.087s]
[INFO] Apache Tika OSGi bundle ........................... SKIPPED
[INFO] Apache Tika ....................................... SKIPPED
[INFO] ------------------------------------------------------------------------
[INFO] BUILD FAILURE
[INFO] ------------------------------------------------------------------------
[INFO] Total time: 2:41.466s
[INFO] Finished at: Sat Jun 30 15:06:17 UTC 2012
[INFO] Final Memory: 32M/136M
[INFO] ------------------------------------------------------------------------
Projects to build: [MavenProject: org.apache.tika:tika-parent:1.2-SNAPSHOT @ <https://builds.apache.org/job/Tika-trunk/ws/trunk/tika-parent/pom.xml,>
MavenProject: org.apache.tika:tika-core:1.2-SNAPSHOT @ <https://builds.apache.org/job/Tika-trunk/ws/trunk/tika-core/pom.xml,>
MavenProject: org.apache.tika:tika-parsers:1.2-SNAPSHOT @ <https://builds.apache.org/job/Tika-trunk/ws/trunk/tika-parsers/pom.xml,>
MavenProject: org.apache.tika:tika-app:1.2-SNAPSHOT @ <https://builds.apache.org/job/Tika-trunk/ws/trunk/tika-app/target/dependency-reduced-pom.xml,>
MavenProject: org.apache.tika:tika-bundle:1.2-SNAPSHOT @ <https://builds.apache.org/job/Tika-trunk/ws/trunk/tika-bundle/pom.xml,>
MavenProject: org.apache.tika:tika:1.2-SNAPSHOT @ <https://builds.apache.org/job/Tika-trunk/ws/trunk/pom.xml]>
[JENKINS] Archiving <https://builds.apache.org/job/Tika-trunk/ws/trunk/pom.xml> to /home/hudson/hudson/jobs/Tika-trunk/modules/org.apache.tika$tika/builds/2012-06-30_15-03-19/archive/org.apache.tika/tika/1.2-SNAPSHOT/tika-1.2-SNAPSHOT.pom
[JENKINS] Archiving <https://builds.apache.org/job/Tika-trunk/ws/trunk/tika-parent/pom.xml>
to /home/hudson/hudson/jobs/Tika-trunk/modules/org.apache.tika$tika-parent/builds/2012-06-30_15-03-19/archive/org.apache.tika/tika-parent/1.2-SNAPSHOT/tika-parent-1.2-SNAPSHOT.pom
[JENKINS] Archiving <https://builds.apache.org/job/Tika-trunk/ws/trunk/tika-parsers/pom.xml>
to /home/hudson/hudson/jobs/Tika-trunk/modules/org.apache.tika$tika-parsers/builds/2012-06-30_15-03-20/archive/org.apache.tika/tika-parsers/1.2-SNAPSHOT/tika-parsers-1.2-SNAPSHOT.pom
[JENKINS] Archiving <https://builds.apache.org/job/Tika-trunk/ws/trunk/tika-parsers/target/tika-parsers-1.2-SNAPSHOT.jar>
to /home/hudson/hudson/jobs/Tika-trunk/modules/org.apache.tika$tika-parsers/builds/2012-06-30_15-03-20/archive/org.apache.tika/tika-parsers/1.2-20120630.150553-69/tika-parsers-1.2-20120630.150553-69.jar
[JENKINS] Archiving <https://builds.apache.org/job/Tika-trunk/ws/trunk/tika-app/target/dependency-reduced-pom.xml>
to /home/hudson/hudson/jobs/Tika-trunk/modules/org.apache.tika$tika-app/builds/2012-06-30_15-03-20/archive/org.apache.tika/tika-app/1.2-SNAPSHOT/tika-app-1.2-SNAPSHOT.pom
[JENKINS] Archiving <https://builds.apache.org/job/Tika-trunk/ws/trunk/tika-app/target/tika-app-1.2-SNAPSHOT.jar>
to /home/hudson/hudson/jobs/Tika-trunk/modules/org.apache.tika$tika-app/builds/2012-06-30_15-03-20/archive/org.apache.tika/tika-app/1.2-SNAPSHOT/tika-app-1.2-SNAPSHOT.jar
[JENKINS] Archiving <https://builds.apache.org/job/Tika-trunk/ws/trunk/tika-core/pom.xml>
to /home/hudson/hudson/jobs/Tika-trunk/modules/org.apache.tika$tika-core/builds/2012-06-30_15-03-19/archive/org.apache.tika/tika-core/1.2-SNAPSHOT/tika-core-1.2-SNAPSHOT.pom
[JENKINS] Archiving <https://builds.apache.org/job/Tika-trunk/ws/trunk/tika-core/target/tika-core-1.2-SNAPSHOT.jar>
to /home/hudson/hudson/jobs/Tika-trunk/modules/org.apache.tika$tika-core/builds/2012-06-30_15-03-19/archive/org.apache.tika/tika-core/1.2-20120630.150446-72/tika-core-1.2-20120630.150446-72.jar
[JENKINS] Archiving <https://builds.apache.org/job/Tika-trunk/ws/trunk/tika-bundle/pom.xml>
to /home/hudson/hudson/jobs/Tika-trunk/modules/org.apache.tika$tika-bundle/builds/2012-06-30_15-03-20/archive/org.apache.tika/tika-bundle/1.2-SNAPSHOT/tika-bundle-1.2-SNAPSHOT.pom
Waiting for Jenkins to finish collecting data
mavenExecutionResult exceptions not empty
message : Failed to execute goal org.apache.rat:apache-rat-plugin:0.7:check (default) on project
tika-app: Too many unapproved licenses: 7
cause : Too many unapproved licenses: 7
Stack trace : 
org.apache.maven.lifecycle.LifecycleExecutionException: Failed to execute goal org.apache.rat:apache-rat-plugin:0.7:check
(default) on project tika-app: Too many unapproved licenses: 7
	at org.apache.maven.lifecycle.internal.MojoExecutor.execute(MojoExecutor.java:213)
	at org.apache.maven.lifecycle.internal.MojoExecutor.execute(MojoExecutor.java:153)
	at org.apache.maven.lifecycle.internal.MojoExecutor.execute(MojoExecutor.java:145)
	at org.apache.maven.lifecycle.internal.LifecycleModuleBuilder.buildProject(LifecycleModuleBuilder.java:84)
	at org.apache.maven.lifecycle.internal.LifecycleModuleBuilder.buildProject(LifecycleModuleBuilder.java:59)
	at org.apache.maven.lifecycle.internal.LifecycleStarter.singleThreadedBuild(LifecycleStarter.java:183)
	at org.apache.maven.lifecycle.internal.LifecycleStarter.execute(LifecycleStarter.java:161)
	at org.apache.maven.DefaultMaven.doExecute(DefaultMaven.java:319)
	at org.apache.maven.DefaultMaven.execute(DefaultMaven.java:156)
	at org.jvnet.hudson.maven3.launcher.Maven3Launcher.main(Maven3Launcher.java:79)
	at sun.reflect.NativeMethodAccessorImpl.invoke0(Native Method)
	at sun.reflect.NativeMethodAccessorImpl.invoke(NativeMethodAccessorImpl.java:39)
	at sun.reflect.DelegatingMethodAccessorImpl.invoke(DelegatingMethodAccessorImpl.java:25)
	at java.lang.reflect.Method.invoke(Method.java:592)
	at org.codehaus.plexus.classworlds.launcher.Launcher.launchStandard(Launcher.java:329)
	at org.codehaus.plexus.classworlds.launcher.Launcher.launch(Launcher.java:239)
	at org.jvnet.hudson.maven3.agent.Maven3Main.launch(Maven3Main.java:158)
	at hudson.maven.Maven3Builder.call(Maven3Builder.java:98)
	at hudson.maven.Maven3Builder.call(Maven3Builder.java:64)
	at hudson.remoting.UserRequest.perform(UserRequest.java:118)
	at hudson.remoting.UserRequest.perform(UserRequest.java:48)
	at hudson.remoting.Request$2.run(Request.java:287)
	at hudson.remoting.InterceptingExecutorService$1.call(InterceptingExecutorService.java:72)
	at java.util.concurrent.FutureTask$Sync.innerRun(FutureTask.java:269)
	at java.util.concurrent.FutureTask.run(FutureTask.java:123)
	at java.util.concurrent.ThreadPoolExecutor$Worker.runTask(ThreadPoolExecutor.java:651)
	at java.util.concurrent.ThreadPoolExecutor$Worker.run(ThreadPoolExecutor.java:676)
	at java.lang.Thread.run(Thread.java:595)
Caused by: org.apache.rat.mp.RatCheckException: Too many unapproved licenses: 7
	at org.apache.rat.mp.RatCheckMojo.check(RatCheckMojo.java:167)
	at org.apache.rat.mp.RatCheckMojo.execute(RatCheckMojo.java:159)
	at org.apache.maven.plugin.DefaultBuildPluginManager.executeMojo(DefaultBuildPluginManager.java:101)
	at org.apache.maven.lifecycle.internal.MojoExecutor.execute(MojoExecutor.java:209)
	... 27 more
channel stopped

Mime
View raw message