tika-dev mailing list archives

Site index · List index
Message view « Date » · « Thread »
Top « Date » · « Thread »
From Apache Jenkins Server <jenk...@builds.apache.org>
Subject Build failed in Jenkins: Tika-trunk #888
Date Mon, 02 Jul 2012 16:57:40 GMT
See <https://builds.apache.org/job/Tika-trunk/888/>

------------------------------------------
[...truncated 518 lines...]
Tests run: 1, Failures: 0, Errors: 0, Skipped: 0, Time elapsed: 0 sec
Running org.apache.tika.parser.AutoDetectParserTest
Warning - invalid checksum on page 3 of stream 6e630f49 (1851985737)
Warning - invalid checksum on page 3 of stream 6e630f49 (1851985737)
Tests run: 19, Failures: 0, Errors: 0, Skipped: 0, Time elapsed: 4.616 sec
Running org.apache.tika.parser.executable.ExecutableParserTest
Tests run: 2, Failures: 0, Errors: 0, Skipped: 0, Time elapsed: 0.001 sec
Running org.apache.tika.parser.chm.TestChmLzxState
Tests run: 2, Failures: 0, Errors: 0, Skipped: 0, Time elapsed: 0.016 sec
Running org.apache.tika.parser.chm.TestChmLzxcResetTable
Tests run: 9, Failures: 0, Errors: 0, Skipped: 0, Time elapsed: 0.022 sec
Running org.apache.tika.parser.chm.TestChmItsfHeader
Tests run: 1, Failures: 0, Errors: 0, Skipped: 0, Time elapsed: 0.001 sec
Running org.apache.tika.parser.chm.TestPmgiHeader
Tests run: 2, Failures: 0, Errors: 0, Skipped: 0, Time elapsed: 0.003 sec
Running org.apache.tika.parser.chm.TestChmExtraction
Tests run: 1, Failures: 0, Errors: 0, Skipped: 0, Time elapsed: 2.005 sec
Running org.apache.tika.parser.chm.TestChmItspHeader
Tests run: 16, Failures: 0, Errors: 0, Skipped: 0, Time elapsed: 0.004 sec
Running org.apache.tika.parser.chm.TestChmBlockInfo
Tests run: 2, Failures: 0, Errors: 0, Skipped: 0, Time elapsed: 0.004 sec
Running org.apache.tika.parser.chm.TestChmDocumentInformation
Tests run: 2, Failures: 0, Errors: 0, Skipped: 0, Time elapsed: 0.146 sec
Running org.apache.tika.parser.chm.TestDirectoryListingEntry
Tests run: 8, Failures: 0, Errors: 0, Skipped: 0, Time elapsed: 0 sec
Running org.apache.tika.parser.chm.TestChmLzxcControlData
Tests run: 10, Failures: 0, Errors: 0, Skipped: 0, Time elapsed: 0.006 sec
Running org.apache.tika.parser.chm.TestChmExtractor
Tests run: 4, Failures: 0, Errors: 0, Skipped: 0, Time elapsed: 1.568 sec
Running org.apache.tika.parser.chm.TestPmglHeader
Tests run: 6, Failures: 0, Errors: 0, Skipped: 0, Time elapsed: 0.001 sec
Running org.apache.tika.parser.audio.AudioParserTest
Tests run: 3, Failures: 0, Errors: 0, Skipped: 0, Time elapsed: 0 sec
Running org.apache.tika.parser.audio.MidiParserTest
Tests run: 1, Failures: 0, Errors: 0, Skipped: 0, Time elapsed: 0 sec
Running org.apache.tika.parser.epub.EpubParserTest
Tests run: 1, Failures: 0, Errors: 0, Skipped: 0, Time elapsed: 0 sec
Running org.apache.tika.parser.mail.RFC822ParserTest
Tests run: 8, Failures: 0, Errors: 0, Skipped: 0, Time elapsed: 0.322 sec
Running org.apache.tika.parser.mp3.Mp3ParserTest
Tests run: 9, Failures: 0, Errors: 0, Skipped: 0, Time elapsed: 0.028 sec
Running org.apache.tika.parser.iwork.IWorkParserTest
Tests run: 13, Failures: 0, Errors: 0, Skipped: 0, Time elapsed: 0.728 sec
Running org.apache.tika.parser.fork.ForkParserIntegrationTest
Tests run: 5, Failures: 0, Errors: 0, Skipped: 0, Time elapsed: 4.406 sec
Running org.apache.tika.parser.ibooks.iBooksParserTest
Tests run: 1, Failures: 0, Errors: 0, Skipped: 0, Time elapsed: 0.003 sec
Running org.apache.tika.parser.asm.ClassParserTest
Tests run: 1, Failures: 0, Errors: 0, Skipped: 0, Time elapsed: 0.015 sec
Running org.apache.tika.parser.pdf.PDFParserTest
Tests run: 12, Failures: 0, Errors: 0, Skipped: 0, Time elapsed: 1.244 sec
Running org.apache.tika.parser.hdf.HDFParserTest
Tests run: 1, Failures: 0, Errors: 0, Skipped: 0, Time elapsed: 0.001 sec
Running org.apache.tika.parser.font.AdobeFontMetricParserTest
Tests run: 1, Failures: 0, Errors: 0, Skipped: 0, Time elapsed: 0.001 sec
Running org.apache.tika.detect.TestContainerAwareDetector
Tests run: 13, Failures: 0, Errors: 0, Skipped: 0, Time elapsed: 1.036 sec
Running org.apache.tika.TestParsers
Tests run: 4, Failures: 0, Errors: 0, Skipped: 0, Time elapsed: 0.301 sec
Running org.apache.tika.mime.MimeTypeTest
Tests run: 3, Failures: 0, Errors: 0, Skipped: 0, Time elapsed: 0.001 sec
Running org.apache.tika.mime.TestMimeTypes
Tests run: 35, Failures: 0, Errors: 0, Skipped: 0, Time elapsed: 0.114 sec
Running org.apache.tika.mime.MimeTypesTest
Tests run: 5, Failures: 0, Errors: 0, Skipped: 0, Time elapsed: 0.001 sec

Results :

Tests run: 386, Failures: 0, Errors: 0, Skipped: 0

mojoSucceeded org.apache.maven.plugins:maven-surefire-plugin:2.12(default-test)
[JENKINS] Recording test results
mojoStarted org.apache.felix:maven-bundle-plugin:2.3.4(default-bundle)
[INFO] 
[INFO] --- maven-bundle-plugin:2.3.4:bundle (default-bundle) @ tika-parsers ---
mojoSucceeded org.apache.felix:maven-bundle-plugin:2.3.4(default-bundle)
mojoStarted org.apache.maven.plugins:maven-site-plugin:3.0(attach-descriptor)
[INFO] 
[INFO] --- maven-site-plugin:3.0:attach-descriptor (attach-descriptor) @ tika-parsers ---
mojoSucceeded org.apache.maven.plugins:maven-site-plugin:3.0(attach-descriptor)
mojoStarted org.apache.rat:apache-rat-plugin:0.7(default)[INFO] Exclude: src/main/java/org/apache/tika/parser/txt/Charset*.java
[INFO] Exclude: src/test/resources/test-documents/**

[INFO] 
[INFO] --- apache-rat-plugin:0.7:check (default) @ tika-parsers ---
mojoSucceeded org.apache.rat:apache-rat-plugin:0.7(default)
[PMD] No report found for mojo check
mojoStarted org.apache.maven.plugins:maven-install-plugin:2.3.1(default-install)[INFO] Installing
<https://builds.apache.org/job/Tika-trunk/ws/trunk/tika-parsers/target/tika-parsers-1.2-SNAPSHOT.jar>
to /home/jenkins/jenkins-slave/maven-repositories/1/org/apache/tika/tika-parsers/1.2-SNAPSHOT/tika-parsers-1.2-SNAPSHOT.jar

[INFO] 
[INFO] --- maven-install-plugin:2.3.1:install (default-install) @ tika-parsers ---
[INFO] Installing <https://builds.apache.org/job/Tika-trunk/ws/trunk/tika-parsers/pom.xml>
to /home/jenkins/jenkins-slave/maven-repositories/1/org/apache/tika/tika-parsers/1.2-SNAPSHOT/tika-parsers-1.2-SNAPSHOT.pom
mojoSucceeded org.apache.maven.plugins:maven-install-plugin:2.3.1(default-install)
mojoStarted org.apache.felix:maven-bundle-plugin:2.3.4(default-install)[INFO] Local OBR update
disabled (enable with -DobrRepository)

[INFO] 
[INFO] --- maven-bundle-plugin:2.3.4:install (default-install) @ tika-parsers ---
mojoSucceeded org.apache.felix:maven-bundle-plugin:2.3.4(default-install)
mojoStarted org.apache.maven.plugins:maven-deploy-plugin:2.6(default-deploy)Downloading: https://repository.apache.org/content/repositories/snapshots/org/apache/tika/tika-parsers/1.2-SNAPSHOT/maven-metadata.xml

[INFO] 
[INFO] --- maven-deploy-plugin:2.6:deploy (default-deploy) @ tika-parsers ---
Downloaded: https://repository.apache.org/content/repositories/snapshots/org/apache/tika/tika-parsers/1.2-SNAPSHOT/maven-metadata.xml
(774 B at 1.4 KB/sec)
Uploading: https://repository.apache.org/content/repositories/snapshots/org/apache/tika/tika-parsers/1.2-SNAPSHOT/tika-parsers-1.2-20120702.165719-74.jar
Uploaded: https://repository.apache.org/content/repositories/snapshots/org/apache/tika/tika-parsers/1.2-SNAPSHOT/tika-parsers-1.2-20120702.165719-74.jar
(461 KB at 545.7 KB/sec)
Uploading: https://repository.apache.org/content/repositories/snapshots/org/apache/tika/tika-parsers/1.2-SNAPSHOT/tika-parsers-1.2-20120702.165719-74.pom
Uploaded: https://repository.apache.org/content/repositories/snapshots/org/apache/tika/tika-parsers/1.2-SNAPSHOT/tika-parsers-1.2-20120702.165719-74.pom
(9 KB at 58.8 KB/sec)
Downloading: https://repository.apache.org/content/repositories/snapshots/org/apache/tika/tika-parsers/maven-metadata.xml
Downloaded: https://repository.apache.org/content/repositories/snapshots/org/apache/tika/tika-parsers/maven-metadata.xml
(343 B at 1.7 KB/sec)
Uploading: https://repository.apache.org/content/repositories/snapshots/org/apache/tika/tika-parsers/1.2-SNAPSHOT/maven-metadata.xml
Uploaded: https://repository.apache.org/content/repositories/snapshots/org/apache/tika/tika-parsers/1.2-SNAPSHOT/maven-metadata.xml
(774 B at 3.2 KB/sec)
Uploading: https://repository.apache.org/content/repositories/snapshots/org/apache/tika/tika-parsers/maven-metadata.xml
Uploaded: https://repository.apache.org/content/repositories/snapshots/org/apache/tika/tika-parsers/maven-metadata.xml
(343 B at 1.9 KB/sec)
mojoSucceeded org.apache.maven.plugins:maven-deploy-plugin:2.6(default-deploy)
mojoStarted org.apache.felix:maven-bundle-plugin:2.3.4(default-deploy)[INFO] Remote OBR update
disabled (enable with -DremoteOBR)

[INFO] 
[INFO] --- maven-bundle-plugin:2.3.4:deploy (default-deploy) @ tika-parsers ---
mojoSucceeded org.apache.felix:maven-bundle-plugin:2.3.4(default-deploy)
projectSucceeded org.apache.tika:tika-parsers:1.2-SNAPSHOT
projectStarted org.apache.tika:tika-xmp:1.2-SNAPSHOT
[INFO] Downloading: http://repo1.maven.org/maven2/com/adobe/xmp/xmpcore/5.1.1/xmpcore-5.1.1.pom
                                                                        
[INFO] ------------------------------------------------------------------------
[INFO] Building Apache Tika XMP 1.2-SNAPSHOT
[INFO] ------------------------------------------------------------------------
Downloaded: http://repo1.maven.org/maven2/com/adobe/xmp/xmpcore/5.1.1/xmpcore-5.1.1.pom (2
KB at 3.8 KB/sec)
Downloading: http://repo1.maven.org/maven2/com/adobe/xmp/xmpcore/5.1.1/xmpcore-5.1.1.jar
Downloaded: http://repo1.maven.org/maven2/com/adobe/xmp/xmpcore/5.1.1/xmpcore-5.1.1.jar (120
KB at 227.0 KB/sec)
mojoStarted org.apache.maven.plugins:maven-clean-plugin:2.4.1(default-clean)
[INFO] 
[INFO] --- maven-clean-plugin:2.4.1:clean (default-clean) @ tika-xmp ---
mojoSucceeded org.apache.maven.plugins:maven-clean-plugin:2.4.1(default-clean)
[TASKS] Scanning folder '<https://builds.apache.org/job/Tika-trunk/ws/trunk/tika-xmp'>
for files matching the pattern '**/*.java' - excludes: 
[TASKS] Found 12 files to scan for tasks
Found 2 open tasks.
mojoStarted org.apache.maven.plugins:maven-remote-resources-plugin:1.2.1(default)
[INFO] 
[INFO] --- maven-remote-resources-plugin:1.2.1:process (default) @ tika-xmp ---
mojoSucceeded org.apache.maven.plugins:maven-remote-resources-plugin:1.2.1(default)
mojoStarted org.apache.maven.plugins:maven-resources-plugin:2.5(default-resources)[debug]
execute contextualize
[INFO] Using 'UTF-8' encoding to copy filtered resources.
[INFO] skip non existing resourceDirectory <https://builds.apache.org/job/Tika-trunk/ws/trunk/tika-xmp/src/main/resources>
[INFO] Copying 3 resources

[INFO] 
[INFO] --- maven-resources-plugin:2.5:resources (default-resources) @ tika-xmp ---
mojoSucceeded org.apache.maven.plugins:maven-resources-plugin:2.5(default-resources)
mojoStarted org.apache.maven.plugins:maven-compiler-plugin:2.3.2(default-compile)[INFO] Compiling
10 source files to <https://builds.apache.org/job/Tika-trunk/ws/trunk/tika-xmp/target/classes>

[INFO] 
[INFO] --- maven-compiler-plugin:2.3.2:compile (default-compile) @ tika-xmp ---
[INFO] -------------------------------------------------------------
[ERROR] COMPILATION ERROR : 
mojoFailed org.apache.maven.plugins:maven-compiler-plugin:2.3.2(default-compile)[INFO] -------------------------------------------------------------
[ERROR] <https://builds.apache.org/job/Tika-trunk/ws/trunk/tika-xmp/src/main/java/org/apache/tika/xmp/convert/ITikaToXMPConverter.java>:[25,-1]
cannot access com.adobe.xmp.XMPException
bad class file: /home/jenkins/jenkins-slave/maven-repositories/1/com/adobe/xmp/xmpcore/5.1.1/xmpcore-5.1.1.jar(com/adobe/xmp/XMPException.class)
class file has wrong version 50.0, should be 49.0
[INFO] 1 error
[INFO] -------------------------------------------------------------

projectFailed org.apache.tika:tika-xmp:1.2-SNAPSHOT
sessionEnded
[INFO] ------------------------------------------------------------------------
[INFO] Reactor Summary:
[INFO] 
[INFO] Apache Tika parent ................................ SUCCESS [28.175s]
[INFO] Apache Tika core .................................. SUCCESS [38.299s]
[INFO] Apache Tika parsers ............................... SUCCESS [1:02.260s]
[INFO] Apache Tika XMP ................................... FAILURE [3.557s]
[INFO] Apache Tika application ........................... SKIPPED
[INFO] Apache Tika OSGi bundle ........................... SKIPPED
[INFO] Apache Tika server ................................ SKIPPED
[INFO] Apache Tika ....................................... SKIPPED
[INFO] ------------------------------------------------------------------------
[INFO] BUILD FAILURE
[INFO] ------------------------------------------------------------------------
[INFO] Total time: 2:15.270s
[INFO] Finished at: Mon Jul 02 16:57:25 UTC 2012
[INFO] Final Memory: 38M/323M
[INFO] ------------------------------------------------------------------------
Projects to build: [MavenProject: org.apache.tika:tika-parent:1.2-SNAPSHOT @ <https://builds.apache.org/job/Tika-trunk/ws/trunk/tika-parent/pom.xml,>
MavenProject: org.apache.tika:tika-core:1.2-SNAPSHOT @ <https://builds.apache.org/job/Tika-trunk/ws/trunk/tika-core/pom.xml,>
MavenProject: org.apache.tika:tika-parsers:1.2-SNAPSHOT @ <https://builds.apache.org/job/Tika-trunk/ws/trunk/tika-parsers/pom.xml,>
MavenProject: org.apache.tika:tika-xmp:1.2-SNAPSHOT @ <https://builds.apache.org/job/Tika-trunk/ws/trunk/tika-xmp/pom.xml,>
MavenProject: org.apache.tika:tika-app:1.2-SNAPSHOT @ <https://builds.apache.org/job/Tika-trunk/ws/trunk/tika-app/pom.xml,>
MavenProject: org.apache.tika:tika-bundle:1.2-SNAPSHOT @ <https://builds.apache.org/job/Tika-trunk/ws/trunk/tika-bundle/pom.xml,>
MavenProject: org.apache.tika:tika-server:1.2-SNAPSHOT @ <https://builds.apache.org/job/Tika-trunk/ws/trunk/tika-server/pom.xml,>
MavenProject: org.apache.tika:tika:1.2-SNAPSHOT @ <https://builds.apache.org/job/Tika-trunk/ws/trunk/pom.xml]>
[JENKINS] Archiving <https://builds.apache.org/job/Tika-trunk/ws/trunk/pom.xml> to /home/hudson/hudson/jobs/Tika-trunk/modules/org.apache.tika$tika/builds/2012-07-02_16-54-53/archive/org.apache.tika/tika/1.2-SNAPSHOT/tika-1.2-SNAPSHOT.pom
[JENKINS] Archiving <https://builds.apache.org/job/Tika-trunk/ws/trunk/tika-parent/pom.xml>
to /home/hudson/hudson/jobs/Tika-trunk/modules/org.apache.tika$tika-parent/builds/2012-07-02_16-54-53/archive/org.apache.tika/tika-parent/1.2-SNAPSHOT/tika-parent-1.2-SNAPSHOT.pom
[JENKINS] Archiving <https://builds.apache.org/job/Tika-trunk/ws/trunk/tika-parsers/pom.xml>
to /home/hudson/hudson/jobs/Tika-trunk/modules/org.apache.tika$tika-parsers/builds/2012-07-02_16-54-53/archive/org.apache.tika/tika-parsers/1.2-SNAPSHOT/tika-parsers-1.2-SNAPSHOT.pom
[JENKINS] Archiving <https://builds.apache.org/job/Tika-trunk/ws/trunk/tika-parsers/target/tika-parsers-1.2-SNAPSHOT.jar>
to /home/hudson/hudson/jobs/Tika-trunk/modules/org.apache.tika$tika-parsers/builds/2012-07-02_16-54-53/archive/org.apache.tika/tika-parsers/1.2-20120702.165719-74/tika-parsers-1.2-20120702.165719-74.jar
[JENKINS] Archiving <https://builds.apache.org/job/Tika-trunk/ws/trunk/tika-xmp/pom.xml>
to /home/hudson/hudson/jobs/Tika-trunk/modules/org.apache.tika$tika-xmp/builds/2012-07-02_16-54-53/archive/org.apache.tika/tika-xmp/1.2-SNAPSHOT/tika-xmp-1.2-SNAPSHOT.pom
[JENKINS] Archiving <https://builds.apache.org/job/Tika-trunk/ws/trunk/tika-app/pom.xml>
to /home/hudson/hudson/jobs/Tika-trunk/modules/org.apache.tika$tika-app/builds/2012-07-02_16-54-53/archive/org.apache.tika/tika-app/1.2-SNAPSHOT/tika-app-1.2-SNAPSHOT.pom
[JENKINS] Archiving <https://builds.apache.org/job/Tika-trunk/ws/trunk/tika-server/pom.xml>
to /home/hudson/hudson/jobs/Tika-trunk/modules/org.apache.tika$tika-server/builds/2012-07-02_16-54-54/archive/org.apache.tika/tika-server/1.2-SNAPSHOT/tika-server-1.2-SNAPSHOT.pom
[JENKINS] Archiving <https://builds.apache.org/job/Tika-trunk/ws/trunk/tika-core/pom.xml>
to /home/hudson/hudson/jobs/Tika-trunk/modules/org.apache.tika$tika-core/builds/2012-07-02_16-54-53/archive/org.apache.tika/tika-core/1.2-SNAPSHOT/tika-core-1.2-SNAPSHOT.pom
[JENKINS] Archiving <https://builds.apache.org/job/Tika-trunk/ws/trunk/tika-core/target/tika-core-1.2-SNAPSHOT.jar>
to /home/hudson/hudson/jobs/Tika-trunk/modules/org.apache.tika$tika-core/builds/2012-07-02_16-54-53/archive/org.apache.tika/tika-core/1.2-20120702.165615-77/tika-core-1.2-20120702.165615-77.jar
[JENKINS] Archiving <https://builds.apache.org/job/Tika-trunk/ws/trunk/tika-bundle/pom.xml>
to /home/hudson/hudson/jobs/Tika-trunk/modules/org.apache.tika$tika-bundle/builds/2012-07-02_16-54-54/archive/org.apache.tika/tika-bundle/1.2-SNAPSHOT/tika-bundle-1.2-SNAPSHOT.pom
Waiting for Jenkins to finish collecting data
mavenExecutionResult exceptions not empty
message : Failed to execute goal org.apache.maven.plugins:maven-compiler-plugin:2.3.2:compile
(default-compile) on project tika-xmp: Compilation failure
<https://builds.apache.org/job/Tika-trunk/ws/trunk/tika-xmp/src/main/java/org/apache/tika/xmp/convert/ITikaToXMPConverter.java>:[25,-1]
cannot access com.adobe.xmp.XMPException
bad class file: /home/jenkins/jenkins-slave/maven-repositories/1/com/adobe/xmp/xmpcore/5.1.1/xmpcore-5.1.1.jar(com/adobe/xmp/XMPException.class)
class file has wrong version 50.0, should be 49.0

cause : Compilation failure
<https://builds.apache.org/job/Tika-trunk/ws/trunk/tika-xmp/src/main/java/org/apache/tika/xmp/convert/ITikaToXMPConverter.java>:[25,-1]
cannot access com.adobe.xmp.XMPException
bad class file: /home/jenkins/jenkins-slave/maven-repositories/1/com/adobe/xmp/xmpcore/5.1.1/xmpcore-5.1.1.jar(com/adobe/xmp/XMPException.class)
class file has wrong version 50.0, should be 49.0

Stack trace : 
org.apache.maven.lifecycle.LifecycleExecutionException: Failed to execute goal org.apache.maven.plugins:maven-compiler-plugin:2.3.2:compile
(default-compile) on project tika-xmp: Compilation failure
<https://builds.apache.org/job/Tika-trunk/ws/trunk/tika-xmp/src/main/java/org/apache/tika/xmp/convert/ITikaToXMPConverter.java>:[25,-1]
cannot access com.adobe.xmp.XMPException
bad class file: /home/jenkins/jenkins-slave/maven-repositories/1/com/adobe/xmp/xmpcore/5.1.1/xmpcore-5.1.1.jar(com/adobe/xmp/XMPException.class)
class file has wrong version 50.0, should be 49.0

	at org.apache.maven.lifecycle.internal.MojoExecutor.execute(MojoExecutor.java:213)
	at org.apache.maven.lifecycle.internal.MojoExecutor.execute(MojoExecutor.java:153)
	at org.apache.maven.lifecycle.internal.MojoExecutor.execute(MojoExecutor.java:145)
	at org.apache.maven.lifecycle.internal.LifecycleModuleBuilder.buildProject(LifecycleModuleBuilder.java:84)
	at org.apache.maven.lifecycle.internal.LifecycleModuleBuilder.buildProject(LifecycleModuleBuilder.java:59)
	at org.apache.maven.lifecycle.internal.LifecycleStarter.singleThreadedBuild(LifecycleStarter.java:183)
	at org.apache.maven.lifecycle.internal.LifecycleStarter.execute(LifecycleStarter.java:161)
	at org.apache.maven.DefaultMaven.doExecute(DefaultMaven.java:319)
	at org.apache.maven.DefaultMaven.execute(DefaultMaven.java:156)
	at org.jvnet.hudson.maven3.launcher.Maven3Launcher.main(Maven3Launcher.java:79)
	at sun.reflect.NativeMethodAccessorImpl.invoke0(Native Method)
	at sun.reflect.NativeMethodAccessorImpl.invoke(NativeMethodAccessorImpl.java:39)
	at sun.reflect.DelegatingMethodAccessorImpl.invoke(DelegatingMethodAccessorImpl.java:25)
	at java.lang.reflect.Method.invoke(Method.java:592)
	at org.codehaus.plexus.classworlds.launcher.Launcher.launchStandard(Launcher.java:329)
	at org.codehaus.plexus.classworlds.launcher.Launcher.launch(Launcher.java:239)
	at org.jvnet.hudson.maven3.agent.Maven3Main.launch(Maven3Main.java:158)
	at hudson.maven.Maven3Builder.call(Maven3Builder.java:98)
	at hudson.maven.Maven3Builder.call(Maven3Builder.java:64)
	at hudson.remoting.UserRequest.perform(UserRequest.java:118)
	at hudson.remoting.UserRequest.perform(UserRequest.java:48)
	at hudson.remoting.Request$2.run(Request.java:326)
	at hudson.remoting.InterceptingExecutorService$1.call(InterceptingExecutorService.java:72)
	at java.util.concurrent.FutureTask$Sync.innerRun(FutureTask.java:269)
	at java.util.concurrent.FutureTask.run(FutureTask.java:123)
	at java.util.concurrent.ThreadPoolExecutor$Worker.runTask(ThreadPoolExecutor.java:651)
	at java.util.concurrent.ThreadPoolExecutor$Worker.run(ThreadPoolExecutor.java:676)
	at java.lang.Thread.run(Thread.java:595)
Caused by: org.apache.maven.plugin.CompilationFailureException: Compilation failure
<https://builds.apache.org/job/Tika-trunk/ws/trunk/tika-xmp/src/main/java/org/apache/tika/xmp/convert/ITikaToXMPConverter.java>:[25,-1]
cannot access com.adobe.xmp.XMPException
bad class file: /home/jenkins/jenkins-slave/maven-repositories/1/com/adobe/xmp/xmpcore/5.1.1/xmpcore-5.1.1.jar(com/adobe/xmp/XMPException.class)
class file has wrong version 50.0, should be 49.0

	at org.apache.maven.plugin.AbstractCompilerMojo.execute(AbstractCompilerMojo.java:656)
	at org.apache.maven.plugin.CompilerMojo.execute(CompilerMojo.java:128)
	at org.apache.maven.plugin.DefaultBuildPluginManager.executeMojo(DefaultBuildPluginManager.java:101)
	at org.apache.maven.lifecycle.internal.MojoExecutor.execute(MojoExecutor.java:209)
	... 27 more
channel stopped

Mime
View raw message