tika-dev mailing list archives

Site index · List index
Message view « Date » · « Thread »
Top « Date » · « Thread »
From Apache Jenkins Server <jenk...@builds.apache.org>
Subject Build failed in Jenkins: Tika-trunk #904
Date Mon, 30 Jul 2012 00:18:54 GMT
See <https://builds.apache.org/job/Tika-trunk/904/changes>

Changes:

[rgauss] TIKA-811: Upgrade metadatExtractor version for OpenJDK 7 support
   - Upgraded metadata-extractor to 2.6.2
   - Refactored calls to metadata-extractor library methods and tags for new API
   - Simplified use of JpegMetadataReader to use readMetadata method
   - Updated TIFF parsing to utilize a temp File since metadata-extractor method accepting
InputStream is now deprecated
TIKA-915: Image geodata being rounded to integers
   - Refactored GeotagHandler to use metadata-extractor's GeoLocation object
   - Updated JpegParserTest for the better precision now available from metadata-extractor
library
   - Enabled testJPEGGeo2 test

------------------------------------------
[...truncated 1449 lines...]
[INFO] --- maven-compiler-plugin:2.3.2:testCompile (default-testCompile) @ tika-parsers ---
[INFO] Compiling 75 source files to <https://builds.apache.org/job/Tika-trunk/ws/trunk/tika-parsers/target/test-classes>
mojoSucceeded org.apache.maven.plugins:maven-compiler-plugin:2.3.2(default-testCompile)
mojoStarted org.apache.maven.plugins:maven-surefire-plugin:2.12(default-test)[INFO] Surefire
report directory: <https://builds.apache.org/job/Tika-trunk/ws/trunk/tika-parsers/target/surefire-reports>

-------------------------------------------------------
 T E S T S
-------------------------------------------------------

[INFO] 
[INFO] --- maven-surefire-plugin:2.12:test (default-test) @ tika-parsers ---
Running org.apache.tika.TestParsers
Tests run: 4, Failures: 0, Errors: 0, Skipped: 0, Time elapsed: 3.464 sec
Running org.apache.tika.parser.video.FLVParserTest
Tests run: 1, Failures: 0, Errors: 0, Skipped: 0, Time elapsed: 0.014 sec
Running org.apache.tika.parser.chm.TestChmLzxcControlData
Tests run: 10, Failures: 0, Errors: 0, Skipped: 0, Time elapsed: 0.031 sec
Running org.apache.tika.parser.chm.TestChmBlockInfo
Tests run: 2, Failures: 0, Errors: 0, Skipped: 0, Time elapsed: 0.006 sec
Running org.apache.tika.parser.chm.TestPmgiHeader
Tests run: 2, Failures: 0, Errors: 0, Skipped: 0, Time elapsed: 0.002 sec
Running org.apache.tika.parser.chm.TestPmglHeader
Tests run: 6, Failures: 0, Errors: 0, Skipped: 0, Time elapsed: 0.002 sec
Running org.apache.tika.parser.chm.TestChmItspHeader
Tests run: 16, Failures: 0, Errors: 0, Skipped: 0, Time elapsed: 0.004 sec
Running org.apache.tika.parser.chm.TestChmItsfHeader
Tests run: 1, Failures: 0, Errors: 0, Skipped: 0, Time elapsed: 0 sec
Running org.apache.tika.parser.chm.TestDirectoryListingEntry
Tests run: 8, Failures: 0, Errors: 0, Skipped: 0, Time elapsed: 0.001 sec
Running org.apache.tika.parser.chm.TestChmDocumentInformation
Tests run: 2, Failures: 0, Errors: 0, Skipped: 0, Time elapsed: 0.512 sec
Running org.apache.tika.parser.chm.TestChmExtractor
Tests run: 4, Failures: 0, Errors: 0, Skipped: 0, Time elapsed: 1.771 sec
Running org.apache.tika.parser.chm.TestChmLzxState
Tests run: 2, Failures: 0, Errors: 0, Skipped: 0, Time elapsed: 0.002 sec
Running org.apache.tika.parser.chm.TestChmLzxcResetTable
Tests run: 9, Failures: 0, Errors: 0, Skipped: 0, Time elapsed: 0.008 sec
Running org.apache.tika.parser.chm.TestChmExtraction
Tests run: 1, Failures: 0, Errors: 0, Skipped: 0, Time elapsed: 1.504 sec
Running org.apache.tika.parser.epub.EpubParserTest
Tests run: 1, Failures: 0, Errors: 0, Skipped: 0, Time elapsed: 0.025 sec
Running org.apache.tika.parser.fork.ForkParserIntegrationTest
Tests run: 5, Failures: 0, Errors: 0, Skipped: 0, Time elapsed: 4.391 sec
Running org.apache.tika.parser.AutoDetectParserTest
Warning - invalid checksum on page 3 of stream 6e630f49 (1851985737)
Warning - invalid checksum on page 3 of stream 6e630f49 (1851985737)
Tests run: 19, Failures: 0, Errors: 0, Skipped: 0, Time elapsed: 4.968 sec
Running org.apache.tika.parser.netcdf.NetCDFParserTest
Tests run: 1, Failures: 0, Errors: 0, Skipped: 0, Time elapsed: 0 sec
Running org.apache.tika.parser.executable.ExecutableParserTest
Tests run: 2, Failures: 0, Errors: 0, Skipped: 0, Time elapsed: 0.001 sec
Running org.apache.tika.parser.iwork.IWorkParserTest
Tests run: 17, Failures: 0, Errors: 0, Skipped: 0, Time elapsed: 0.636 sec
Running org.apache.tika.parser.iwork.AutoPageNumberUtilsTest
Tests run: 4, Failures: 0, Errors: 0, Skipped: 0, Time elapsed: 0 sec
Running org.apache.tika.parser.hdf.HDFParserTest
Tests run: 1, Failures: 0, Errors: 0, Skipped: 0, Time elapsed: 0 sec
Running org.apache.tika.parser.mail.RFC822ParserTest
Tests run: 8, Failures: 0, Errors: 0, Skipped: 0, Time elapsed: 0.547 sec
Running org.apache.tika.parser.feed.FeedParserTest
Tests run: 1, Failures: 0, Errors: 0, Skipped: 0, Time elapsed: 0.002 sec
Running org.apache.tika.parser.pdf.PDFParserTest
Tests run: 12, Failures: 0, Errors: 0, Skipped: 0, Time elapsed: 1.657 sec
Running org.apache.tika.parser.mp3.Mp3ParserTest
Tests run: 9, Failures: 0, Errors: 0, Skipped: 0, Time elapsed: 0.089 sec
Running org.apache.tika.parser.jpeg.JpegParserTest
Tests run: 7, Failures: 0, Errors: 0, Skipped: 0, Time elapsed: 0.211 sec
Running org.apache.tika.parser.image.PSDParserTest
Tests run: 1, Failures: 0, Errors: 0, Skipped: 0, Time elapsed: 0.001 sec
Running org.apache.tika.parser.image.ImageParserTest
Tests run: 4, Failures: 0, Errors: 0, Skipped: 0, Time elapsed: 0.037 sec
Running org.apache.tika.parser.image.xmp.JempboxExtractorTest
Tests run: 4, Failures: 0, Errors: 0, Skipped: 0, Time elapsed: 0.012 sec
Running org.apache.tika.parser.image.ImageMetadataExtractorTest
Tests run: 6, Failures: 0, Errors: 0, Skipped: 0, Time elapsed: 0.112 sec
Running org.apache.tika.parser.image.TiffParserTest
Tests run: 1, Failures: 0, Errors: 0, Skipped: 0, Time elapsed: 0.008 sec
Running org.apache.tika.parser.image.MetadataFieldsTest
Tests run: 1, Failures: 0, Errors: 0, Skipped: 0, Time elapsed: 0 sec
Running org.apache.tika.parser.mbox.MboxParserTest
Tests run: 5, Failures: 0, Errors: 0, Skipped: 0, Time elapsed: 0.103 sec
Running org.apache.tika.parser.rtf.RTFParserTest
Tests run: 24, Failures: 0, Errors: 0, Skipped: 0, Time elapsed: 0.15 sec
Running org.apache.tika.parser.txt.TXTParserTest
Tests run: 10, Failures: 0, Errors: 0, Skipped: 0, Time elapsed: 0.038 sec
Running org.apache.tika.parser.txt.CharsetDetectorTest
Tests run: 1, Failures: 0, Errors: 0, Skipped: 0, Time elapsed: 0.022 sec
Running org.apache.tika.parser.html.HtmlParserTest
Tests run: 28, Failures: 0, Errors: 0, Skipped: 0, Time elapsed: 0.152 sec
Running org.apache.tika.parser.odf.ODFParserTest
Tests run: 7, Failures: 0, Errors: 0, Skipped: 0, Time elapsed: 0.125 sec
Running org.apache.tika.parser.mp4.MP4ParserTest
Tests run: 1, Failures: 0, Errors: 0, Skipped: 0, Time elapsed: 0.089 sec
Running org.apache.tika.parser.asm.ClassParserTest
Tests run: 1, Failures: 0, Errors: 0, Skipped: 0, Time elapsed: 0.012 sec
Running org.apache.tika.parser.ParsingReaderTest
Tests run: 3, Failures: 0, Errors: 0, Skipped: 0, Time elapsed: 0.017 sec
Running org.apache.tika.parser.microsoft.PublisherParserTest
Tests run: 1, Failures: 0, Errors: 0, Skipped: 0, Time elapsed: 0.011 sec
Running org.apache.tika.parser.microsoft.WriteProtectedParserTest
Tests run: 1, Failures: 0, Errors: 0, Skipped: 0, Time elapsed: 0.446 sec
Running org.apache.tika.parser.microsoft.VisioParserTest
Tests run: 1, Failures: 0, Errors: 0, Skipped: 0, Time elapsed: 0.039 sec
Running org.apache.tika.parser.microsoft.ProjectParserTest
Tests run: 2, Failures: 0, Errors: 0, Skipped: 0, Time elapsed: 0.007 sec
Running org.apache.tika.parser.microsoft.OutlookParserTest
Tests run: 6, Failures: 0, Errors: 0, Skipped: 0, Time elapsed: 0.518 sec
Running org.apache.tika.parser.microsoft.POIContainerExtractionTest
Tests run: 5, Failures: 0, Errors: 0, Skipped: 0, Time elapsed: 0.946 sec
Running org.apache.tika.parser.microsoft.PowerPointParserTest
Tests run: 4, Failures: 0, Errors: 0, Skipped: 0, Time elapsed: 0.041 sec
Running org.apache.tika.parser.microsoft.ExcelParserTest
Tests run: 7, Failures: 0, Errors: 0, Skipped: 0, Time elapsed: 1.068 sec
Running org.apache.tika.parser.microsoft.ooxml.OOXMLContainerExtractionTest
Tests run: 5, Failures: 0, Errors: 0, Skipped: 0, Time elapsed: 3.051 sec
Running org.apache.tika.parser.microsoft.ooxml.OOXMLParserTest
Tests run: 18, Failures: 0, Errors: 0, Skipped: 0, Time elapsed: 1.419 sec
Running org.apache.tika.parser.microsoft.WordParserTest
Tests run: 6, Failures: 0, Errors: 0, Skipped: 0, Time elapsed: 0.048 sec
Running org.apache.tika.parser.microsoft.TNEFParserTest
Tests run: 3, Failures: 0, Errors: 0, Skipped: 0, Time elapsed: 0.034 sec
Running org.apache.tika.parser.pkg.Bzip2ParserTest
Tests run: 2, Failures: 0, Errors: 0, Skipped: 0, Time elapsed: 0.228 sec
Running org.apache.tika.parser.pkg.ArParserTest
Tests run: 2, Failures: 0, Errors: 0, Skipped: 0, Time elapsed: 0.012 sec
Running org.apache.tika.parser.pkg.ZipParserTest
Tests run: 3, Failures: 0, Errors: 0, Skipped: 0, Time elapsed: 0.258 sec
Running org.apache.tika.parser.pkg.TarParserTest
Tests run: 2, Failures: 0, Errors: 0, Skipped: 0, Time elapsed: 0.078 sec
Running org.apache.tika.parser.pkg.GzipParserTest
Tests run: 3, Failures: 0, Errors: 0, Skipped: 0, Time elapsed: 0.082 sec
Running org.apache.tika.parser.audio.AudioParserTest
Tests run: 3, Failures: 0, Errors: 0, Skipped: 0, Time elapsed: 0.005 sec
Running org.apache.tika.parser.audio.MidiParserTest
Tests run: 1, Failures: 0, Errors: 0, Skipped: 0, Time elapsed: 0.004 sec
Running org.apache.tika.parser.ibooks.iBooksParserTest
Tests run: 1, Failures: 0, Errors: 0, Skipped: 0, Time elapsed: 0.012 sec
Running org.apache.tika.parser.xml.FictionBookParserTest
Tests run: 2, Failures: 0, Errors: 0, Skipped: 0, Time elapsed: 0.015 sec
Running org.apache.tika.parser.xml.DcXMLParserTest
Tests run: 2, Failures: 0, Errors: 0, Skipped: 0, Time elapsed: 0.002 sec
Running org.apache.tika.parser.font.AdobeFontMetricParserTest
Tests run: 1, Failures: 0, Errors: 0, Skipped: 0, Time elapsed: 0.002 sec
Running org.apache.tika.parser.dwg.DWGParserTest
Tests run: 6, Failures: 0, Errors: 0, Skipped: 0, Time elapsed: 0.01 sec
Running org.apache.tika.parser.prt.PRTParserTest
Tests run: 2, Failures: 0, Errors: 0, Skipped: 0, Time elapsed: 0.014 sec
Running org.apache.tika.mime.MimeTypeTest
Tests run: 3, Failures: 0, Errors: 0, Skipped: 0, Time elapsed: 0 sec
Running org.apache.tika.mime.MimeTypesTest
Tests run: 4, Failures: 0, Errors: 0, Skipped: 0, Time elapsed: 0 sec
Running org.apache.tika.mime.TestMimeTypes
Tests run: 37, Failures: 0, Errors: 0, Skipped: 0, Time elapsed: 0.124 sec
Running org.apache.tika.detect.TestContainerAwareDetector
Tests run: 13, Failures: 0, Errors: 0, Skipped: 0, Time elapsed: 1.018 sec

Results :

Tests run: 398, Failures: 0, Errors: 0, Skipped: 0

mojoSucceeded org.apache.maven.plugins:maven-surefire-plugin:2.12(default-test)
[JENKINS] Recording test results
mojoStarted org.apache.felix:maven-bundle-plugin:2.3.4(default-bundle)
[INFO] 
[INFO] --- maven-bundle-plugin:2.3.4:bundle (default-bundle) @ tika-parsers ---
mojoSucceeded org.apache.felix:maven-bundle-plugin:2.3.4(default-bundle)
mojoStarted org.apache.maven.plugins:maven-site-plugin:3.0(attach-descriptor)
[INFO] 
[INFO] --- maven-site-plugin:3.0:attach-descriptor (attach-descriptor) @ tika-parsers ---
mojoSucceeded org.apache.maven.plugins:maven-site-plugin:3.0(attach-descriptor)
mojoStarted org.apache.rat:apache-rat-plugin:0.7(default)[INFO] Exclude: src/main/java/org/apache/tika/parser/txt/Charset*.java
[INFO] Exclude: src/test/resources/test-documents/**

[INFO] 
[INFO] --- apache-rat-plugin:0.7:check (default) @ tika-parsers ---
mojoFailed org.apache.rat:apache-rat-plugin:0.7(default)
[PMD] No report found for mojo check
projectFailed org.apache.tika:tika-parsers:1.3-SNAPSHOT
sessionEnded
[INFO] ------------------------------------------------------------------------
[INFO] Reactor Summary:
[INFO] 
[INFO] Apache Tika parent ................................ SUCCESS [28.376s]
[INFO] Apache Tika core .................................. SUCCESS [35.218s]
[INFO] Apache Tika parsers ............................... FAILURE [58.404s]
[INFO] Apache Tika XMP ................................... SKIPPED
[INFO] Apache Tika application ........................... SKIPPED
[INFO] Apache Tika OSGi bundle ........................... SKIPPED
[INFO] Apache Tika server ................................ SKIPPED
[INFO] Apache Tika ....................................... SKIPPED
[INFO] ------------------------------------------------------------------------
[INFO] BUILD FAILURE
[INFO] ------------------------------------------------------------------------
[INFO] Total time: 2:04.679s
[INFO] Finished at: Mon Jul 30 00:18:44 UTC 2012
[INFO] Final Memory: 35M/270M
[INFO] ------------------------------------------------------------------------
Projects to build: [MavenProject: org.apache.tika:tika-parent:1.3-SNAPSHOT @ <https://builds.apache.org/job/Tika-trunk/ws/trunk/tika-parent/pom.xml,>
MavenProject: org.apache.tika:tika-core:1.3-SNAPSHOT @ <https://builds.apache.org/job/Tika-trunk/ws/trunk/tika-core/pom.xml,>
MavenProject: org.apache.tika:tika-parsers:1.3-SNAPSHOT @ <https://builds.apache.org/job/Tika-trunk/ws/trunk/tika-parsers/pom.xml,>
MavenProject: org.apache.tika:tika-xmp:1.3-SNAPSHOT @ <https://builds.apache.org/job/Tika-trunk/ws/trunk/tika-xmp/pom.xml,>
MavenProject: org.apache.tika:tika-app:1.3-SNAPSHOT @ <https://builds.apache.org/job/Tika-trunk/ws/trunk/tika-app/pom.xml,>
MavenProject: org.apache.tika:tika-bundle:1.3-SNAPSHOT @ <https://builds.apache.org/job/Tika-trunk/ws/trunk/tika-bundle/pom.xml,>
MavenProject: org.apache.tika:tika-server:1.3-SNAPSHOT @ <https://builds.apache.org/job/Tika-trunk/ws/trunk/tika-server/pom.xml,>
MavenProject: org.apache.tika:tika:1.3-SNAPSHOT @ <https://builds.apache.org/job/Tika-trunk/ws/trunk/pom.xml]>
[JENKINS] Archiving <https://builds.apache.org/job/Tika-trunk/ws/trunk/pom.xml> to /home/hudson/hudson/jobs/Tika-trunk/modules/org.apache.tika$tika/builds/2012-07-30_00-16-23/archive/org.apache.tika/tika/1.3-SNAPSHOT/tika-1.3-SNAPSHOT.pom
[JENKINS] Archiving <https://builds.apache.org/job/Tika-trunk/ws/trunk/tika-parent/pom.xml>
to /home/hudson/hudson/jobs/Tika-trunk/modules/org.apache.tika$tika-parent/builds/2012-07-30_00-16-23/archive/org.apache.tika/tika-parent/1.3-SNAPSHOT/tika-parent-1.3-SNAPSHOT.pom
[JENKINS] Archiving <https://builds.apache.org/job/Tika-trunk/ws/trunk/tika-parsers/pom.xml>
to /home/hudson/hudson/jobs/Tika-trunk/modules/org.apache.tika$tika-parsers/builds/2012-07-30_00-16-23/archive/org.apache.tika/tika-parsers/1.3-SNAPSHOT/tika-parsers-1.3-SNAPSHOT.pom
[JENKINS] Archiving <https://builds.apache.org/job/Tika-trunk/ws/trunk/tika-parsers/target/tika-parsers-1.3-SNAPSHOT.jar>
to /home/hudson/hudson/jobs/Tika-trunk/modules/org.apache.tika$tika-parsers/builds/2012-07-30_00-16-23/archive/org.apache.tika/tika-parsers/1.3-SNAPSHOT/tika-parsers-1.3-SNAPSHOT.jar
[JENKINS] Archiving <https://builds.apache.org/job/Tika-trunk/ws/trunk/tika-xmp/pom.xml>
to /home/hudson/hudson/jobs/Tika-trunk/modules/org.apache.tika$tika-xmp/builds/2012-07-30_00-16-24/archive/org.apache.tika/tika-xmp/1.3-SNAPSHOT/tika-xmp-1.3-SNAPSHOT.pom
[JENKINS] Archiving <https://builds.apache.org/job/Tika-trunk/ws/trunk/tika-app/pom.xml>
to /home/hudson/hudson/jobs/Tika-trunk/modules/org.apache.tika$tika-app/builds/2012-07-30_00-16-24/archive/org.apache.tika/tika-app/1.3-SNAPSHOT/tika-app-1.3-SNAPSHOT.pom
[JENKINS] Archiving <https://builds.apache.org/job/Tika-trunk/ws/trunk/tika-server/pom.xml>
to /home/hudson/hudson/jobs/Tika-trunk/modules/org.apache.tika$tika-server/builds/2012-07-30_00-16-24/archive/org.apache.tika/tika-server/1.3-SNAPSHOT/tika-server-1.3-SNAPSHOT.pom
[JENKINS] Archiving <https://builds.apache.org/job/Tika-trunk/ws/trunk/tika-core/pom.xml>
to /home/hudson/hudson/jobs/Tika-trunk/modules/org.apache.tika$tika-core/builds/2012-07-30_00-16-23/archive/org.apache.tika/tika-core/1.3-SNAPSHOT/tika-core-1.3-SNAPSHOT.pom
[JENKINS] Archiving <https://builds.apache.org/job/Tika-trunk/ws/trunk/tika-core/target/tika-core-1.3-SNAPSHOT.jar>
to /home/hudson/hudson/jobs/Tika-trunk/modules/org.apache.tika$tika-core/builds/2012-07-30_00-16-23/archive/org.apache.tika/tika-core/1.3-20120730.001741-4/tika-core-1.3-20120730.001741-4.jar
[JENKINS] Archiving <https://builds.apache.org/job/Tika-trunk/ws/trunk/tika-bundle/pom.xml>
to /home/hudson/hudson/jobs/Tika-trunk/modules/org.apache.tika$tika-bundle/builds/2012-07-30_00-16-24/archive/org.apache.tika/tika-bundle/1.3-SNAPSHOT/tika-bundle-1.3-SNAPSHOT.pom
Waiting for Jenkins to finish collecting data
mavenExecutionResult exceptions not empty
message : Failed to execute goal org.apache.rat:apache-rat-plugin:0.7:check (default) on project
tika-parsers: Too many unapproved licenses: 1
cause : Too many unapproved licenses: 1
Stack trace : 
org.apache.maven.lifecycle.LifecycleExecutionException: Failed to execute goal org.apache.rat:apache-rat-plugin:0.7:check
(default) on project tika-parsers: Too many unapproved licenses: 1
	at org.apache.maven.lifecycle.internal.MojoExecutor.execute(MojoExecutor.java:213)
	at org.apache.maven.lifecycle.internal.MojoExecutor.execute(MojoExecutor.java:153)
	at org.apache.maven.lifecycle.internal.MojoExecutor.execute(MojoExecutor.java:145)
	at org.apache.maven.lifecycle.internal.LifecycleModuleBuilder.buildProject(LifecycleModuleBuilder.java:84)
	at org.apache.maven.lifecycle.internal.LifecycleModuleBuilder.buildProject(LifecycleModuleBuilder.java:59)
	at org.apache.maven.lifecycle.internal.LifecycleStarter.singleThreadedBuild(LifecycleStarter.java:183)
	at org.apache.maven.lifecycle.internal.LifecycleStarter.execute(LifecycleStarter.java:161)
	at org.apache.maven.DefaultMaven.doExecute(DefaultMaven.java:319)
	at org.apache.maven.DefaultMaven.execute(DefaultMaven.java:156)
	at org.jvnet.hudson.maven3.launcher.Maven3Launcher.main(Maven3Launcher.java:79)
	at sun.reflect.NativeMethodAccessorImpl.invoke0(Native Method)
	at sun.reflect.NativeMethodAccessorImpl.invoke(NativeMethodAccessorImpl.java:39)
	at sun.reflect.DelegatingMethodAccessorImpl.invoke(DelegatingMethodAccessorImpl.java:25)
	at java.lang.reflect.Method.invoke(Method.java:592)
	at org.codehaus.plexus.classworlds.launcher.Launcher.launchStandard(Launcher.java:329)
	at org.codehaus.plexus.classworlds.launcher.Launcher.launch(Launcher.java:239)
	at org.jvnet.hudson.maven3.agent.Maven3Main.launch(Maven3Main.java:158)
	at hudson.maven.Maven3Builder.call(Maven3Builder.java:98)
	at hudson.maven.Maven3Builder.call(Maven3Builder.java:64)
	at hudson.remoting.UserRequest.perform(UserRequest.java:118)
	at hudson.remoting.UserRequest.perform(UserRequest.java:48)
	at hudson.remoting.Request$2.run(Request.java:326)
	at hudson.remoting.InterceptingExecutorService$1.call(InterceptingExecutorService.java:72)
	at java.util.concurrent.FutureTask$Sync.innerRun(FutureTask.java:269)
	at java.util.concurrent.FutureTask.run(FutureTask.java:123)
	at java.util.concurrent.ThreadPoolExecutor$Worker.runTask(ThreadPoolExecutor.java:651)
	at java.util.concurrent.ThreadPoolExecutor$Worker.run(ThreadPoolExecutor.java:676)
	at java.lang.Thread.run(Thread.java:595)
Caused by: org.apache.rat.mp.RatCheckException: Too many unapproved licenses: 1
	at org.apache.rat.mp.RatCheckMojo.check(RatCheckMojo.java:167)
	at org.apache.rat.mp.RatCheckMojo.execute(RatCheckMojo.java:159)
	at org.apache.maven.plugin.DefaultBuildPluginManager.executeMojo(DefaultBuildPluginManager.java:101)
	at org.apache.maven.lifecycle.internal.MojoExecutor.execute(MojoExecutor.java:209)
	... 27 more
channel stopped

Mime
View raw message