tika-dev mailing list archives

Site index · List index
Message view « Date » · « Thread »
Top « Date » · « Thread »
From Michael McCandless <luc...@mikemccandless.com>
Subject Re: Build failed in Jenkins: Tika-trunk #934
Date Mon, 29 Oct 2012 11:18:46 GMT
Thanks Ray, looks like build is happy again!

Mike McCandless

http://blog.mikemccandless.com

On Mon, Oct 29, 2012 at 7:04 AM, Ray Gauss II <ray.gauss@alfresco.com> wrote:
> DecimalFormatSymbol.getInstance(Locale locale) definitely is Java 6 only which is why
the first commit broke the build.  I attempted to fix that in r1403221 with a call to 'new
DecimalFormatSymbols(Locale)' which looks like it was around in 5 [1].
>
> Regards,
>
> Ray
>
>
> [1] http://docs.oracle.com/javase/1.5.0/docs/api/java/text/DecimalFormatSymbols.html#DecimalFormatSymbols(java.util.Locale)
>
>
> On Oct 29, 2012, at 6:48 AM, Michael McCandless <lucene@mikemccandless.com> wrote:
>
>> It looks like "new DecimalFormatSymbols(Locale)" is Java-6 only API?
>>
>> Mike McCandless
>>
>> http://blog.mikemccandless.com
>>
>> On Sun, Oct 28, 2012 at 10:04 PM, Apache Jenkins Server
>> <jenkins@builds.apache.org> wrote:
>>> See <https://builds.apache.org/job/Tika-trunk/934/changes>
>>>
>>> Changes:
>>>
>>> [rgauss] TIKA-984: JpegParserTest fails for some locales
>>>   - Changed GEO_DECIMAL_FORMAT to simple String GEO_DECIMAL_FORMAT_STRING
>>>   - Changed GeotagHandler to create a new, Locale-specific DecimalFormat object
using the GEO_DECIMAL_FORMAT_STRING
>>>
>>> ------------------------------------------
>>> [...truncated 176 lines...]
>>> Running org.apache.tika.mime.MimeDetectionTest
>>> Tests run: 6, Failures: 0, Errors: 0, Skipped: 0, Time elapsed: 0.181 sec
>>> Running org.apache.tika.mime.PatternsTest
>>> Tests run: 4, Failures: 0, Errors: 0, Skipped: 0, Time elapsed: 0.003 sec
>>> Running org.apache.tika.io.LookaheadInputStreamTest
>>> Tests run: 6, Failures: 0, Errors: 0, Skipped: 0, Time elapsed: 0.003 sec
>>> Running org.apache.tika.io.TaggedInputStreamTest
>>> Tests run: 1, Failures: 0, Errors: 0, Skipped: 0, Time elapsed: 0.021 sec
>>> Running org.apache.tika.io.TikaInputStreamTest
>>> Tests run: 3, Failures: 0, Errors: 0, Skipped: 0, Time elapsed: 0.001 sec
>>> Running org.apache.tika.detect.NameDetectorTest
>>> Tests run: 1, Failures: 0, Errors: 0, Skipped: 0, Time elapsed: 0.001 sec
>>> Running org.apache.tika.detect.TypeDetectorTest
>>> Tests run: 1, Failures: 0, Errors: 0, Skipped: 0, Time elapsed: 0 sec
>>> Running org.apache.tika.detect.TextDetectorTest
>>> Tests run: 3, Failures: 0, Errors: 0, Skipped: 0, Time elapsed: 0.001 sec
>>> Running org.apache.tika.detect.MagicDetectorTest
>>> Tests run: 8, Failures: 0, Errors: 0, Skipped: 0, Time elapsed: 0.024 sec
>>>
>>> Results :
>>>
>>> Tests run: 120, Failures: 0, Errors: 0, Skipped: 0
>>>
>>> mojoSucceeded org.apache.maven.plugins:maven-surefire-plugin:2.12(default-test)
>>> [JENKINS] Recording test results
>>> mojoStarted org.apache.felix:maven-bundle-plugin:2.3.4(default-bundle)
>>> [INFO]
>>> [INFO] --- maven-bundle-plugin:2.3.4:bundle (default-bundle) @ tika-core ---
>>> mojoSucceeded org.apache.felix:maven-bundle-plugin:2.3.4(default-bundle)
>>> mojoStarted org.apache.maven.plugins:maven-site-plugin:3.0(attach-descriptor)
>>> [INFO]
>>> [INFO] --- maven-site-plugin:3.0:attach-descriptor (attach-descriptor) @ tika-core
---
>>> mojoSucceeded org.apache.maven.plugins:maven-site-plugin:3.0(attach-descriptor)
>>> mojoStarted org.apache.maven.plugins:maven-failsafe-plugin:2.10(default)
>>> [INFO]
>>> [INFO] --- maven-failsafe-plugin:2.10:integration-test (default) @ tika-core
---
>>> [INFO] Failsafe report directory: <https://builds.apache.org/job/Tika-trunk/ws/trunk/tika-core/target/failsafe-reports>
>>>
>>> -------------------------------------------------------
>>> T E S T S
>>> -------------------------------------------------------
>>> Running org.apache.tika.TikaIT
>>> Tests run: 1, Failures: 0, Errors: 0, Skipped: 0, Time elapsed: 0.237 sec
>>>
>>> Results :
>>>
>>> Tests run: 1, Failures: 0, Errors: 0, Skipped: 0
>>>
>>> mojoSucceeded org.apache.maven.plugins:maven-failsafe-plugin:2.10(default)
>>> [JENKINS] Recording test results
>>> mojoStarted org.apache.rat:apache-rat-plugin:0.7(default)
>>> [INFO]
>>> [INFO] --- apache-rat-plugin:0.7:check (default) @ tika-core ---
>>> [INFO] Exclude: src/test/resources/org/apache/tika/**
>>> mojoSucceeded org.apache.rat:apache-rat-plugin:0.7(default)
>>> [PMD] No report found for mojo check
>>> forkedProjectStarted org.apache.tika:tika-core:1.3-SNAPSHOT
>>> mojoStarted org.apache.maven.plugins:maven-remote-resources-plugin:1.2.1(default)
>>> [INFO]
>>> [INFO] --- maven-remote-resources-plugin:1.2.1:process (default) @ tika-core
---
>>> mojoSucceeded org.apache.maven.plugins:maven-remote-resources-plugin:1.2.1(default)
>>> mojoStarted org.apache.maven.plugins:maven-resources-plugin:2.5(default-resources)[debug]
execute contextualize
>>> [INFO] Using 'UTF-8' encoding to copy filtered resources.
>>> [INFO] Copying 29 resources
>>> [INFO] Copying 3 resources
>>> [INFO] Copying 3 resources
>>>
>>> [INFO]
>>> [INFO] --- maven-resources-plugin:2.5:resources (default-resources) @ tika-core
---
>>> mojoSucceeded org.apache.maven.plugins:maven-resources-plugin:2.5(default-resources)
>>> mojoStarted org.apache.maven.plugins:maven-compiler-plugin:2.3.2(default-compile)[INFO]
Nothing to compile - all classes are up to date
>>>
>>> [INFO]
>>> [INFO] --- maven-compiler-plugin:2.3.2:compile (default-compile) @ tika-core
---
>>> mojoSucceeded org.apache.maven.plugins:maven-compiler-plugin:2.3.2(default-compile)
>>> forkedProjectSucceeded org.apache.tika:tika-core:1.3-SNAPSHOTOct 29, 2012 2:03:48
AM hudson.maven.ExecutedMojo <init>
>>> WARNING: Failed to getClass for org.codehaus.mojo.clirr.ClirrCheckMojo
>>>
>>> [PMD] No report found for mojo check
>>> mojoStarted org.codehaus.mojo:clirr-maven-plugin:2.3(default)
>>> [INFO]
>>> [INFO] --- clirr-maven-plugin:2.3:check (default) @ tika-core ---
>>> [INFO] Succeeded with 0 errors; 0 warnings; and 0 other changes.
>>> mojoSucceeded org.codehaus.mojo:clirr-maven-plugin:2.3(default)
>>> [PMD] No report found for mojo check
>>> [INFO] Failsafe report directory: <https://builds.apache.org/job/Tika-trunk/ws/trunk/tika-core/target/failsafe-reports>
>>> mojoStarted org.apache.maven.plugins:maven-failsafe-plugin:2.10(default)
>>> [INFO]
>>> [INFO] --- maven-failsafe-plugin:2.10:verify (default) @ tika-core ---
>>> mojoSucceeded org.apache.maven.plugins:maven-failsafe-plugin:2.10(default)
>>> mojoStarted org.apache.maven.plugins:maven-install-plugin:2.3.1(default-install)[INFO]
Installing <https://builds.apache.org/job/Tika-trunk/ws/trunk/tika-core/target/tika-core-1.3-SNAPSHOT.jar>
to /home/jenkins/jenkins-slave/maven-repositories/0/org/apache/tika/tika-core/1.3-SNAPSHOT/tika-core-1.3-SNAPSHOT.jar
>>>
>>> [INFO]
>>> [INFO] --- maven-install-plugin:2.3.1:install (default-install) @ tika-core ---
>>> [INFO] Installing <https://builds.apache.org/job/Tika-trunk/ws/trunk/tika-core/pom.xml>
to /home/jenkins/jenkins-slave/maven-repositories/0/org/apache/tika/tika-core/1.3-SNAPSHOT/tika-core-1.3-SNAPSHOT.pom
>>> mojoSucceeded org.apache.maven.plugins:maven-install-plugin:2.3.1(default-install)
>>> mojoStarted org.apache.felix:maven-bundle-plugin:2.3.4(default-install)[INFO]
Local OBR update disabled (enable with -DobrRepository)
>>>
>>> [INFO]
>>> [INFO] --- maven-bundle-plugin:2.3.4:install (default-install) @ tika-core ---
>>> mojoSucceeded org.apache.felix:maven-bundle-plugin:2.3.4(default-install)
>>> mojoStarted org.apache.maven.plugins:maven-deploy-plugin:2.6(default-deploy)Downloading:
https://repository.apache.org/content/repositories/snapshots/org/apache/tika/tika-core/1.3-SNAPSHOT/maven-metadata.xml
>>>
>>> [INFO]
>>> [INFO] --- maven-deploy-plugin:2.6:deploy (default-deploy) @ tika-core ---
>>> Downloaded: https://repository.apache.org/content/repositories/snapshots/org/apache/tika/tika-core/1.3-SNAPSHOT/maven-metadata.xml
(771 B at 1.9 KB/sec)
>>> Uploading: https://repository.apache.org/content/repositories/snapshots/org/apache/tika/tika-core/1.3-SNAPSHOT/tika-core-1.3-20121029.020351-33.jar
>>> Uploaded: https://repository.apache.org/content/repositories/snapshots/org/apache/tika/tika-core/1.3-SNAPSHOT/tika-core-1.3-20121029.020351-33.jar
(454 KB at 406.0 KB/sec)
>>> Uploading: https://repository.apache.org/content/repositories/snapshots/org/apache/tika/tika-core/1.3-SNAPSHOT/tika-core-1.3-20121029.020351-33.pom
>>> Uploaded: https://repository.apache.org/content/repositories/snapshots/org/apache/tika/tika-core/1.3-SNAPSHOT/tika-core-1.3-20121029.020351-33.pom
(5 KB at 32.1 KB/sec)
>>> Downloading: https://repository.apache.org/content/repositories/snapshots/org/apache/tika/tika-core/maven-metadata.xml
>>> Downloaded: https://repository.apache.org/content/repositories/snapshots/org/apache/tika/tika-core/maven-metadata.xml
(340 B at 1.6 KB/sec)
>>> Uploading: https://repository.apache.org/content/repositories/snapshots/org/apache/tika/tika-core/1.3-SNAPSHOT/maven-metadata.xml
>>> Uploaded: https://repository.apache.org/content/repositories/snapshots/org/apache/tika/tika-core/1.3-SNAPSHOT/maven-metadata.xml
(771 B at 3.2 KB/sec)
>>> Uploading: https://repository.apache.org/content/repositories/snapshots/org/apache/tika/tika-core/maven-metadata.xml
>>> Uploaded: https://repository.apache.org/content/repositories/snapshots/org/apache/tika/tika-core/maven-metadata.xml
(340 B at 1.7 KB/sec)
>>> mojoSucceeded org.apache.maven.plugins:maven-deploy-plugin:2.6(default-deploy)
>>> mojoStarted org.apache.felix:maven-bundle-plugin:2.3.4(default-deploy)[INFO]
Remote OBR update disabled (enable with -DremoteOBR)
>>>
>>> [INFO]
>>> [INFO] --- maven-bundle-plugin:2.3.4:deploy (default-deploy) @ tika-core ---
>>> mojoSucceeded org.apache.felix:maven-bundle-plugin:2.3.4(default-deploy)
>>> projectSucceeded org.apache.tika:tika-core:1.3-SNAPSHOT
>>> projectStarted org.apache.tika:tika-parsers:1.3-SNAPSHOT
>>> [INFO]
>>> [INFO] ------------------------------------------------------------------------
>>> [INFO] Building Apache Tika parsers 1.3-SNAPSHOT
>>> [INFO] ------------------------------------------------------------------------
>>> [INFO] Deleting <https://builds.apache.org/job/Tika-trunk/ws/trunk/tika-parsers/target>
>>> mojoStarted org.apache.maven.plugins:maven-clean-plugin:2.4.1(default-clean)
>>> [INFO]
>>> [INFO] --- maven-clean-plugin:2.4.1:clean (default-clean) @ tika-parsers ---
>>> mojoSucceeded org.apache.maven.plugins:maven-clean-plugin:2.4.1(default-clean)
>>> [TASKS] Scanning folder '<https://builds.apache.org/job/Tika-trunk/ws/trunk/tika-parsers'>
for files matching the pattern '**/*.java' - excludes:
>>> [TASKS] Found 209 files to scan for tasks
>>> Found 151 open tasks.
>>> [TASKS] Computing warning deltas based on reference build #933
>>> mojoStarted org.apache.maven.plugins:maven-remote-resources-plugin:1.2.1(default)
>>> [INFO]
>>> [INFO] --- maven-remote-resources-plugin:1.2.1:process (default) @ tika-parsers
---
>>> mojoSucceeded org.apache.maven.plugins:maven-remote-resources-plugin:1.2.1(default)
>>> mojoStarted org.apache.maven.plugins:maven-resources-plugin:2.5(default-resources)[debug]
execute contextualize
>>> [INFO] Using 'UTF-8' encoding to copy filtered resources.
>>> [INFO] Copying 4 resources
>>> [INFO] Copying 3 resources
>>>
>>> [INFO]
>>> [INFO] --- maven-resources-plugin:2.5:resources (default-resources) @ tika-parsers
---
>>> mojoSucceeded org.apache.maven.plugins:maven-resources-plugin:2.5(default-resources)
>>> mojoStarted org.apache.maven.plugins:maven-compiler-plugin:2.3.2(default-compile)
>>> [INFO]
>>> [INFO] --- maven-compiler-plugin:2.3.2:compile (default-compile) @ tika-parsers
---
>>> [INFO] Compiling 133 source files to <https://builds.apache.org/job/Tika-trunk/ws/trunk/tika-parsers/target/classes>
>>> [INFO] -------------------------------------------------------------
>>> [ERROR] COMPILATION ERROR :
>>> [INFO] -------------------------------------------------------------
>>> [ERROR] <https://builds.apache.org/job/Tika-trunk/ws/trunk/tika-parsers/src/main/java/org/apache/tika/parser/image/ImageMetadataExtractor.java>:[446,44]
cannot find symbol
>>> symbol  : method getInstance(java.util.Locale)
>>> location: class java.text.DecimalFormatSymbols
>>> [INFO] 1 error
>>> [INFO] -------------------------------------------------------------
>>> mojoFailed org.apache.maven.plugins:maven-compiler-plugin:2.3.2(default-compile)
>>> projectFailed org.apache.tika:tika-parsers:1.3-SNAPSHOT
>>> sessionEnded
>>> [INFO] ------------------------------------------------------------------------
>>> [INFO] Reactor Summary:
>>> [INFO]
>>> [INFO] Apache Tika parent ................................ SUCCESS [33.992s]
>>> [INFO] Apache Tika core .................................. SUCCESS [39.106s]
>>> [INFO] Apache Tika parsers ............................... FAILURE [24.686s]
>>> [INFO] Apache Tika XMP ................................... SKIPPED
>>> [INFO] Apache Tika application ........................... SKIPPED
>>> [INFO] Apache Tika OSGi bundle ........................... SKIPPED
>>> [INFO] Apache Tika server ................................ SKIPPED
>>> [INFO] Apache Tika ....................................... SKIPPED
>>> [INFO] ------------------------------------------------------------------------
>>> [INFO] BUILD FAILURE
>>> [INFO] ------------------------------------------------------------------------
>>> [INFO] Total time: 1:41.565s
>>> [INFO] Finished at: Mon Oct 29 02:04:19 UTC 2012
>>> [INFO] Final Memory: 33M/260M
>>> [INFO] ------------------------------------------------------------------------
>>> Projects to build: [MavenProject: org.apache.tika:tika-parent:1.3-SNAPSHOT @
<https://builds.apache.org/job/Tika-trunk/ws/trunk/tika-parent/pom.xml,> MavenProject:
org.apache.tika:tika-core:1.3-SNAPSHOT @ <https://builds.apache.org/job/Tika-trunk/ws/trunk/tika-core/pom.xml,>
MavenProject: org.apache.tika:tika-parsers:1.3-SNAPSHOT @ <https://builds.apache.org/job/Tika-trunk/ws/trunk/tika-parsers/pom.xml,>
MavenProject: org.apache.tika:tika-xmp:1.3-SNAPSHOT @ <https://builds.apache.org/job/Tika-trunk/ws/trunk/tika-xmp/pom.xml,>
MavenProject: org.apache.tika:tika-app:1.3-SNAPSHOT @ <https://builds.apache.org/job/Tika-trunk/ws/trunk/tika-app/pom.xml,>
MavenProject: org.apache.tika:tika-bundle:1.3-SNAPSHOT @ <https://builds.apache.org/job/Tika-trunk/ws/trunk/tika-bundle/pom.xml,>
MavenProject: org.apache.tika:tika-server:1.3-SNAPSHOT @ <https://builds.apache.org/job/Tika-trunk/ws/trunk/tika-server/pom.xml,>
MavenProject: org.apache.tika:tika:1.3-SNAPSHOT @ <https://builds.apache.org/job/Tika-trunk/ws/trunk/pom.xml]>
>>> [JENKINS] Archiving <https://builds.apache.org/job/Tika-trunk/ws/trunk/pom.xml>
to /home/hudson/hudson/jobs/Tika-trunk/modules/org.apache.tika$tika/builds/2012-10-29_02-02-13/archive/org.apache.tika/tika/1.3-SNAPSHOT/tika-1.3-SNAPSHOT.pom
>>> [JENKINS] Archiving <https://builds.apache.org/job/Tika-trunk/ws/trunk/tika-parent/pom.xml>
to /home/hudson/hudson/jobs/Tika-trunk/modules/org.apache.tika$tika-parent/builds/2012-10-29_02-02-13/archive/org.apache.tika/tika-parent/1.3-SNAPSHOT/tika-parent-1.3-SNAPSHOT.pom
>>> [JENKINS] Archiving <https://builds.apache.org/job/Tika-trunk/ws/trunk/tika-parsers/pom.xml>
to /home/hudson/hudson/jobs/Tika-trunk/modules/org.apache.tika$tika-parsers/builds/2012-10-29_02-02-13/archive/org.apache.tika/tika-parsers/1.3-SNAPSHOT/tika-parsers-1.3-SNAPSHOT.pom
>>> [JENKINS] Archiving <https://builds.apache.org/job/Tika-trunk/ws/trunk/tika-xmp/pom.xml>
to /home/hudson/hudson/jobs/Tika-trunk/modules/org.apache.tika$tika-xmp/builds/2012-10-29_02-02-13/archive/org.apache.tika/tika-xmp/1.3-SNAPSHOT/tika-xmp-1.3-SNAPSHOT.pom
>>> [JENKINS] Archiving <https://builds.apache.org/job/Tika-trunk/ws/trunk/tika-app/pom.xml>
to /home/hudson/hudson/jobs/Tika-trunk/modules/org.apache.tika$tika-app/builds/2012-10-29_02-02-13/archive/org.apache.tika/tika-app/1.3-SNAPSHOT/tika-app-1.3-SNAPSHOT.pom
>>> [JENKINS] Archiving <https://builds.apache.org/job/Tika-trunk/ws/trunk/tika-server/pom.xml>
to /home/hudson/hudson/jobs/Tika-trunk/modules/org.apache.tika$tika-server/builds/2012-10-29_02-02-13/archive/org.apache.tika/tika-server/1.3-SNAPSHOT/tika-server-1.3-SNAPSHOT.pom
>>> [JENKINS] Archiving <https://builds.apache.org/job/Tika-trunk/ws/trunk/tika-core/pom.xml>
to /home/hudson/hudson/jobs/Tika-trunk/modules/org.apache.tika$tika-core/builds/2012-10-29_02-02-13/archive/org.apache.tika/tika-core/1.3-SNAPSHOT/tika-core-1.3-SNAPSHOT.pom
>>> [JENKINS] Archiving <https://builds.apache.org/job/Tika-trunk/ws/trunk/tika-core/target/tika-core-1.3-SNAPSHOT.jar>
to /home/hudson/hudson/jobs/Tika-trunk/modules/org.apache.tika$tika-core/builds/2012-10-29_02-02-13/archive/org.apache.tika/tika-core/1.3-20121029.020351-33/tika-core-1.3-20121029.020351-33.jar
>>> [JENKINS] Archiving <https://builds.apache.org/job/Tika-trunk/ws/trunk/tika-bundle/pom.xml>
to /home/hudson/hudson/jobs/Tika-trunk/modules/org.apache.tika$tika-bundle/builds/2012-10-29_02-02-13/archive/org.apache.tika/tika-bundle/1.3-SNAPSHOT/tika-bundle-1.3-SNAPSHOT.pom
>>> Waiting for Jenkins to finish collecting data
>>> mavenExecutionResult exceptions not empty
>>> message : Failed to execute goal org.apache.maven.plugins:maven-compiler-plugin:2.3.2:compile
(default-compile) on project tika-parsers: Compilation failure
>>> <https://builds.apache.org/job/Tika-trunk/ws/trunk/tika-parsers/src/main/java/org/apache/tika/parser/image/ImageMetadataExtractor.java>:[446,44]
cannot find symbol
>>> symbol  : method getInstance(java.util.Locale)
>>> location: class java.text.DecimalFormatSymbols
>>>
>>> cause : Compilation failure
>>> <https://builds.apache.org/job/Tika-trunk/ws/trunk/tika-parsers/src/main/java/org/apache/tika/parser/image/ImageMetadataExtractor.java>:[446,44]
cannot find symbol
>>> symbol  : method getInstance(java.util.Locale)
>>> location: class java.text.DecimalFormatSymbols
>>>
>>> Stack trace :
>>> org.apache.maven.lifecycle.LifecycleExecutionException: Failed to execute goal
org.apache.maven.plugins:maven-compiler-plugin:2.3.2:compile (default-compile) on project
tika-parsers: Compilation failure
>>> <https://builds.apache.org/job/Tika-trunk/ws/trunk/tika-parsers/src/main/java/org/apache/tika/parser/image/ImageMetadataExtractor.java>:[446,44]
cannot find symbol
>>> symbol  : method getInstance(java.util.Locale)
>>> location: class java.text.DecimalFormatSymbols
>>>
>>>        at org.apache.maven.lifecycle.internal.MojoExecutor.execute(MojoExecutor.java:213)
>>>        at org.apache.maven.lifecycle.internal.MojoExecutor.execute(MojoExecutor.java:153)
>>>        at org.apache.maven.lifecycle.internal.MojoExecutor.execute(MojoExecutor.java:145)
>>>        at org.apache.maven.lifecycle.internal.LifecycleModuleBuilder.buildProject(LifecycleModuleBuilder.java:84)
>>>        at org.apache.maven.lifecycle.internal.LifecycleModuleBuilder.buildProject(LifecycleModuleBuilder.java:59)
>>>        at org.apache.maven.lifecycle.internal.LifecycleStarter.singleThreadedBuild(LifecycleStarter.java:183)
>>>        at org.apache.maven.lifecycle.internal.LifecycleStarter.execute(LifecycleStarter.java:161)
>>>        at org.apache.maven.DefaultMaven.doExecute(DefaultMaven.java:319)
>>>        at org.apache.maven.DefaultMaven.execute(DefaultMaven.java:156)
>>>        at org.jvnet.hudson.maven3.launcher.Maven3Launcher.main(Maven3Launcher.java:79)
>>>        at sun.reflect.NativeMethodAccessorImpl.invoke0(Native Method)
>>>        at sun.reflect.NativeMethodAccessorImpl.invoke(NativeMethodAccessorImpl.java:39)
>>>        at sun.reflect.DelegatingMethodAccessorImpl.invoke(DelegatingMethodAccessorImpl.java:25)
>>>        at java.lang.reflect.Method.invoke(Method.java:592)
>>>        at org.codehaus.plexus.classworlds.launcher.Launcher.launchStandard(Launcher.java:329)
>>>        at org.codehaus.plexus.classworlds.launcher.Launcher.launch(Launcher.java:239)
>>>        at org.jvnet.hudson.maven3.agent.Maven3Main.launch(Maven3Main.java:158)
>>>        at hudson.maven.Maven3Builder.call(Maven3Builder.java:98)
>>>        at hudson.maven.Maven3Builder.call(Maven3Builder.java:64)
>>>        at hudson.remoting.UserRequest.perform(UserRequest.java:118)
>>>        at hudson.remoting.UserRequest.perform(UserRequest.java:48)
>>>        at hudson.remoting.Request$2.run(Request.java:326)
>>>        at hudson.remoting.InterceptingExecutorService$1.call(InterceptingExecutorService.java:72)
>>>        at java.util.concurrent.FutureTask$Sync.innerRun(FutureTask.java:269)
>>>        at java.util.concurrent.FutureTask.run(FutureTask.java:123)
>>>        at java.util.concurrent.ThreadPoolExecutor$Worker.runTask(ThreadPoolExecutor.java:651)
>>>        at java.util.concurrent.ThreadPoolExecutor$Worker.run(ThreadPoolExecutor.java:676)
>>>        at java.lang.Thread.run(Thread.java:595)
>>> Caused by: org.apache.maven.plugin.CompilationFailureException: Compilation failure
>>> <https://builds.apache.org/job/Tika-trunk/ws/trunk/tika-parsers/src/main/java/org/apache/tika/parser/image/ImageMetadataExtractor.java>:[446,44]
cannot find symbol
>>> symbol  : method getInstance(java.util.Locale)
>>> location: class java.text.DecimalFormatSymbols
>>>
>>>        at org.apache.maven.plugin.AbstractCompilerMojo.execute(AbstractCompilerMojo.java:656)
>>>        at org.apache.maven.plugin.CompilerMojo.execute(CompilerMojo.java:128)
>>>        at org.apache.maven.plugin.DefaultBuildPluginManager.executeMojo(DefaultBuildPluginManager.java:101)
>>>        at org.apache.maven.lifecycle.internal.MojoExecutor.execute(MojoExecutor.java:209)
>>>        ... 27 more
>>> channel stopped
>

Mime
View raw message