tika-dev mailing list archives

Site index · List index
Message view « Date » · « Thread »
Top « Date » · « Thread »
From Apache Jenkins Server <jenk...@builds.apache.org>
Subject Build failed in Jenkins: Tika-trunk #974
Date Mon, 04 Feb 2013 19:11:11 GMT
See <https://builds.apache.org/job/Tika-trunk/974/changes>

Changes:

[nick] FileMaker Pro mime entry from Marco Quaranta from TIKA-1061

[nick] Support tika:link and tika:uti mimetype extensions, along with unit tests. Modified
version of the patch from TIKA-1012

[nick] TIKA-1076 Upgrade to Apache POI 3.9. Commit disables some HSLF related unit test checks,
they need re-enabling along with a fix soon

------------------------------------------
[...truncated 851 lines...]
[INFO] Installing <https://builds.apache.org/job/Tika-trunk/ws/trunk/tika-app/pom.xml>
to /home/jenkins/jenkins-slave/maven-repositories/1/org/apache/tika/tika-app/1.4-SNAPSHOT/tika-app-1.4-SNAPSHOT.pom
mojoSucceeded org.apache.maven.plugins:maven-install-plugin:2.3.1(default-install)
mojoStarted org.apache.maven.plugins:maven-deploy-plugin:2.6(default-deploy)
[INFO] 
Downloading: https://repository.apache.org/content/repositories/snapshots/org/apache/tika/tika-app/1.4-SNAPSHOT/maven-metadata.xml
[INFO] --- maven-deploy-plugin:2.6:deploy (default-deploy) @ tika-app ---
Downloaded: https://repository.apache.org/content/repositories/snapshots/org/apache/tika/tika-app/1.4-SNAPSHOT/maven-metadata.xml
(767 B at 3.2 KB/sec)
Uploading: https://repository.apache.org/content/repositories/snapshots/org/apache/tika/tika-app/1.4-SNAPSHOT/tika-app-1.4-20130204.191027-7.jar
Uploaded: https://repository.apache.org/content/repositories/snapshots/org/apache/tika/tika-app/1.4-SNAPSHOT/tika-app-1.4-20130204.191027-7.jar
(27284 KB at 24425.7 KB/sec)
Uploading: https://repository.apache.org/content/repositories/snapshots/org/apache/tika/tika-app/1.4-SNAPSHOT/tika-app-1.4-20130204.191027-7.pom
Uploaded: https://repository.apache.org/content/repositories/snapshots/org/apache/tika/tika-app/1.4-SNAPSHOT/tika-app-1.4-20130204.191027-7.pom
(8 KB at 125.1 KB/sec)
Downloading: https://repository.apache.org/content/repositories/snapshots/org/apache/tika/tika-app/maven-metadata.xml
Downloaded: https://repository.apache.org/content/repositories/snapshots/org/apache/tika/tika-app/maven-metadata.xml
(339 B at 1.1 KB/sec)
Uploading: https://repository.apache.org/content/repositories/snapshots/org/apache/tika/tika-app/1.4-SNAPSHOT/maven-metadata.xml
Uploaded: https://repository.apache.org/content/repositories/snapshots/org/apache/tika/tika-app/1.4-SNAPSHOT/maven-metadata.xml
(767 B at 10.7 KB/sec)
Uploading: https://repository.apache.org/content/repositories/snapshots/org/apache/tika/tika-app/maven-metadata.xml
Uploaded: https://repository.apache.org/content/repositories/snapshots/org/apache/tika/tika-app/maven-metadata.xml
(339 B at 0.6 KB/sec)
mojoSucceeded org.apache.maven.plugins:maven-deploy-plugin:2.6(default-deploy)
projectSucceeded org.apache.tika:tika-app:1.4-SNAPSHOT
projectStarted org.apache.tika:tika-bundle:1.4-SNAPSHOT
[INFO]                                                                         
[INFO] ------------------------------------------------------------------------
[INFO] Building Apache Tika OSGi bundle 1.4-SNAPSHOT
[INFO] ------------------------------------------------------------------------
mojoStarted org.apache.maven.plugins:maven-clean-plugin:2.4.1(default-clean)[INFO] Deleting
<https://builds.apache.org/job/Tika-trunk/ws/trunk/tika-bundle/target>

[INFO] 
[INFO] --- maven-clean-plugin:2.4.1:clean (default-clean) @ tika-bundle ---
mojoSucceeded org.apache.maven.plugins:maven-clean-plugin:2.4.1(default-clean)
[TASKS] Scanning folder '<https://builds.apache.org/job/Tika-trunk/ws/trunk/tika-bundle'>
for files matching the pattern '**/*.java' - excludes: 
[TASKS] Found 1 files to scan for tasks
Found 0 open tasks.
[TASKS] Computing warning deltas based on reference build #973
mojoStarted org.apache.maven.plugins:maven-remote-resources-plugin:1.2.1(default)
[INFO] 
[INFO] --- maven-remote-resources-plugin:1.2.1:process (default) @ tika-bundle ---
mojoSucceeded org.apache.maven.plugins:maven-remote-resources-plugin:1.2.1(default)
[debug] execute contextualize
mojoStarted org.apache.maven.plugins:maven-resources-plugin:2.5(default-resources)[INFO] Using
'UTF-8' encoding to copy filtered resources.
[INFO] skip non existing resourceDirectory <https://builds.apache.org/job/Tika-trunk/ws/trunk/tika-bundle/src/main/resources>
[INFO] Copying 3 resources

[INFO] 
[INFO] --- maven-resources-plugin:2.5:resources (default-resources) @ tika-bundle ---
mojoSucceeded org.apache.maven.plugins:maven-resources-plugin:2.5(default-resources)
[INFO] No sources to compile
mojoStarted org.apache.maven.plugins:maven-compiler-plugin:2.3.2(default-compile)
[INFO] 
[INFO] --- maven-compiler-plugin:2.3.2:compile (default-compile) @ tika-bundle ---
mojoSucceeded org.apache.maven.plugins:maven-compiler-plugin:2.3.2(default-compile)
[debug] execute contextualize
[INFO] Using 'UTF-8' encoding to copy filtered resources.
mojoStarted org.apache.maven.plugins:maven-resources-plugin:2.5(default-testResources)[INFO]
Copying 1 resource
[INFO] Copying 3 resources

[INFO] 
[INFO] --- maven-resources-plugin:2.5:testResources (default-testResources) @ tika-bundle
---
mojoSucceeded org.apache.maven.plugins:maven-resources-plugin:2.5(default-testResources)
mojoStarted org.apache.maven.plugins:maven-compiler-plugin:2.3.2(default-testCompile)
[INFO] 
[INFO] --- maven-compiler-plugin:2.3.2:testCompile (default-testCompile) @ tika-bundle ---
[INFO] Compiling 1 source file to <https://builds.apache.org/job/Tika-trunk/ws/trunk/tika-bundle/target/test-classes>
mojoSucceeded org.apache.maven.plugins:maven-compiler-plugin:2.3.2(default-testCompile)
mojoStarted org.apache.maven.plugins:maven-surefire-plugin:2.12(default-test)[INFO] Surefire
report directory: <https://builds.apache.org/job/Tika-trunk/ws/trunk/tika-bundle/target/surefire-reports>

[INFO] 

-------------------------------------------------------
 T E S T S
-------------------------------------------------------
[INFO] --- maven-surefire-plugin:2.12:test (default-test) @ tika-bundle ---

Results :

Tests run: 0, Failures: 0, Errors: 0, Skipped: 0

mojoSucceeded org.apache.maven.plugins:maven-surefire-plugin:2.12(default-test)
[JENKINS] Recording test results
mojoStarted org.apache.maven.plugins:maven-dependency-plugin:2.1(default)
[INFO] 
[INFO] --- maven-dependency-plugin:2.1:unpack-dependencies (default) @ tika-bundle ---
[INFO] Unpacking /home/jenkins/jenkins-slave/maven-repositories/1/edu/ucar/netcdf/4.2-min/netcdf-4.2-min.jar
to
  <https://builds.apache.org/job/Tika-trunk/ws/trunk/tika-bundle/target/classes>
   with includes null and excludes:ucar/nc2/iosp/fysat/Fysat*.class,
                ucar/nc2/dataset/transform/VOceanSG1*class,
                ucar/unidata/geoloc/vertical/OceanSG*.class,
                META-INF/**,CHANGES,README
mojoSucceeded org.apache.maven.plugins:maven-dependency-plugin:2.1(default)
mojoStarted org.apache.felix:maven-bundle-plugin:2.3.4(default-bundle)
[INFO] 
[INFO] --- maven-bundle-plugin:2.3.4:bundle (default-bundle) @ tika-bundle ---
[WARNING] Embed-Dependency: clause "commons-io" did not match any dependencies
mojoSucceeded org.apache.felix:maven-bundle-plugin:2.3.4(default-bundle)
mojoStarted org.apache.maven.plugins:maven-site-plugin:3.0(attach-descriptor)
[INFO] 
[INFO] --- maven-site-plugin:3.0:attach-descriptor (attach-descriptor) @ tika-bundle ---
mojoSucceeded org.apache.maven.plugins:maven-site-plugin:3.0(attach-descriptor)
mojoStarted org.apache.rat:apache-rat-plugin:0.7(default)[INFO] No excludes

[INFO] 
[INFO] --- apache-rat-plugin:0.7:check (default) @ tika-bundle ---
mojoSucceeded org.apache.rat:apache-rat-plugin:0.7(default)
[PMD] No report found for mojo check
mojoStarted org.apache.maven.plugins:maven-install-plugin:2.3.1(default-install)[INFO] Installing
<https://builds.apache.org/job/Tika-trunk/ws/trunk/tika-bundle/target/tika-bundle-1.4-SNAPSHOT.jar>
to /home/jenkins/jenkins-slave/maven-repositories/1/org/apache/tika/tika-bundle/1.4-SNAPSHOT/tika-bundle-1.4-SNAPSHOT.jar

[INFO] 
[INFO] --- maven-install-plugin:2.3.1:install (default-install) @ tika-bundle ---
[INFO] Installing <https://builds.apache.org/job/Tika-trunk/ws/trunk/tika-bundle/pom.xml>
to /home/jenkins/jenkins-slave/maven-repositories/1/org/apache/tika/tika-bundle/1.4-SNAPSHOT/tika-bundle-1.4-SNAPSHOT.pom
mojoSucceeded org.apache.maven.plugins:maven-install-plugin:2.3.1(default-install)
mojoStarted org.apache.felix:maven-bundle-plugin:2.3.4(default-install)[INFO] Local OBR update
disabled (enable with -DobrRepository)

[INFO] 
[INFO] --- maven-bundle-plugin:2.3.4:install (default-install) @ tika-bundle ---
mojoSucceeded org.apache.felix:maven-bundle-plugin:2.3.4(default-install)
mojoStarted org.apache.maven.plugins:maven-deploy-plugin:2.6(default-deploy)Downloading: https://repository.apache.org/content/repositories/snapshots/org/apache/tika/tika-bundle/1.4-SNAPSHOT/maven-metadata.xml

[INFO] 
[INFO] --- maven-deploy-plugin:2.6:deploy (default-deploy) @ tika-bundle ---
Downloaded: https://repository.apache.org/content/repositories/snapshots/org/apache/tika/tika-bundle/1.4-SNAPSHOT/maven-metadata.xml
(770 B at 6.5 KB/sec)
Uploading: https://repository.apache.org/content/repositories/snapshots/org/apache/tika/tika-bundle/1.4-SNAPSHOT/tika-bundle-1.4-20130204.191041-7.jar
Uploaded: https://repository.apache.org/content/repositories/snapshots/org/apache/tika/tika-bundle/1.4-SNAPSHOT/tika-bundle-1.4-20130204.191041-7.jar
(22129 KB at 27118.7 KB/sec)
Uploading: https://repository.apache.org/content/repositories/snapshots/org/apache/tika/tika-bundle/1.4-SNAPSHOT/tika-bundle-1.4-20130204.191041-7.pom
Uploaded: https://repository.apache.org/content/repositories/snapshots/org/apache/tika/tika-bundle/1.4-SNAPSHOT/tika-bundle-1.4-20130204.191041-7.pom
(11 KB at 109.5 KB/sec)
Downloading: https://repository.apache.org/content/repositories/snapshots/org/apache/tika/tika-bundle/maven-metadata.xml
Downloaded: https://repository.apache.org/content/repositories/snapshots/org/apache/tika/tika-bundle/maven-metadata.xml
(342 B at 4.2 KB/sec)
Uploading: https://repository.apache.org/content/repositories/snapshots/org/apache/tika/tika-bundle/1.4-SNAPSHOT/maven-metadata.xml
Uploaded: https://repository.apache.org/content/repositories/snapshots/org/apache/tika/tika-bundle/1.4-SNAPSHOT/maven-metadata.xml
(770 B at 12.7 KB/sec)
Uploading: https://repository.apache.org/content/repositories/snapshots/org/apache/tika/tika-bundle/maven-metadata.xml
Uploaded: https://repository.apache.org/content/repositories/snapshots/org/apache/tika/tika-bundle/maven-metadata.xml
(342 B at 2.8 KB/sec)
mojoSucceeded org.apache.maven.plugins:maven-deploy-plugin:2.6(default-deploy)
mojoStarted org.apache.felix:maven-bundle-plugin:2.3.4(default-deploy)[INFO] Remote OBR update
disabled (enable with -DremoteOBR)

[INFO] 
[INFO] --- maven-bundle-plugin:2.3.4:deploy (default-deploy) @ tika-bundle ---
mojoSucceeded org.apache.felix:maven-bundle-plugin:2.3.4(default-deploy)
projectSucceeded org.apache.tika:tika-bundle:1.4-SNAPSHOT
projectStarted org.apache.tika:tika-server:1.4-SNAPSHOT
[INFO]                                                                         
[INFO] ------------------------------------------------------------------------
[INFO] Building Apache Tika server 1.4-SNAPSHOT
[INFO] ------------------------------------------------------------------------
mojoStarted org.apache.maven.plugins:maven-clean-plugin:2.4.1(default-clean)[INFO] Deleting
<https://builds.apache.org/job/Tika-trunk/ws/trunk/tika-server/target>

[INFO] 
[INFO] --- maven-clean-plugin:2.4.1:clean (default-clean) @ tika-server ---
mojoSucceeded org.apache.maven.plugins:maven-clean-plugin:2.4.1(default-clean)
[TASKS] Scanning folder '<https://builds.apache.org/job/Tika-trunk/ws/trunk/tika-server'>
for files matching the pattern '**/*.java' - excludes: 
[TASKS] Found 18 files to scan for tasks
Found 0 open tasks.
[TASKS] Computing warning deltas based on reference build #971
mojoStarted org.apache.maven.plugins:maven-remote-resources-plugin:1.2.1(default)
[INFO] 
[INFO] --- maven-remote-resources-plugin:1.2.1:process (default) @ tika-server ---
mojoSucceeded org.apache.maven.plugins:maven-remote-resources-plugin:1.2.1(default)
[debug] execute contextualize
mojoStarted org.apache.maven.plugins:maven-resources-plugin:2.5(default-resources)[INFO] Using
'UTF-8' encoding to copy filtered resources.

[INFO] 
[INFO] --- maven-resources-plugin:2.5:resources (default-resources) @ tika-server ---
[INFO] Copying 2 resources
[INFO] Copying 3 resources
mojoSucceeded org.apache.maven.plugins:maven-resources-plugin:2.5(default-resources)
mojoStarted org.apache.maven.plugins:maven-compiler-plugin:2.3.2(default-compile)
[INFO] 
[INFO] --- maven-compiler-plugin:2.3.2:compile (default-compile) @ tika-server ---
[INFO] Compiling 12 source files to <https://builds.apache.org/job/Tika-trunk/ws/trunk/tika-server/target/classes>
[INFO] -------------------------------------------------------------
[ERROR] COMPILATION ERROR : 
[INFO] -------------------------------------------------------------
[ERROR] <https://builds.apache.org/job/Tika-trunk/ws/trunk/tika-server/src/main/java/org/apache/tika/server/CSVMessageBodyWriter.java>:[51,3]
method does not override a method from its superclass
[ERROR] <https://builds.apache.org/job/Tika-trunk/ws/trunk/tika-server/src/main/java/org/apache/tika/server/JSONMessageBodyWriter.java>:[51,3]
method does not override a method from its superclass
[INFO] 2 errors 
[INFO] -------------------------------------------------------------
mojoFailed org.apache.maven.plugins:maven-compiler-plugin:2.3.2(default-compile)
projectFailed org.apache.tika:tika-server:1.4-SNAPSHOT
sessionEnded
[INFO] ------------------------------------------------------------------------
[INFO] Reactor Summary:
[INFO] 
[INFO] Apache Tika parent ................................ SUCCESS [11.690s]
[INFO] Apache Tika core .................................. SUCCESS [19.501s]
[INFO] Apache Tika parsers ............................... SUCCESS [40.109s]
[INFO] Apache Tika XMP ................................... SUCCESS [3.888s]
[INFO] Apache Tika application ........................... SUCCESS [15.126s]
[INFO] Apache Tika OSGi bundle ........................... SUCCESS [12.586s]
[INFO] Apache Tika server ................................ FAILURE [2.331s]
[INFO] Apache Tika ....................................... SKIPPED
[INFO] ------------------------------------------------------------------------
[INFO] BUILD FAILURE
[INFO] ------------------------------------------------------------------------
[INFO] Total time: 1:47.564s
[INFO] Finished at: Mon Feb 04 19:10:45 GMT 2013
[INFO] Final Memory: 51M/439M
[INFO] ------------------------------------------------------------------------
Projects to build: [MavenProject: org.apache.tika:tika-parent:1.4-SNAPSHOT @ <https://builds.apache.org/job/Tika-trunk/ws/trunk/tika-parent/pom.xml,>
MavenProject: org.apache.tika:tika-core:1.4-SNAPSHOT @ <https://builds.apache.org/job/Tika-trunk/ws/trunk/tika-core/pom.xml,>
MavenProject: org.apache.tika:tika-parsers:1.4-SNAPSHOT @ <https://builds.apache.org/job/Tika-trunk/ws/trunk/tika-parsers/pom.xml,>
MavenProject: org.apache.tika:tika-xmp:1.4-SNAPSHOT @ <https://builds.apache.org/job/Tika-trunk/ws/trunk/tika-xmp/pom.xml,>
MavenProject: org.apache.tika:tika-app:1.4-SNAPSHOT @ <https://builds.apache.org/job/Tika-trunk/ws/trunk/tika-app/pom.xml,>
MavenProject: org.apache.tika:tika-bundle:1.4-SNAPSHOT @ <https://builds.apache.org/job/Tika-trunk/ws/trunk/tika-bundle/pom.xml,>
MavenProject: org.apache.tika:tika-server:1.4-SNAPSHOT @ <https://builds.apache.org/job/Tika-trunk/ws/trunk/tika-server/pom.xml,>
MavenProject: org.apache.tika:tika:1.4-SNAPSHOT @ <https://builds.apache.org/job/Tika-trunk/ws/trunk/pom.xml]>
[JENKINS] Archiving <https://builds.apache.org/job/Tika-trunk/ws/trunk/pom.xml> to /home/hudson/hudson/jobs/Tika-trunk/modules/org.apache.tika$tika/builds/2013-02-04_19-08-48/archive/org.apache.tika/tika/1.4-SNAPSHOT/tika-1.4-SNAPSHOT.pom
[JENKINS] Archiving <https://builds.apache.org/job/Tika-trunk/ws/trunk/tika-parent/pom.xml>
to /home/hudson/hudson/jobs/Tika-trunk/modules/org.apache.tika$tika-parent/builds/2013-02-04_19-08-48/archive/org.apache.tika/tika-parent/1.4-SNAPSHOT/tika-parent-1.4-SNAPSHOT.pom
[JENKINS] Archiving <https://builds.apache.org/job/Tika-trunk/ws/trunk/tika-parsers/pom.xml>
to /home/hudson/hudson/jobs/Tika-trunk/modules/org.apache.tika$tika-parsers/builds/2013-02-04_19-08-48/archive/org.apache.tika/tika-parsers/1.4-SNAPSHOT/tika-parsers-1.4-SNAPSHOT.pom
[JENKINS] Archiving <https://builds.apache.org/job/Tika-trunk/ws/trunk/tika-parsers/target/tika-parsers-1.4-SNAPSHOT.jar>
to /home/hudson/hudson/jobs/Tika-trunk/modules/org.apache.tika$tika-parsers/builds/2013-02-04_19-08-48/archive/org.apache.tika/tika-parsers/1.4-20130204.191010-7/tika-parsers-1.4-20130204.191010-7.jar
[JENKINS] Archiving <https://builds.apache.org/job/Tika-trunk/ws/trunk/tika-xmp/pom.xml>
to /home/hudson/hudson/jobs/Tika-trunk/modules/org.apache.tika$tika-xmp/builds/2013-02-04_19-08-48/archive/org.apache.tika/tika-xmp/1.4-SNAPSHOT/tika-xmp-1.4-SNAPSHOT.pom
[JENKINS] Archiving <https://builds.apache.org/job/Tika-trunk/ws/trunk/tika-xmp/target/tika-xmp-1.4-SNAPSHOT.jar>
to /home/hudson/hudson/jobs/Tika-trunk/modules/org.apache.tika$tika-xmp/builds/2013-02-04_19-08-48/archive/org.apache.tika/tika-xmp/1.4-20130204.191014-7/tika-xmp-1.4-20130204.191014-7.jar
[JENKINS] Archiving <https://builds.apache.org/job/Tika-trunk/ws/trunk/tika-app/pom.xml>
to /home/hudson/hudson/jobs/Tika-trunk/modules/org.apache.tika$tika-app/builds/2013-02-04_19-08-48/archive/org.apache.tika/tika-app/1.4-SNAPSHOT/tika-app-1.4-SNAPSHOT.pom
[JENKINS] Archiving <https://builds.apache.org/job/Tika-trunk/ws/trunk/tika-app/target/tika-app-1.4-SNAPSHOT.jar>
to /home/hudson/hudson/jobs/Tika-trunk/modules/org.apache.tika$tika-app/builds/2013-02-04_19-08-48/archive/org.apache.tika/tika-app/1.4-20130204.191027-7/tika-app-1.4-20130204.191027-7.jar
[JENKINS] Archiving <https://builds.apache.org/job/Tika-trunk/ws/trunk/tika-server/pom.xml>
to /home/hudson/hudson/jobs/Tika-trunk/modules/org.apache.tika$tika-server/builds/2013-02-04_19-08-48/archive/org.apache.tika/tika-server/1.4-SNAPSHOT/tika-server-1.4-SNAPSHOT.pom
[JENKINS] Archiving <https://builds.apache.org/job/Tika-trunk/ws/trunk/tika-core/pom.xml>
to /home/hudson/hudson/jobs/Tika-trunk/modules/org.apache.tika$tika-core/builds/2013-02-04_19-08-48/archive/org.apache.tika/tika-core/1.4-SNAPSHOT/tika-core-1.4-SNAPSHOT.pom
[JENKINS] Archiving <https://builds.apache.org/job/Tika-trunk/ws/trunk/tika-core/target/tika-core-1.4-SNAPSHOT.jar>
to /home/hudson/hudson/jobs/Tika-trunk/modules/org.apache.tika$tika-core/builds/2013-02-04_19-08-48/archive/org.apache.tika/tika-core/1.4-20130204.190929-7/tika-core-1.4-20130204.190929-7.jar
[JENKINS] Archiving <https://builds.apache.org/job/Tika-trunk/ws/trunk/tika-bundle/pom.xml>
to /home/hudson/hudson/jobs/Tika-trunk/modules/org.apache.tika$tika-bundle/builds/2013-02-04_19-08-48/archive/org.apache.tika/tika-bundle/1.4-SNAPSHOT/tika-bundle-1.4-SNAPSHOT.pom
[JENKINS] Archiving <https://builds.apache.org/job/Tika-trunk/ws/trunk/tika-bundle/target/tika-bundle-1.4-SNAPSHOT.jar>
to /home/hudson/hudson/jobs/Tika-trunk/modules/org.apache.tika$tika-bundle/builds/2013-02-04_19-08-48/archive/org.apache.tika/tika-bundle/1.4-20130204.191041-7/tika-bundle-1.4-20130204.191041-7.jar
Waiting for Jenkins to finish collecting data
mavenExecutionResult exceptions not empty
message : Failed to execute goal org.apache.maven.plugins:maven-compiler-plugin:2.3.2:compile
(default-compile) on project tika-server: Compilation failure
cause : Compilation failure
Stack trace : 
org.apache.maven.lifecycle.LifecycleExecutionException: Failed to execute goal org.apache.maven.plugins:maven-compiler-plugin:2.3.2:compile
(default-compile) on project tika-server: Compilation failure
	at org.apache.maven.lifecycle.internal.MojoExecutor.execute(MojoExecutor.java:213)
	at org.apache.maven.lifecycle.internal.MojoExecutor.execute(MojoExecutor.java:153)
	at org.apache.maven.lifecycle.internal.MojoExecutor.execute(MojoExecutor.java:145)
	at org.apache.maven.lifecycle.internal.LifecycleModuleBuilder.buildProject(LifecycleModuleBuilder.java:84)
	at org.apache.maven.lifecycle.internal.LifecycleModuleBuilder.buildProject(LifecycleModuleBuilder.java:59)
	at org.apache.maven.lifecycle.internal.LifecycleStarter.singleThreadedBuild(LifecycleStarter.java:183)
	at org.apache.maven.lifecycle.internal.LifecycleStarter.execute(LifecycleStarter.java:161)
	at org.apache.maven.DefaultMaven.doExecute(DefaultMaven.java:320)
	at org.apache.maven.DefaultMaven.execute(DefaultMaven.java:156)
	at org.jvnet.hudson.maven3.launcher.Maven3Launcher.main(Maven3Launcher.java:79)
	at sun.reflect.NativeMethodAccessorImpl.invoke0(Native Method)
	at sun.reflect.NativeMethodAccessorImpl.invoke(NativeMethodAccessorImpl.java:39)
	at sun.reflect.DelegatingMethodAccessorImpl.invoke(DelegatingMethodAccessorImpl.java:25)
	at java.lang.reflect.Method.invoke(Method.java:592)
	at org.codehaus.plexus.classworlds.launcher.Launcher.launchStandard(Launcher.java:329)
	at org.codehaus.plexus.classworlds.launcher.Launcher.launch(Launcher.java:239)
	at org.jvnet.hudson.maven3.agent.Maven3Main.launch(Maven3Main.java:158)
	at hudson.maven.Maven3Builder.call(Maven3Builder.java:100)
	at hudson.maven.Maven3Builder.call(Maven3Builder.java:66)
	at hudson.remoting.UserRequest.perform(UserRequest.java:118)
	at hudson.remoting.UserRequest.perform(UserRequest.java:48)
	at hudson.remoting.Request$2.run(Request.java:326)
	at hudson.remoting.InterceptingExecutorService$1.call(InterceptingExecutorService.java:72)
	at java.util.concurrent.FutureTask$Sync.innerRun(FutureTask.java:269)
	at java.util.concurrent.FutureTask.run(FutureTask.java:123)
	at java.util.concurrent.ThreadPoolExecutor$Worker.runTask(ThreadPoolExecutor.java:651)
	at java.util.concurrent.ThreadPoolExecutor$Worker.run(ThreadPoolExecutor.java:676)
	at java.lang.Thread.run(Thread.java:595)
Caused by: org.apache.maven.plugin.CompilationFailureException: Compilation failure
	at org.apache.maven.plugin.AbstractCompilerMojo.execute(AbstractCompilerMojo.java:656)
	at org.apache.maven.plugin.CompilerMojo.execute(CompilerMojo.java:128)
	at org.apache.maven.plugin.DefaultBuildPluginManager.executeMojo(DefaultBuildPluginManager.java:101)
	at org.apache.maven.lifecycle.internal.MojoExecutor.execute(MojoExecutor.java:209)
	... 27 more
channel stopped

Mime
View raw message