tika-dev mailing list archives

Site index · List index
Message view « Date » · « Thread »
Top « Date » · « Thread »
From "Mattmann, Chris A (388J)" <chris.a.mattm...@jpl.nasa.gov>
Subject Re: Build failed in Jenkins: Tika-trunk #977
Date Thu, 07 Feb 2013 19:26:26 GMT
Hey Mike,

Weird. I did notice in the patch for:

https://issues.apache.org/jira/browse/TIKA-1047


That there were some JDK7 stuff -- I went ahead and fixed it to be JDK6
compat and updated the patch and committed that version as I noted in the
issue comments. I wonder if there was something I missed? I'm running JDK6
on my Mac OS X 10.6.8 and all tests are passing locally for me too.

Thoughts?

Cheers,
Chris

On 2/7/13 10:55 AM, "Michael McCandless" <lucene@mikemccandless.com> wrote:

>Hmm it looks like the Tika build is failing on Jenkins due to this:
>
>[ERROR] 
>/home/jenkins/jenkins-slave/workspace/Tika-trunk/trunk/tika-server/src/mai
>n/java/org/apache/tika/server/CSVMessageBodyWriter.java:[51,3]
>method does not override a method from its superclass
>[ERROR] 
>/home/jenkins/jenkins-slave/workspace/Tika-trunk/trunk/tika-server/src/mai
>n/java/org/apache/tika/server/JSONMessageBodyWriter.java:[51,3]
>method does not override a method from its superclass
>
>I think this is from TIKA-1047?  Anyone know what's up?  "mvn test"
>passes for me locally ...
>
>Mike McCandless
>
>http://blog.mikemccandless.com
>
>On Thu, Feb 7, 2013 at 1:03 PM, Apache Jenkins Server
><jenkins@builds.apache.org> wrote:
>> See <https://builds.apache.org/job/Tika-trunk/977/changes>
>>
>> Changes:
>>
>> [mikemccand] TIKA-1053: upgrade to ASM 4.1
>>
>> ------------------------------------------
>> [...truncated 799 lines...]
>> [INFO] Installing
>><https://builds.apache.org/job/Tika-trunk/ws/trunk/tika-app/pom.xml> to
>>/home/jenkins/jenkins-slave/maven-repositories/1/org/apache/tika/tika-app
>>/1.4-SNAPSHOT/tika-app-1.4-SNAPSHOT.pom
>> mojoSucceeded 
>>org.apache.maven.plugins:maven-install-plugin:2.3.1(default-install)
>> mojoStarted 
>>org.apache.maven.plugins:maven-deploy-plugin:2.6(default-deploy)Downloadi
>>ng: 
>>https://repository.apache.org/content/repositories/snapshots/org/apache/t
>>ika/tika-app/1.4-SNAPSHOT/maven-metadata.xml
>>
>> [INFO]
>> [INFO] --- maven-deploy-plugin:2.6:deploy (default-deploy) @ tika-app
>>---
>> Downloaded: 
>>https://repository.apache.org/content/repositories/snapshots/org/apache/t
>>ika/tika-app/1.4-SNAPSHOT/maven-metadata.xml (767 B at 1.5 KB/sec)
>> Uploading: 
>>https://repository.apache.org/content/repositories/snapshots/org/apache/t
>>ika/tika-app/1.4-SNAPSHOT/tika-app-1.4-20130207.175603-9.jar
>> Uploaded: 
>>https://repository.apache.org/content/repositories/snapshots/org/apache/t
>>ika/tika-app/1.4-SNAPSHOT/tika-app-1.4-20130207.175603-9.jar (27582 KB
>>at 3644.5 KB/sec)
>> Uploading: 
>>https://repository.apache.org/content/repositories/snapshots/org/apache/t
>>ika/tika-app/1.4-SNAPSHOT/tika-app-1.4-20130207.175603-9.pom
>> Uploaded: 
>>https://repository.apache.org/content/repositories/snapshots/org/apache/t
>>ika/tika-app/1.4-SNAPSHOT/tika-app-1.4-20130207.175603-9.pom (8 KB at
>>21.7 KB/sec)
>> Downloading: 
>>https://repository.apache.org/content/repositories/snapshots/org/apache/t
>>ika/tika-app/maven-metadata.xml
>> Downloaded: 
>>https://repository.apache.org/content/repositories/snapshots/org/apache/t
>>ika/tika-app/maven-metadata.xml (339 B at 0.8 KB/sec)
>> Uploading: 
>>https://repository.apache.org/content/repositories/snapshots/org/apache/t
>>ika/tika-app/1.4-SNAPSHOT/maven-metadata.xml
>> Uploaded: 
>>https://repository.apache.org/content/repositories/snapshots/org/apache/t
>>ika/tika-app/1.4-SNAPSHOT/maven-metadata.xml (767 B at 2.5 KB/sec)
>> Uploading: 
>>https://repository.apache.org/content/repositories/snapshots/org/apache/t
>>ika/tika-app/maven-metadata.xml
>> Uploaded: 
>>https://repository.apache.org/content/repositories/snapshots/org/apache/t
>>ika/tika-app/maven-metadata.xml (339 B at 0.9 KB/sec)
>> mojoSucceeded 
>>org.apache.maven.plugins:maven-deploy-plugin:2.6(default-deploy)
>> projectSucceeded org.apache.tika:tika-app:1.4-SNAPSHOT
>> projectStarted org.apache.tika:tika-bundle:1.4-SNAPSHOT
>> [INFO]
>> [INFO] 
>>------------------------------------------------------------------------
>> [INFO] Building Apache Tika OSGi bundle 1.4-SNAPSHOT
>> [INFO] 
>>------------------------------------------------------------------------
>> mojoStarted 
>>org.apache.maven.plugins:maven-clean-plugin:2.4.1(default-clean)[INFO]
>>Deleting 
>><https://builds.apache.org/job/Tika-trunk/ws/trunk/tika-bundle/target>
>>
>> [INFO]
>> [INFO] --- maven-clean-plugin:2.4.1:clean (default-clean) @ tika-bundle
>>---
>> mojoSucceeded 
>>org.apache.maven.plugins:maven-clean-plugin:2.4.1(default-clean)
>> [TASKS] Scanning folder
>>'<https://builds.apache.org/job/Tika-trunk/ws/trunk/tika-bundle'> for
>>files matching the pattern '**/*.java' - excludes:
>> [TASKS] Found 1 files to scan for tasks
>> Found 0 open tasks.
>> [TASKS] Computing warning deltas based on reference build #976
>> mojoStarted 
>>org.apache.maven.plugins:maven-remote-resources-plugin:1.2.1(default)
>> [INFO]
>> [INFO] --- maven-remote-resources-plugin:1.2.1:process (default) @
>>tika-bundle ---
>> mojoSucceeded 
>>org.apache.maven.plugins:maven-remote-resources-plugin:1.2.1(default)
>> mojoStarted 
>>org.apache.maven.plugins:maven-resources-plugin:2.5(default-resources)[de
>>bug] execute contextualize
>> [INFO] Using 'UTF-8' encoding to copy filtered resources.
>> [INFO] skip non existing resourceDirectory
>><https://builds.apache.org/job/Tika-trunk/ws/trunk/tika-bundle/src/main/r
>>esources>
>> [INFO] Copying 3 resources
>>
>> [INFO]
>> [INFO] --- maven-resources-plugin:2.5:resources (default-resources) @
>>tika-bundle ---
>> mojoSucceeded 
>>org.apache.maven.plugins:maven-resources-plugin:2.5(default-resources)
>> [INFO] No sources to compile
>> mojoStarted 
>>org.apache.maven.plugins:maven-compiler-plugin:2.3.2(default-compile)
>> [INFO]
>> [INFO] --- maven-compiler-plugin:2.3.2:compile (default-compile) @
>>tika-bundle ---
>> mojoSucceeded 
>>org.apache.maven.plugins:maven-compiler-plugin:2.3.2(default-compile)
>> mojoStarted 
>>org.apache.maven.plugins:maven-resources-plugin:2.5(default-testResources
>>)[debug] execute contextualize
>> [INFO] Using 'UTF-8' encoding to copy filtered resources.
>> [INFO] Copying 1 resource
>> [INFO] Copying 3 resources
>>
>> [INFO]
>> [INFO] --- maven-resources-plugin:2.5:testResources
>>(default-testResources) @ tika-bundle ---
>> mojoSucceeded 
>>org.apache.maven.plugins:maven-resources-plugin:2.5(default-testResources
>>)
>> mojoStarted 
>>org.apache.maven.plugins:maven-compiler-plugin:2.3.2(default-testCompile)
>> [INFO]
>> [INFO] --- maven-compiler-plugin:2.3.2:testCompile
>>(default-testCompile) @ tika-bundle ---
>> [INFO] Compiling 1 source file to
>><https://builds.apache.org/job/Tika-trunk/ws/trunk/tika-bundle/target/tes
>>t-classes>
>> mojoSucceeded 
>>org.apache.maven.plugins:maven-compiler-plugin:2.3.2(default-testCompile)
>> mojoStarted 
>>org.apache.maven.plugins:maven-surefire-plugin:2.12(default-test)[INFO]
>>Surefire report directory:
>><https://builds.apache.org/job/Tika-trunk/ws/trunk/tika-bundle/target/sur
>>efire-reports>
>>
>> -------------------------------------------------------
>>  T E S T S
>> -------------------------------------------------------
>>
>> [INFO]
>> [INFO] --- maven-surefire-plugin:2.12:test (default-test) @ tika-bundle
>>---
>>
>> Results :
>>
>> Tests run: 0, Failures: 0, Errors: 0, Skipped: 0
>>
>> mojoSucceeded 
>>org.apache.maven.plugins:maven-surefire-plugin:2.12(default-test)
>> [JENKINS] Recording test results
>> mojoStarted 
>>org.apache.maven.plugins:maven-dependency-plugin:2.1(default)
>> [INFO]
>> [INFO] --- maven-dependency-plugin:2.1:unpack-dependencies (default) @
>>tika-bundle ---
>> [INFO] Unpacking
>>/home/jenkins/jenkins-slave/maven-repositories/1/edu/ucar/netcdf/4.2-min/
>>netcdf-4.2-min.jar to
>>   
>><https://builds.apache.org/job/Tika-trunk/ws/trunk/tika-bundle/target/cla
>>sses>
>>    with includes null and excludes:ucar/nc2/iosp/fysat/Fysat*.class,
>>                 ucar/nc2/dataset/transform/VOceanSG1*class,
>>                 ucar/unidata/geoloc/vertical/OceanSG*.class,
>>                 META-INF/**,CHANGES,README
>> mojoSucceeded 
>>org.apache.maven.plugins:maven-dependency-plugin:2.1(default)
>> mojoStarted org.apache.felix:maven-bundle-plugin:2.3.4(default-bundle)
>> [INFO]
>> [INFO] --- maven-bundle-plugin:2.3.4:bundle (default-bundle) @
>>tika-bundle ---
>> [WARNING] Embed-Dependency: clause "commons-io" did not match any
>>dependencies
>> mojoSucceeded org.apache.felix:maven-bundle-plugin:2.3.4(default-bundle)
>> mojoStarted 
>>org.apache.maven.plugins:maven-site-plugin:3.0(attach-descriptor)
>> [INFO]
>> [INFO] --- maven-site-plugin:3.0:attach-descriptor (attach-descriptor)
>>@ tika-bundle ---
>> mojoSucceeded 
>>org.apache.maven.plugins:maven-site-plugin:3.0(attach-descriptor)
>> [INFO] No excludes
>> mojoStarted org.apache.rat:apache-rat-plugin:0.7(default)
>> [INFO]
>> [INFO] --- apache-rat-plugin:0.7:check (default) @ tika-bundle ---
>> mojoSucceeded org.apache.rat:apache-rat-plugin:0.7(default)
>> [PMD] No report found for mojo check
>> [INFO] Installing
>><https://builds.apache.org/job/Tika-trunk/ws/trunk/tika-bundle/target/tik
>>a-bundle-1.4-SNAPSHOT.jar> to
>>/home/jenkins/jenkins-slave/maven-repositories/1/org/apache/tika/tika-bun
>>dle/1.4-SNAPSHOT/tika-bundle-1.4-SNAPSHOT.jar
>> mojoStarted 
>>org.apache.maven.plugins:maven-install-plugin:2.3.1(default-install)
>> [INFO]
>> [INFO] --- maven-install-plugin:2.3.1:install (default-install) @
>>tika-bundle ---
>> [INFO] Installing
>><https://builds.apache.org/job/Tika-trunk/ws/trunk/tika-bundle/pom.xml>
>>to 
>>/home/jenkins/jenkins-slave/maven-repositories/1/org/apache/tika/tika-bun
>>dle/1.4-SNAPSHOT/tika-bundle-1.4-SNAPSHOT.pom
>> mojoSucceeded 
>>org.apache.maven.plugins:maven-install-plugin:2.3.1(default-install)
>> [INFO] Local OBR update disabled (enable with -DobrRepository)
>> mojoStarted org.apache.felix:maven-bundle-plugin:2.3.4(default-install)
>> [INFO]
>> [INFO] --- maven-bundle-plugin:2.3.4:install (default-install) @
>>tika-bundle ---
>> mojoSucceeded 
>>org.apache.felix:maven-bundle-plugin:2.3.4(default-install)
>> mojoStarted 
>>org.apache.maven.plugins:maven-deploy-plugin:2.6(default-deploy)Downloadi
>>ng: 
>>https://repository.apache.org/content/repositories/snapshots/org/apache/t
>>ika/tika-bundle/1.4-SNAPSHOT/maven-metadata.xml
>>
>> [INFO]
>> [INFO] --- maven-deploy-plugin:2.6:deploy (default-deploy) @
>>tika-bundle ---
>> Downloaded: 
>>https://repository.apache.org/content/repositories/snapshots/org/apache/t
>>ika/tika-bundle/1.4-SNAPSHOT/maven-metadata.xml (770 B at 2.1 KB/sec)
>> Uploading: 
>>https://repository.apache.org/content/repositories/snapshots/org/apache/t
>>ika/tika-bundle/1.4-SNAPSHOT/tika-bundle-1.4-20130207.175707-9.jar
>> Uploaded: 
>>https://repository.apache.org/content/repositories/snapshots/org/apache/t
>>ika/tika-bundle/1.4-SNAPSHOT/tika-bundle-1.4-20130207.175707-9.jar
>>(22134 KB at 3715.6 KB/sec)
>> Uploading: 
>>https://repository.apache.org/content/repositories/snapshots/org/apache/t
>>ika/tika-bundle/1.4-SNAPSHOT/tika-bundle-1.4-20130207.175707-9.pom
>> Uploaded: 
>>https://repository.apache.org/content/repositories/snapshots/org/apache/t
>>ika/tika-bundle/1.4-SNAPSHOT/tika-bundle-1.4-20130207.175707-9.pom (11
>>KB at 30.2 KB/sec)
>> Downloading: 
>>https://repository.apache.org/content/repositories/snapshots/org/apache/t
>>ika/tika-bundle/maven-metadata.xml
>> Downloaded: 
>>https://repository.apache.org/content/repositories/snapshots/org/apache/t
>>ika/tika-bundle/maven-metadata.xml (342 B at 1.1 KB/sec)
>> Uploading: 
>>https://repository.apache.org/content/repositories/snapshots/org/apache/t
>>ika/tika-bundle/1.4-SNAPSHOT/maven-metadata.xml
>> Uploaded: 
>>https://repository.apache.org/content/repositories/snapshots/org/apache/t
>>ika/tika-bundle/1.4-SNAPSHOT/maven-metadata.xml (770 B at 2.6 KB/sec)
>> Uploading: 
>>https://repository.apache.org/content/repositories/snapshots/org/apache/t
>>ika/tika-bundle/maven-metadata.xml
>> Uploaded: 
>>https://repository.apache.org/content/repositories/snapshots/org/apache/t
>>ika/tika-bundle/maven-metadata.xml (342 B at 0.9 KB/sec)
>> mojoSucceeded 
>>org.apache.maven.plugins:maven-deploy-plugin:2.6(default-deploy)
>> [INFO] Remote OBR update disabled (enable with -DremoteOBR)
>> mojoStarted org.apache.felix:maven-bundle-plugin:2.3.4(default-deploy)
>> [INFO]
>> [INFO] --- maven-bundle-plugin:2.3.4:deploy (default-deploy) @
>>tika-bundle ---
>> mojoSucceeded org.apache.felix:maven-bundle-plugin:2.3.4(default-deploy)
>> projectSucceeded org.apache.tika:tika-bundle:1.4-SNAPSHOT
>> projectStarted org.apache.tika:tika-server:1.4-SNAPSHOT
>> [INFO]
>> [INFO] 
>>------------------------------------------------------------------------
>> [INFO] Building Apache Tika server 1.4-SNAPSHOT
>> [INFO] 
>>------------------------------------------------------------------------
>> [INFO] Deleting 
>><https://builds.apache.org/job/Tika-trunk/ws/trunk/tika-server/target>
>> mojoStarted 
>>org.apache.maven.plugins:maven-clean-plugin:2.4.1(default-clean)
>> [INFO]
>> [INFO] --- maven-clean-plugin:2.4.1:clean (default-clean) @ tika-server
>>---
>> mojoSucceeded 
>>org.apache.maven.plugins:maven-clean-plugin:2.4.1(default-clean)
>> [TASKS] Scanning folder
>>'<https://builds.apache.org/job/Tika-trunk/ws/trunk/tika-server'> for
>>files matching the pattern '**/*.java' - excludes:
>> [TASKS] Found 18 files to scan for tasks
>> Found 0 open tasks.
>> [TASKS] Computing warning deltas based on reference build #971
>> mojoStarted 
>>org.apache.maven.plugins:maven-remote-resources-plugin:1.2.1(default)
>> [INFO]
>> [INFO] --- maven-remote-resources-plugin:1.2.1:process (default) @
>>tika-server ---
>> mojoSucceeded 
>>org.apache.maven.plugins:maven-remote-resources-plugin:1.2.1(default)
>> mojoStarted 
>>org.apache.maven.plugins:maven-resources-plugin:2.5(default-resources)[de
>>bug] execute contextualize
>> [INFO] Using 'UTF-8' encoding to copy filtered resources.
>> [INFO] Copying 2 resources
>> [INFO] Copying 3 resources
>>
>> [INFO]
>> [INFO] --- maven-resources-plugin:2.5:resources (default-resources) @
>>tika-server ---
>> mojoSucceeded 
>>org.apache.maven.plugins:maven-resources-plugin:2.5(default-resources)
>> mojoStarted 
>>org.apache.maven.plugins:maven-compiler-plugin:2.3.2(default-compile)[INF
>>O] Compiling 12 source files to
>><https://builds.apache.org/job/Tika-trunk/ws/trunk/tika-server/target/cla
>>sses>
>>
>> [INFO]
>> [INFO] --- maven-compiler-plugin:2.3.2:compile (default-compile) @
>>tika-server ---
>> [INFO] -------------------------------------------------------------
>> [ERROR] COMPILATION ERROR :
>> [INFO] -------------------------------------------------------------
>> [ERROR] 
>><https://builds.apache.org/job/Tika-trunk/ws/trunk/tika-server/src/main/j
>>ava/org/apache/tika/server/CSVMessageBodyWriter.java>:[51,3] method does
>>not override a method from its superclass
>> [ERROR] 
>><https://builds.apache.org/job/Tika-trunk/ws/trunk/tika-server/src/main/j
>>ava/org/apache/tika/server/JSONMessageBodyWriter.java>:[51,3] method
>>does not override a method from its superclass
>> [INFO] 2 errors
>> [INFO] -------------------------------------------------------------
>> mojoFailed 
>>org.apache.maven.plugins:maven-compiler-plugin:2.3.2(default-compile)
>> projectFailed org.apache.tika:tika-server:1.4-SNAPSHOT
>> sessionEnded
>> [INFO] 
>>------------------------------------------------------------------------
>> [INFO] Reactor Summary:
>> [INFO]
>> [INFO] Apache Tika parent ................................ SUCCESS
>>[38.797s]
>> [INFO] Apache Tika core .................................. SUCCESS
>>[1:25.237s]
>> [INFO] Apache Tika parsers ............................... SUCCESS
>>[3:13.459s]
>> [INFO] Apache Tika XMP ................................... SUCCESS
>>[18.483s]
>> [INFO] Apache Tika application ........................... SUCCESS
>>[1:12.318s]
>> [INFO] Apache Tika OSGi bundle ........................... SUCCESS
>>[1:02.529s]
>> [INFO] Apache Tika server ................................ FAILURE
>>[9.538s]
>> [INFO] Apache Tika ....................................... SKIPPED
>> [INFO] 
>>------------------------------------------------------------------------
>> [INFO] BUILD FAILURE
>> [INFO] 
>>------------------------------------------------------------------------
>> [INFO] Total time: 8:08.879s
>> [INFO] Finished at: Thu Feb 07 17:57:26 UTC 2013
>> [INFO] Final Memory: 41M/305M
>> [INFO] 
>>------------------------------------------------------------------------
>> Projects to build: [MavenProject:
>>org.apache.tika:tika-parent:1.4-SNAPSHOT @
>><https://builds.apache.org/job/Tika-trunk/ws/trunk/tika-parent/pom.xml,>
>>MavenProject: org.apache.tika:tika-core:1.4-SNAPSHOT @
>><https://builds.apache.org/job/Tika-trunk/ws/trunk/tika-core/pom.xml,>
>>MavenProject: org.apache.tika:tika-parsers:1.4-SNAPSHOT @
>><https://builds.apache.org/job/Tika-trunk/ws/trunk/tika-parsers/pom.xml,>
>> MavenProject: org.apache.tika:tika-xmp:1.4-SNAPSHOT @
>><https://builds.apache.org/job/Tika-trunk/ws/trunk/tika-xmp/pom.xml,>
>>MavenProject: org.apache.tika:tika-app:1.4-SNAPSHOT @
>><https://builds.apache.org/job/Tika-trunk/ws/trunk/tika-app/pom.xml,>
>>MavenProject: org.apache.tika:tika-bundle:1.4-SNAPSHOT @
>><https://builds.apache.org/job/Tika-trunk/ws/trunk/tika-bundle/pom.xml,>
>>MavenProject: org.apache.tika:tika-server:1.4-SNAPSHOT @
>><https://builds.apache.org/job/Tika-trunk/ws/trunk/tika-server/pom.xml,>
>>MavenProject: org.apache.tika:tika:1.4-SNAPSHOT @
>><https://builds.apache.org/job/Tika-trunk/ws/trunk/pom.xml]>
>> [JENKINS] Archiving
>><https://builds.apache.org/job/Tika-trunk/ws/trunk/pom.xml> to
>>/home/hudson/hudson/jobs/Tika-trunk/modules/org.apache.tika$tika/builds/2
>>013-02-07_17-48-50/archive/org.apache.tika/tika/1.4-SNAPSHOT/tika-1.4-SNA
>>PSHOT.pom
>> [JENKINS] Archiving
>><https://builds.apache.org/job/Tika-trunk/ws/trunk/tika-parent/pom.xml>
>>to 
>>/home/hudson/hudson/jobs/Tika-trunk/modules/org.apache.tika$tika-parent/b
>>uilds/2013-02-07_17-48-50/archive/org.apache.tika/tika-parent/1.4-SNAPSHO
>>T/tika-parent-1.4-SNAPSHOT.pom
>> [JENKINS] Archiving
>><https://builds.apache.org/job/Tika-trunk/ws/trunk/tika-parsers/pom.xml>
>>to 
>>/home/hudson/hudson/jobs/Tika-trunk/modules/org.apache.tika$tika-parsers/
>>builds/2013-02-07_17-48-50/archive/org.apache.tika/tika-parsers/1.4-SNAPS
>>HOT/tika-parsers-1.4-SNAPSHOT.pom
>> [JENKINS] Archiving
>><https://builds.apache.org/job/Tika-trunk/ws/trunk/tika-parsers/target/ti
>>ka-parsers-1.4-SNAPSHOT.jar> to
>>/home/hudson/hudson/jobs/Tika-trunk/modules/org.apache.tika$tika-parsers/
>>builds/2013-02-07_17-48-50/archive/org.apache.tika/tika-parsers/1.4-20130
>>207.175438-9/tika-parsers-1.4-20130207.175438-9.jar
>> [JENKINS] Archiving
>><https://builds.apache.org/job/Tika-trunk/ws/trunk/tika-xmp/pom.xml> to
>>/home/hudson/hudson/jobs/Tika-trunk/modules/org.apache.tika$tika-xmp/buil
>>ds/2013-02-07_17-48-50/archive/org.apache.tika/tika-xmp/1.4-SNAPSHOT/tika
>>-xmp-1.4-SNAPSHOT.pom
>> [JENKINS] Archiving
>><https://builds.apache.org/job/Tika-trunk/ws/trunk/tika-xmp/target/tika-x
>>mp-1.4-SNAPSHOT.jar> to
>>/home/hudson/hudson/jobs/Tika-trunk/modules/org.apache.tika$tika-xmp/buil
>>ds/2013-02-07_17-48-50/archive/org.apache.tika/tika-xmp/1.4-20130207.1754
>>57-9/tika-xmp-1.4-20130207.175457-9.jar
>> [JENKINS] Archiving
>><https://builds.apache.org/job/Tika-trunk/ws/trunk/tika-app/pom.xml> to
>>/home/hudson/hudson/jobs/Tika-trunk/modules/org.apache.tika$tika-app/buil
>>ds/2013-02-07_17-48-50/archive/org.apache.tika/tika-app/1.4-SNAPSHOT/tika
>>-app-1.4-SNAPSHOT.pom
>> [JENKINS] Archiving
>><https://builds.apache.org/job/Tika-trunk/ws/trunk/tika-app/target/tika-a
>>pp-1.4-SNAPSHOT.jar> to
>>/home/hudson/hudson/jobs/Tika-trunk/modules/org.apache.tika$tika-app/buil
>>ds/2013-02-07_17-48-50/archive/org.apache.tika/tika-app/1.4-20130207.1756
>>03-9/tika-app-1.4-20130207.175603-9.jar
>> [JENKINS] Archiving
>><https://builds.apache.org/job/Tika-trunk/ws/trunk/tika-server/pom.xml>
>>to 
>>/home/hudson/hudson/jobs/Tika-trunk/modules/org.apache.tika$tika-server/b
>>uilds/2013-02-07_17-48-50/archive/org.apache.tika/tika-server/1.4-SNAPSHO
>>T/tika-server-1.4-SNAPSHOT.pom
>> [JENKINS] Archiving
>><https://builds.apache.org/job/Tika-trunk/ws/trunk/tika-core/pom.xml> to
>>/home/hudson/hudson/jobs/Tika-trunk/modules/org.apache.tika$tika-core/bui
>>lds/2013-02-07_17-48-50/archive/org.apache.tika/tika-core/1.4-SNAPSHOT/ti
>>ka-core-1.4-SNAPSHOT.pom
>> [JENKINS] Archiving
>><https://builds.apache.org/job/Tika-trunk/ws/trunk/tika-core/target/tika-
>>core-1.4-SNAPSHOT.jar> to
>>/home/hudson/hudson/jobs/Tika-trunk/modules/org.apache.tika$tika-core/bui
>>lds/2013-02-07_17-48-50/archive/org.apache.tika/tika-core/1.4-20130207.17
>>5124-9/tika-core-1.4-20130207.175124-9.jar
>> [JENKINS] Archiving
>><https://builds.apache.org/job/Tika-trunk/ws/trunk/tika-bundle/pom.xml>
>>to 
>>/home/hudson/hudson/jobs/Tika-trunk/modules/org.apache.tika$tika-bundle/b
>>uilds/2013-02-07_17-48-50/archive/org.apache.tika/tika-bundle/1.4-SNAPSHO
>>T/tika-bundle-1.4-SNAPSHOT.pom
>> [JENKINS] Archiving
>><https://builds.apache.org/job/Tika-trunk/ws/trunk/tika-bundle/target/tik
>>a-bundle-1.4-SNAPSHOT.jar> to
>>/home/hudson/hudson/jobs/Tika-trunk/modules/org.apache.tika$tika-bundle/b
>>uilds/2013-02-07_17-48-50/archive/org.apache.tika/tika-bundle/1.4-2013020
>>7.175707-9/tika-bundle-1.4-20130207.175707-9.jar
>> Waiting for Jenkins to finish collecting data
>> mavenExecutionResult exceptions not empty
>> message : Failed to execute goal
>>org.apache.maven.plugins:maven-compiler-plugin:2.3.2:compile
>>(default-compile) on project tika-server: Compilation failure
>> cause : Compilation failure
>> Stack trace :
>> org.apache.maven.lifecycle.LifecycleExecutionException: Failed to
>>execute goal 
>>org.apache.maven.plugins:maven-compiler-plugin:2.3.2:compile
>>(default-compile) on project tika-server: Compilation failure
>>         at 
>>org.apache.maven.lifecycle.internal.MojoExecutor.execute(MojoExecutor.jav
>>a:213)
>>         at 
>>org.apache.maven.lifecycle.internal.MojoExecutor.execute(MojoExecutor.jav
>>a:153)
>>         at 
>>org.apache.maven.lifecycle.internal.MojoExecutor.execute(MojoExecutor.jav
>>a:145)
>>         at 
>>org.apache.maven.lifecycle.internal.LifecycleModuleBuilder.buildProject(L
>>ifecycleModuleBuilder.java:84)
>>         at 
>>org.apache.maven.lifecycle.internal.LifecycleModuleBuilder.buildProject(L
>>ifecycleModuleBuilder.java:59)
>>         at 
>>org.apache.maven.lifecycle.internal.LifecycleStarter.singleThreadedBuild(
>>LifecycleStarter.java:183)
>>         at 
>>org.apache.maven.lifecycle.internal.LifecycleStarter.execute(LifecycleSta
>>rter.java:161)
>>         at 
>>org.apache.maven.DefaultMaven.doExecute(DefaultMaven.java:320)
>>         at org.apache.maven.DefaultMaven.execute(DefaultMaven.java:156)
>>         at 
>>org.jvnet.hudson.maven3.launcher.Maven3Launcher.main(Maven3Launcher.java:
>>79)
>>         at sun.reflect.NativeMethodAccessorImpl.invoke0(Native Method)
>>         at 
>>sun.reflect.NativeMethodAccessorImpl.invoke(NativeMethodAccessorImpl.java
>>:39)
>>         at 
>>sun.reflect.DelegatingMethodAccessorImpl.invoke(DelegatingMethodAccessorI
>>mpl.java:25)
>>         at java.lang.reflect.Method.invoke(Method.java:592)
>>         at 
>>org.codehaus.plexus.classworlds.launcher.Launcher.launchStandard(Launcher
>>.java:329)
>>         at 
>>org.codehaus.plexus.classworlds.launcher.Launcher.launch(Launcher.java:23
>>9)
>>         at 
>>org.jvnet.hudson.maven3.agent.Maven3Main.launch(Maven3Main.java:158)
>>         at hudson.maven.Maven3Builder.call(Maven3Builder.java:100)
>>         at hudson.maven.Maven3Builder.call(Maven3Builder.java:66)
>>         at hudson.remoting.UserRequest.perform(UserRequest.java:118)
>>         at hudson.remoting.UserRequest.perform(UserRequest.java:48)
>>         at hudson.remoting.Request$2.run(Request.java:326)
>>         at 
>>hudson.remoting.InterceptingExecutorService$1.call(InterceptingExecutorSe
>>rvice.java:72)
>>         at 
>>java.util.concurrent.FutureTask$Sync.innerRun(FutureTask.java:269)
>>         at java.util.concurrent.FutureTask.run(FutureTask.java:123)
>>         at 
>>java.util.concurrent.ThreadPoolExecutor$Worker.runTask(ThreadPoolExecutor
>>.java:651)
>>         at 
>>java.util.concurrent.ThreadPoolExecutor$Worker.run(ThreadPoolExecutor.jav
>>a:676)
>>         at java.lang.Thread.run(Thread.java:595)
>> Caused by: org.apache.maven.plugin.CompilationFailureException:
>>Compilation failure
>>         at 
>>org.apache.maven.plugin.AbstractCompilerMojo.execute(AbstractCompilerMojo
>>.java:656)
>>         at 
>>org.apache.maven.plugin.CompilerMojo.execute(CompilerMojo.java:128)
>>         at 
>>org.apache.maven.plugin.DefaultBuildPluginManager.executeMojo(DefaultBuil
>>dPluginManager.java:101)
>>         at 
>>org.apache.maven.lifecycle.internal.MojoExecutor.execute(MojoExecutor.jav
>>a:209)
>>         ... 27 more
>> channel stopped


Mime
View raw message