tika-dev mailing list archives

Site index · List index
Message view « Date » · « Thread »
Top « Date » · « Thread »
From Apache Jenkins Server <jenk...@builds.apache.org>
Subject Build failed in Jenkins: Tika-trunk #989
Date Sat, 23 Mar 2013 04:48:41 GMT
See <https://builds.apache.org/job/Tika-trunk/989/changes>

Changes:

[mattmann] Patch for TIKA-1096 CompressorParser: Add support for handling concatenated InputStreams
contributed by Gregory Canan.

------------------------------------------
[...truncated 1283 lines...]
Running org.apache.tika.TestRereadableInputStream
Tests run: 3, Failures: 0, Errors: 0, Skipped: 0, Time elapsed: 0.011 sec
Running org.apache.tika.sax.SerializerTest
Tests run: 3, Failures: 0, Errors: 0, Skipped: 0, Time elapsed: 0 sec
Running org.apache.tika.sax.OfflineContentHandlerTest
Tests run: 2, Failures: 0, Errors: 0, Skipped: 0, Time elapsed: 0.035 sec
Running org.apache.tika.sax.SafeContentHandlerTest
Tests run: 6, Failures: 0, Errors: 0, Skipped: 0, Time elapsed: 0 sec
Running org.apache.tika.sax.xpath.XPathParserTest
Tests run: 7, Failures: 0, Errors: 0, Skipped: 0, Time elapsed: 0.001 sec
Running org.apache.tika.sax.BodyContentHandlerTest
Tests run: 1, Failures: 0, Errors: 0, Skipped: 0, Time elapsed: 0 sec
Running org.apache.tika.sax.SecureContentHandlerTest
Tests run: 8, Failures: 0, Errors: 0, Skipped: 0, Time elapsed: 0.196 sec
Running org.apache.tika.sax.XHTMLContentHandlerTest
Tests run: 3, Failures: 0, Errors: 0, Skipped: 0, Time elapsed: 0.001 sec
Running org.apache.tika.sax.LinkContentHandlerTest
Tests run: 2, Failures: 0, Errors: 0, Skipped: 0, Time elapsed: 0 sec
Running org.apache.tika.detect.MagicDetectorTest
Tests run: 8, Failures: 0, Errors: 0, Skipped: 0, Time elapsed: 0.037 sec
Running org.apache.tika.detect.TextDetectorTest
Tests run: 3, Failures: 0, Errors: 0, Skipped: 0, Time elapsed: 0.003 sec
Running org.apache.tika.detect.NameDetectorTest
Tests run: 1, Failures: 0, Errors: 0, Skipped: 0, Time elapsed: 0.001 sec
Running org.apache.tika.detect.TypeDetectorTest
Tests run: 1, Failures: 0, Errors: 0, Skipped: 0, Time elapsed: 0.004 sec
Running org.apache.tika.TikaDetectionTest
Tests run: 1, Failures: 0, Errors: 0, Skipped: 0, Time elapsed: 0.031 sec
Running org.apache.tika.utils.RegexUtilsTest
Tests run: 3, Failures: 0, Errors: 0, Skipped: 0, Time elapsed: 0.003 sec
Running org.apache.tika.utils.CharsetUtilsTest
Tests run: 4, Failures: 0, Errors: 0, Skipped: 0, Time elapsed: 0.084 sec
Running org.apache.tika.mime.MimeDetectionTest
Tests run: 6, Failures: 0, Errors: 0, Skipped: 0, Time elapsed: 0.303 sec
Running org.apache.tika.mime.MediaTypeTest
Tests run: 9, Failures: 0, Errors: 0, Skipped: 0, Time elapsed: 0.009 sec
Running org.apache.tika.mime.MimeTypesReaderTest
Tests run: 6, Failures: 0, Errors: 0, Skipped: 0, Time elapsed: 0.014 sec
Running org.apache.tika.mime.PatternsTest
Tests run: 4, Failures: 0, Errors: 0, Skipped: 0, Time elapsed: 0.001 sec
Running org.apache.tika.fork.ForkParserTest
Tests run: 4, Failures: 0, Errors: 0, Skipped: 0, Time elapsed: 3.422 sec

Results :

Tests run: 129, Failures: 0, Errors: 0, Skipped: 0

[JENKINS] Recording test results
[INFO] 
[INFO] --- maven-bundle-plugin:2.3.4:bundle (default-bundle) @ tika-core ---
[INFO] 
[INFO] --- maven-site-plugin:3.0:attach-descriptor (attach-descriptor) @ tika-core ---
[INFO] 
[INFO] --- maven-failsafe-plugin:2.10:integration-test (default) @ tika-core ---
[INFO] Failsafe report directory: <https://builds.apache.org/job/Tika-trunk/ws/trunk/tika-core/target/failsafe-reports>

-------------------------------------------------------
 T E S T S
-------------------------------------------------------
Running org.apache.tika.TikaIT
Tests run: 1, Failures: 0, Errors: 0, Skipped: 0, Time elapsed: 0.566 sec

Results :

Tests run: 1, Failures: 0, Errors: 0, Skipped: 0

[INFO] 
[INFO] --- apache-rat-plugin:0.7:check (default) @ tika-core ---
[INFO] Exclude: src/test/resources/org/apache/tika/**
[PMD] No report found for mojo check
[INFO] 
[INFO] --- maven-remote-resources-plugin:1.2.1:process (default) @ tika-core ---
[debug] execute contextualize
[INFO] [INFO] Using 'UTF-8' encoding to copy filtered resources.
[INFO] Copying 29 resources
[INFO] Copying 3 resources
[INFO] Copying 3 resources

[INFO] --- maven-resources-plugin:2.5:resources (default-resources) @ tika-core ---
[INFO] 
[INFO] --- maven-compiler-plugin:2.3.2:compile (default-compile) @ tika-core ---
[INFO] Nothing to compile - all classes are up to date
Mar 23, 2013 4:47:45 AM hudson.maven.ExecutedMojo <init>
WARNING: Failed to getClass for org.codehaus.mojo.clirr.ClirrCheckMojo
[PMD] No report found for mojo check
[INFO] 
[INFO] --- clirr-maven-plugin:2.3:check (default) @ tika-core ---
[INFO] Succeeded with 0 errors; 0 warnings; and 0 other changes.
[PMD] No report found for mojo check
[INFO] [INFO] Failsafe report directory: <https://builds.apache.org/job/Tika-trunk/ws/trunk/tika-core/target/failsafe-reports>

[INFO] --- maven-failsafe-plugin:2.10:verify (default) @ tika-core ---
[JENKINS] Recording test results
[INFO] 
[INFO] --- maven-install-plugin:2.3.1:install (default-install) @ tika-core ---
[INFO] Installing <https://builds.apache.org/job/Tika-trunk/ws/trunk/tika-core/target/tika-core-1.4-SNAPSHOT.jar>
to /home/jenkins/jenkins-slave/maven-repositories/1/org/apache/tika/tika-core/1.4-SNAPSHOT/tika-core-1.4-SNAPSHOT.jar
[INFO] Installing <https://builds.apache.org/job/Tika-trunk/ws/trunk/tika-core/pom.xml>
to /home/jenkins/jenkins-slave/maven-repositories/1/org/apache/tika/tika-core/1.4-SNAPSHOT/tika-core-1.4-SNAPSHOT.pom
[INFO] [INFO] Local OBR update disabled (enable with -DobrRepository)

[INFO] --- maven-bundle-plugin:2.3.4:install (default-install) @ tika-core ---
[INFO] 
[INFO] --- maven-deploy-plugin:2.6:deploy (default-deploy) @ tika-core ---
Downloading: https://repository.apache.org/content/repositories/snapshots/org/apache/tika/tika-core/1.4-SNAPSHOT/maven-metadata.xml
Downloaded: https://repository.apache.org/content/repositories/snapshots/org/apache/tika/tika-core/1.4-SNAPSHOT/maven-metadata.xml
(771 B at 1.5 KB/sec)
Uploading: https://repository.apache.org/content/repositories/snapshots/org/apache/tika/tika-core/1.4-SNAPSHOT/tika-core-1.4-20130323.044750-20.jar
Uploaded: https://repository.apache.org/content/repositories/snapshots/org/apache/tika/tika-core/1.4-SNAPSHOT/tika-core-1.4-20130323.044750-20.jar
(478 KB at 842.4 KB/sec)
Uploading: https://repository.apache.org/content/repositories/snapshots/org/apache/tika/tika-core/1.4-SNAPSHOT/tika-core-1.4-20130323.044750-20.pom
Uploaded: https://repository.apache.org/content/repositories/snapshots/org/apache/tika/tika-core/1.4-SNAPSHOT/tika-core-1.4-20130323.044750-20.pom
(5 KB at 14.1 KB/sec)
Downloading: https://repository.apache.org/content/repositories/snapshots/org/apache/tika/tika-core/maven-metadata.xml
Downloaded: https://repository.apache.org/content/repositories/snapshots/org/apache/tika/tika-core/maven-metadata.xml
(340 B at 1.4 KB/sec)
Uploading: https://repository.apache.org/content/repositories/snapshots/org/apache/tika/tika-core/1.4-SNAPSHOT/maven-metadata.xml
Uploaded: https://repository.apache.org/content/repositories/snapshots/org/apache/tika/tika-core/1.4-SNAPSHOT/maven-metadata.xml
(771 B at 2.3 KB/sec)
Uploading: https://repository.apache.org/content/repositories/snapshots/org/apache/tika/tika-core/maven-metadata.xml
Uploaded: https://repository.apache.org/content/repositories/snapshots/org/apache/tika/tika-core/maven-metadata.xml
(340 B at 0.9 KB/sec)
[INFO] [INFO] Remote OBR update disabled (enable with -DremoteOBR)

[INFO] --- maven-bundle-plugin:2.3.4:deploy (default-deploy) @ tika-core ---
[INFO]                                                                         
[INFO] ------------------------------------------------------------------------
[INFO] Building Apache Tika parsers 1.4-SNAPSHOT
[INFO] ------------------------------------------------------------------------
Downloading: http://repo.maven.apache.org/maven2/org/apache/commons/commons-compress/1.5/commons-compress-1.5.pom
Downloaded: http://repo.maven.apache.org/maven2/org/apache/commons/commons-compress/1.5/commons-compress-1.5.pom
(11 KB at 8.9 KB/sec)
Downloading: http://repo.maven.apache.org/maven2/org/tukaani/xz/1.2/xz-1.2.pom
Downloaded: http://repo.maven.apache.org/maven2/org/tukaani/xz/1.2/xz-1.2.pom (2 KB at 13.7
KB/sec)
Downloading: http://repo.maven.apache.org/maven2/org/apache/poi/poi/3.9/poi-3.9.pom
Downloaded: http://repo.maven.apache.org/maven2/org/apache/poi/poi/3.9/poi-3.9.pom (3 KB at
46.8 KB/sec)
Downloading: http://repo.maven.apache.org/maven2/org/apache/poi/poi-scratchpad/3.9/poi-scratchpad-3.9.pom
Downloaded: http://repo.maven.apache.org/maven2/org/apache/poi/poi-scratchpad/3.9/poi-scratchpad-3.9.pom
(3 KB at 6.1 KB/sec)
Downloading: http://repo.maven.apache.org/maven2/org/apache/poi/poi-ooxml/3.9/poi-ooxml-3.9.pom
Downloaded: http://repo.maven.apache.org/maven2/org/apache/poi/poi-ooxml/3.9/poi-ooxml-3.9.pom
(3 KB at 48.1 KB/sec)
Downloading: http://repo.maven.apache.org/maven2/org/apache/poi/poi-ooxml-schemas/3.9/poi-ooxml-schemas-3.9.pom
Downloaded: http://repo.maven.apache.org/maven2/org/apache/poi/poi-ooxml-schemas/3.9/poi-ooxml-schemas-3.9.pom
(3 KB at 11.6 KB/sec)
Downloading: http://repo.maven.apache.org/maven2/org/ow2/asm/asm-debug-all/4.1/asm-debug-all-4.1.pom
Downloaded: http://repo.maven.apache.org/maven2/org/ow2/asm/asm-debug-all/4.1/asm-debug-all-4.1.pom
(2 KB at 4.4 KB/sec)
Downloading: http://repo.maven.apache.org/maven2/org/apache/commons/commons-compress/1.5/commons-compress-1.5.jar
Downloading: http://repo.maven.apache.org/maven2/org/tukaani/xz/1.2/xz-1.2.jar
Downloading: http://repo.maven.apache.org/maven2/org/apache/poi/poi-scratchpad/3.9/poi-scratchpad-3.9.jar
Downloading: http://repo.maven.apache.org/maven2/org/apache/poi/poi/3.9/poi-3.9.jar
Downloading: http://repo.maven.apache.org/maven2/org/apache/poi/poi-ooxml/3.9/poi-ooxml-3.9.jar
Downloaded: http://repo.maven.apache.org/maven2/org/tukaani/xz/1.2/xz-1.2.jar (93 KB at 974.7
KB/sec)
Downloading: http://repo.maven.apache.org/maven2/org/apache/poi/poi-ooxml-schemas/3.9/poi-ooxml-schemas-3.9.jar
Downloaded: http://repo.maven.apache.org/maven2/org/apache/commons/commons-compress/1.5/commons-compress-1.5.jar
(251 KB at 2001.9 KB/sec)
Downloading: http://repo.maven.apache.org/maven2/org/ow2/asm/asm-debug-all/4.1/asm-debug-all-4.1.jar
Downloaded: http://repo.maven.apache.org/maven2/org/apache/poi/poi-ooxml/3.9/poi-ooxml-3.9.jar
(915 KB at 7817.9 KB/sec)
Downloaded: http://repo.maven.apache.org/maven2/org/apache/poi/poi/3.9/poi-3.9.jar (1826 KB
at 12945.4 KB/sec)
Downloaded: http://repo.maven.apache.org/maven2/org/apache/poi/poi-scratchpad/3.9/poi-scratchpad-3.9.jar
(1198 KB at 3393.1 KB/sec)
Downloaded: http://repo.maven.apache.org/maven2/org/apache/poi/poi-ooxml-schemas/3.9/poi-ooxml-schemas-3.9.jar
(4691 KB at 14565.4 KB/sec)
Downloaded: http://repo.maven.apache.org/maven2/org/ow2/asm/asm-debug-all/4.1/asm-debug-all-4.1.jar
(335 KB at 730.6 KB/sec)
[INFO] 
[INFO] --- maven-clean-plugin:2.4.1:clean (default-clean) @ tika-parsers ---
[TASKS] Scanning folder '<https://builds.apache.org/job/Tika-trunk/ws/trunk/tika-parsers'>
for files matching the pattern '**/*.java' - excludes: 
[TASKS] Found 213 files to scan for tasks
Found 155 open tasks.
[TASKS] Computing warning deltas based on reference build #988
[INFO] 
[INFO] --- maven-remote-resources-plugin:1.2.1:process (default) @ tika-parsers ---
[debug] execute contextualize
[INFO] Using 'UTF-8' encoding to copy filtered resources.
[INFO] [INFO] Copying 4 resources
[INFO] Copying 3 resources

[INFO] --- maven-resources-plugin:2.5:resources (default-resources) @ tika-parsers ---
[INFO] 
[INFO] --- maven-compiler-plugin:2.3.2:compile (default-compile) @ tika-parsers ---
[INFO] Compiling 135 source files to <https://builds.apache.org/job/Tika-trunk/ws/trunk/tika-parsers/target/classes>
[INFO] -------------------------------------------------------------
[ERROR] COMPILATION ERROR : 
[INFO] -------------------------------------------------------------
[ERROR] <https://builds.apache.org/job/Tika-trunk/ws/trunk/tika-parsers/src/main/java/org/apache/tika/parser/pkg/CompressorParser.java>:[96,12]
cannot find symbol
symbol  : class CompressorParserOptions
location: class org.apache.tika.parser.pkg.CompressorParser
[ERROR] <https://builds.apache.org/job/Tika-trunk/ws/trunk/tika-parsers/src/main/java/org/apache/tika/parser/pkg/CompressorParser.java>:[97,29]
cannot find symbol
symbol  : class CompressorParserOptions
location: class org.apache.tika.parser.pkg.CompressorParser
[ERROR] <https://builds.apache.org/job/Tika-trunk/ws/trunk/tika-parsers/src/main/java/org/apache/tika/parser/pkg/CompressorParser.java>:[97,64]
cannot find symbol
symbol  : class CompressorParserOptions
location: class org.apache.tika.parser.pkg.CompressorParser
[INFO] 3 errors 
[INFO] -------------------------------------------------------------
[INFO] ------------------------------------------------------------------------
[INFO] Reactor Summary:
[INFO] 
[INFO] Apache Tika parent ................................ SUCCESS [33.121s]
[INFO] Apache Tika core .................................. SUCCESS [58.233s]
[INFO] Apache Tika parsers ............................... FAILURE [32.032s]
[INFO] Apache Tika XMP ................................... SKIPPED
[INFO] Apache Tika application ........................... SKIPPED
[INFO] Apache Tika OSGi bundle ........................... SKIPPED
[INFO] Apache Tika server ................................ SKIPPED
[INFO] Apache Tika ....................................... SKIPPED
[INFO] ------------------------------------------------------------------------
[INFO] BUILD FAILURE
[INFO] ------------------------------------------------------------------------
[INFO] Total time: 2:09.093s
[INFO] Finished at: Sat Mar 23 04:48:25 UTC 2013
[INFO] Final Memory: 40M/367M
[INFO] ------------------------------------------------------------------------
[JENKINS] Archiving <https://builds.apache.org/job/Tika-trunk/ws/trunk/tika-bundle/pom.xml>
to /home/hudson/hudson/jobs/Tika-trunk/modules/org.apache.tika$tika-bundle/builds/2013-03-23_04-45-58/archive/org.apache.tika/tika-bundle/1.4-SNAPSHOT/tika-bundle-1.4-SNAPSHOT.pom
[JENKINS] Archiving <https://builds.apache.org/job/Tika-trunk/ws/trunk/tika-core/pom.xml>
to /home/hudson/hudson/jobs/Tika-trunk/modules/org.apache.tika$tika-core/builds/2013-03-23_04-45-57/archive/org.apache.tika/tika-core/1.4-SNAPSHOT/tika-core-1.4-SNAPSHOT.pom
[JENKINS] Archiving <https://builds.apache.org/job/Tika-trunk/ws/trunk/tika-core/target/tika-core-1.4-SNAPSHOT.jar>
to /home/hudson/hudson/jobs/Tika-trunk/modules/org.apache.tika$tika-core/builds/2013-03-23_04-45-57/archive/org.apache.tika/tika-core/1.4-20130323.044750-20/tika-core-1.4-20130323.044750-20.jar
[JENKINS] Archiving <https://builds.apache.org/job/Tika-trunk/ws/trunk/tika-server/pom.xml>
to /home/hudson/hudson/jobs/Tika-trunk/modules/org.apache.tika$tika-server/builds/2013-03-23_04-45-58/archive/org.apache.tika/tika-server/1.4-SNAPSHOT/tika-server-1.4-SNAPSHOT.pom
[JENKINS] Archiving <https://builds.apache.org/job/Tika-trunk/ws/trunk/pom.xml> to /home/hudson/hudson/jobs/Tika-trunk/modules/org.apache.tika$tika/builds/2013-03-23_04-45-57/archive/org.apache.tika/tika/1.4-SNAPSHOT/tika-1.4-SNAPSHOT.pom
[JENKINS] Archiving <https://builds.apache.org/job/Tika-trunk/ws/trunk/tika-parent/pom.xml>
to /home/hudson/hudson/jobs/Tika-trunk/modules/org.apache.tika$tika-parent/builds/2013-03-23_04-45-57/archive/org.apache.tika/tika-parent/1.4-SNAPSHOT/tika-parent-1.4-SNAPSHOT.pom
[JENKINS] Archiving <https://builds.apache.org/job/Tika-trunk/ws/trunk/tika-xmp/pom.xml>
to /home/hudson/hudson/jobs/Tika-trunk/modules/org.apache.tika$tika-xmp/builds/2013-03-23_04-45-58/archive/org.apache.tika/tika-xmp/1.4-SNAPSHOT/tika-xmp-1.4-SNAPSHOT.pom
[JENKINS] Archiving <https://builds.apache.org/job/Tika-trunk/ws/trunk/tika-parsers/pom.xml>
to /home/hudson/hudson/jobs/Tika-trunk/modules/org.apache.tika$tika-parsers/builds/2013-03-23_04-45-58/archive/org.apache.tika/tika-parsers/1.4-SNAPSHOT/tika-parsers-1.4-SNAPSHOT.pom
[JENKINS] Archiving <https://builds.apache.org/job/Tika-trunk/ws/trunk/tika-app/pom.xml>
to /home/hudson/hudson/jobs/Tika-trunk/modules/org.apache.tika$tika-app/builds/2013-03-23_04-45-58/archive/org.apache.tika/tika-app/1.4-SNAPSHOT/tika-app-1.4-SNAPSHOT.pom
Waiting for Jenkins to finish collecting data
mavenExecutionResult exceptions not empty
message : Failed to execute goal org.apache.maven.plugins:maven-compiler-plugin:2.3.2:compile
(default-compile) on project tika-parsers: Compilation failure
cause : Compilation failure
Stack trace : 
org.apache.maven.lifecycle.LifecycleExecutionException: Failed to execute goal org.apache.maven.plugins:maven-compiler-plugin:2.3.2:compile
(default-compile) on project tika-parsers: Compilation failure
	at org.apache.maven.lifecycle.internal.MojoExecutor.execute(MojoExecutor.java:213)
	at org.apache.maven.lifecycle.internal.MojoExecutor.execute(MojoExecutor.java:153)
	at org.apache.maven.lifecycle.internal.MojoExecutor.execute(MojoExecutor.java:145)
	at org.apache.maven.lifecycle.internal.LifecycleModuleBuilder.buildProject(LifecycleModuleBuilder.java:84)
	at org.apache.maven.lifecycle.internal.LifecycleModuleBuilder.buildProject(LifecycleModuleBuilder.java:59)
	at org.apache.maven.lifecycle.internal.LifecycleStarter.singleThreadedBuild(LifecycleStarter.java:183)
	at org.apache.maven.lifecycle.internal.LifecycleStarter.execute(LifecycleStarter.java:161)
	at org.apache.maven.DefaultMaven.doExecute(DefaultMaven.java:320)
	at org.apache.maven.DefaultMaven.execute(DefaultMaven.java:156)
	at org.jvnet.hudson.maven3.launcher.Maven3Launcher.main(Maven3Launcher.java:79)
	at sun.reflect.NativeMethodAccessorImpl.invoke0(Native Method)
	at sun.reflect.NativeMethodAccessorImpl.invoke(NativeMethodAccessorImpl.java:39)
	at sun.reflect.DelegatingMethodAccessorImpl.invoke(DelegatingMethodAccessorImpl.java:25)
	at java.lang.reflect.Method.invoke(Method.java:597)
	at org.codehaus.plexus.classworlds.launcher.Launcher.launchStandard(Launcher.java:329)
	at org.codehaus.plexus.classworlds.launcher.Launcher.launch(Launcher.java:239)
	at org.jvnet.hudson.maven3.agent.Maven3Main.launch(Maven3Main.java:158)
	at hudson.maven.Maven3Builder.call(Maven3Builder.java:100)
	at hudson.maven.Maven3Builder.call(Maven3Builder.java:66)
	at hudson.remoting.UserRequest.perform(UserRequest.java:118)
	at hudson.remoting.UserRequest.perform(UserRequest.java:48)
	at hudson.remoting.Request$2.run(Request.java:326)
	at hudson.remoting.InterceptingExecutorService$1.call(InterceptingExecutorService.java:72)
	at java.util.concurrent.FutureTask$Sync.innerRun(FutureTask.java:303)
	at java.util.concurrent.FutureTask.run(FutureTask.java:138)
	at java.util.concurrent.ThreadPoolExecutor$Worker.runTask(ThreadPoolExecutor.java:886)
	at java.util.concurrent.ThreadPoolExecutor$Worker.run(ThreadPoolExecutor.java:908)
	at java.lang.Thread.run(Thread.java:662)
Caused by: org.apache.maven.plugin.CompilationFailureException: Compilation failure
	at org.apache.maven.plugin.AbstractCompilerMojo.execute(AbstractCompilerMojo.java:656)
	at org.apache.maven.plugin.CompilerMojo.execute(CompilerMojo.java:128)
	at org.apache.maven.plugin.DefaultBuildPluginManager.executeMojo(DefaultBuildPluginManager.java:101)
	at org.apache.maven.lifecycle.internal.MojoExecutor.execute(MojoExecutor.java:209)
	... 27 more
Sending e-mails to: dev@tika.apache.org
channel stopped

Mime
View raw message