tika-dev mailing list archives

Site index · List index
Message view « Date » · « Thread »
Top « Date » · « Thread »
From "Mattmann, Chris A (388J)" <chris.a.mattm...@jpl.nasa.gov>
Subject Re: Build failed in Jenkins: Tika-trunk » Apache Tika parsers #989
Date Sat, 23 Mar 2013 05:24:54 GMT
Forgot one class in TIKA-1096, should be fixed now.

Cheers,
Chris


On 3/22/13 9:48 PM, "Apache Jenkins Server" <jenkins@builds.apache.org>
wrote:

>See 
><https://builds.apache.org/job/Tika-trunk/org.apache.tika$tika-parsers/989
>/changes>
>
>Changes:
>
>[mattmann] Patch for TIKA-1096 CompressorParser: Add support for handling
>concatenated InputStreams contributed by Gregory Canan.
>
>------------------------------------------
>[INFO]            
>     
>[INFO] 
>------------------------------------------------------------------------
>[INFO] Building Apache Tika parsers 1.4-SNAPSHOT
>[INFO] 
>------------------------------------------------------------------------
>Downloading: 
>http://repo.maven.apache.org/maven2/org/apache/commons/commons-compress/1.
>5/commons-compress-1.5.pom
>Downloaded: 
>http://repo.maven.apache.org/maven2/org/apache/commons/commons-compress/1.
>5/commons-compress-1.5.pom (11 KB at 8.9 KB/sec)
>Downloading: 
>http://repo.maven.apache.org/maven2/org/tukaani/xz/1.2/xz-1.2.pom
>Downloaded: 
>http://repo.maven.apache.org/maven2/org/tukaani/xz/1.2/xz-1.2.pom (2 KB
>at 13.7 KB/sec)
>Downloading: 
>http://repo.maven.apache.org/maven2/org/apache/poi/poi/3.9/poi-3.9.pom
>Downloaded: 
>http://repo.maven.apache.org/maven2/org/apache/poi/poi/3.9/poi-3.9.pom (3
>KB at 46.8 KB/sec)
>Downloading: 
>http://repo.maven.apache.org/maven2/org/apache/poi/poi-scratchpad/3.9/poi-
>scratchpad-3.9.pom
>Downloaded: 
>http://repo.maven.apache.org/maven2/org/apache/poi/poi-scratchpad/3.9/poi-
>scratchpad-3.9.pom (3 KB at 6.1 KB/sec)
>Downloading: 
>http://repo.maven.apache.org/maven2/org/apache/poi/poi-ooxml/3.9/poi-ooxml
>-3.9.pom
>Downloaded: 
>http://repo.maven.apache.org/maven2/org/apache/poi/poi-ooxml/3.9/poi-ooxml
>-3.9.pom (3 KB at 48.1 KB/sec)
>Downloading: 
>http://repo.maven.apache.org/maven2/org/apache/poi/poi-ooxml-schemas/3.9/p
>oi-ooxml-schemas-3.9.pom
>Downloaded: 
>http://repo.maven.apache.org/maven2/org/apache/poi/poi-ooxml-schemas/3.9/p
>oi-ooxml-schemas-3.9.pom (3 KB at 11.6 KB/sec)
>Downloading: 
>http://repo.maven.apache.org/maven2/org/ow2/asm/asm-debug-all/4.1/asm-debu
>g-all-4.1.pom
>Downloaded: 
>http://repo.maven.apache.org/maven2/org/ow2/asm/asm-debug-all/4.1/asm-debu
>g-all-4.1.pom (2 KB at 4.4 KB/sec)
>Downloading: 
>http://repo.maven.apache.org/maven2/org/apache/commons/commons-compress/1.
>5/commons-compress-1.5.jar
>Downloading: 
>http://repo.maven.apache.org/maven2/org/tukaani/xz/1.2/xz-1.2.jar
>Downloading: 
>http://repo.maven.apache.org/maven2/org/apache/poi/poi-scratchpad/3.9/poi-
>scratchpad-3.9.jar
>Downloading: 
>http://repo.maven.apache.org/maven2/org/apache/poi/poi/3.9/poi-3.9.jar
>Downloading: 
>http://repo.maven.apache.org/maven2/org/apache/poi/poi-ooxml/3.9/poi-ooxml
>-3.9.jar
>Downloaded: 
>http://repo.maven.apache.org/maven2/org/tukaani/xz/1.2/xz-1.2.jar (93 KB
>at 974.7 KB/sec)
>Downloading: 
>http://repo.maven.apache.org/maven2/org/apache/poi/poi-ooxml-schemas/3.9/p
>oi-ooxml-schemas-3.9.jar
>Downloaded: 
>http://repo.maven.apache.org/maven2/org/apache/commons/commons-compress/1.
>5/commons-compress-1.5.jar (251 KB at 2001.9 KB/sec)
>Downloading: 
>http://repo.maven.apache.org/maven2/org/ow2/asm/asm-debug-all/4.1/asm-debu
>g-all-4.1.jar
>Downloaded: 
>http://repo.maven.apache.org/maven2/org/apache/poi/poi-ooxml/3.9/poi-ooxml
>-3.9.jar (915 KB at 7817.9 KB/sec)
>Downloaded: 
>http://repo.maven.apache.org/maven2/org/apache/poi/poi/3.9/poi-3.9.jar
>(1826 KB at 12945.4 KB/sec)
>Downloaded: 
>http://repo.maven.apache.org/maven2/org/apache/poi/poi-scratchpad/3.9/poi-
>scratchpad-3.9.jar (1198 KB at 3393.1 KB/sec)
>Downloaded: 
>http://repo.maven.apache.org/maven2/org/apache/poi/poi-ooxml-schemas/3.9/p
>oi-ooxml-schemas-3.9.jar (4691 KB at 14565.4 KB/sec)
>Downloaded: 
>http://repo.maven.apache.org/maven2/org/ow2/asm/asm-debug-all/4.1/asm-debu
>g-all-4.1.jar (335 KB at 730.6 KB/sec)
>[INFO] 
>[INFO] --- maven-clean-plugin:2.4.1:clean (default-clean) @ tika-parsers
>---
>[TASKS] Scanning folder
>'<https://builds.apache.org/job/Tika-trunk/org.apache.tika$tika-parsers/ws
>/'> for files matching the pattern '**/*.java' - excludes:
>[TASKS] Found 213 files to scan for tasks
>Found 155 open tasks.
>[TASKS] Computing warning deltas based on reference build #988
>[INFO] 
>[INFO] --- maven-remote-resources-plugin:1.2.1:process (default) @
>tika-parsers ---
>[debug] execute contextualize
>[INFO] Using 'UTF-8' encoding to copy filtered resources.
>[INFO] [INFO] Copying 4 resources
>[INFO] Copying 3 resources
>
>[INFO] --- maven-resources-plugin:2.5:resources (default-resources) @
>tika-parsers ---
>[INFO] 
>[INFO] --- maven-compiler-plugin:2.3.2:compile (default-compile) @
>tika-parsers ---
>[INFO] Compiling 135 source files to
><https://builds.apache.org/job/Tika-trunk/org.apache.tika$tika-parsers/ws/
>target/classes>
>[INFO] -------------------------------------------------------------
>[ERROR] COMPILATION ERROR :
>[INFO] -------------------------------------------------------------
>[ERROR] 
><https://builds.apache.org/job/Tika-trunk/org.apache.tika$tika-parsers/ws/
>src/main/java/org/apache/tika/parser/pkg/CompressorParser.java>:[96,12]
>cannot find symbol
>symbol  : class CompressorParserOptions
>location: class org.apache.tika.parser.pkg.CompressorParser
>[ERROR] 
><https://builds.apache.org/job/Tika-trunk/org.apache.tika$tika-parsers/ws/
>src/main/java/org/apache/tika/parser/pkg/CompressorParser.java>:[97,29]
>cannot find symbol
>symbol  : class CompressorParserOptions
>location: class org.apache.tika.parser.pkg.CompressorParser
>[ERROR] 
><https://builds.apache.org/job/Tika-trunk/org.apache.tika$tika-parsers/ws/
>src/main/java/org/apache/tika/parser/pkg/CompressorParser.java>:[97,64]
>cannot find symbol
>symbol  : class CompressorParserOptions
>location: class org.apache.tika.parser.pkg.CompressorParser
>[INFO] 3 errors 
>[INFO] -------------------------------------------------------------


Mime
View raw message