tomee-commits mailing list archives

Site index · List index
Message view « Date » · « Thread »
Top « Date » · « Thread »
From "Continuum@vmbuild.apache.org" <openejb-comm...@incubator.apache.org>
Subject [continuum] BUILD FAILURE: OpenEJB :: Server :: Http
Date Tue, 08 May 2007 13:31:16 GMT
Online report : http://vmbuild.apache.org/continuum/servlet/continuum/target/ProjectBuild.vm/view/ProjectBuild/id/167/buildId/139218
Build statistics:
  State: Failed
  Previous State: Failed
  Started at: Tue, 8 May 2007 06:30:59 -0700
  Finished at: Tue, 8 May 2007 06:31:16 -0700
  Total time: 16s
  Build Trigger: Forced
  Exit code: 1
  Building machine hostname: vmbuild.apache.org
  Operating system : Linux(unknown)
  Java version : 1.5.0_06(Sun Microsystems Inc.)

Changes
      No files changed
  
****************************************************************************
Output:
****************************************************************************
[INFO] Scanning for projects...
[INFO] ----------------------------------------------------------------------------
[INFO] Building OpenEJB :: Server :: Http
[INFO]    task-segment: [install]
[INFO] ----------------------------------------------------------------------------
[INFO] [resources:resources]
[INFO] Using default encoding to copy filtered resources.
[INFO] [dependency:copy {execution: copy}]
[INFO] Configured Artifact: org.apache.openejb:openejb-javaagent:3.0-incubating-SNAPSHOT:jar
[INFO] Copying openejb-javaagent-3.0-incubating-SNAPSHOT.jar to /x1/continuum/working-directory/167/target/openejb-javaagent-3.0-incubating-SNAPSHOT.jar
[WARNING] POM for 'org.apache.openejb:openejb-core:pom:3.0-incubating-SNAPSHOT:compile' is
invalid. It will be ignored for artifact resolution. Reason: Failed to validate POM
[WARNING] POM for 'org.apache.openejb:openejb-core:pom:3.0-incubating-SNAPSHOT:compile' is
invalid. It will be ignored for artifact resolution. Reason: Failed to validate POM
[WARNING] POM for 'org.apache.openejb:openejb-core:pom:3.0-incubating-SNAPSHOT:compile' is
invalid. It will be ignored for artifact resolution. Reason: Failed to validate POM
[INFO] [compiler:compile]
[INFO] Nothing to compile - all classes are up to date
[INFO] [resources:testResources]
[INFO] Using default encoding to copy filtered resources.
[WARNING] POM for 'org.apache.openejb:openejb-core:pom:3.0-incubating-SNAPSHOT:compile' is
invalid. It will be ignored for artifact resolution. Reason: Failed to validate POM
[WARNING] POM for 'org.apache.openejb:openejb-core:pom:3.0-incubating-SNAPSHOT:compile' is
invalid. It will be ignored for artifact resolution. Reason: Failed to validate POM
[WARNING] POM for 'org.apache.openejb:openejb-core:pom:3.0-incubating-SNAPSHOT:compile' is
invalid. It will be ignored for artifact resolution. Reason: Failed to validate POM
[INFO] [compiler:testCompile]
[INFO] Nothing to compile - all classes are up to date
[WARNING] POM for 'org.apache.openejb:openejb-core:pom:3.0-incubating-SNAPSHOT:compile' is
invalid. It will be ignored for artifact resolution. Reason: Failed to validate POM
[WARNING] POM for 'org.apache.openejb:openejb-core:pom:3.0-incubating-SNAPSHOT:compile' is
invalid. It will be ignored for artifact resolution. Reason: Failed to validate POM
[WARNING] POM for 'org.apache.openejb:openejb-core:pom:3.0-incubating-SNAPSHOT:compile' is
invalid. It will be ignored for artifact resolution. Reason: Failed to validate POM
[INFO] [surefire:test]
[INFO] Surefire report directory: /x1/continuum/working-directory/167/target/surefire-reports

-------------------------------------------------------
 T E S T S
-------------------------------------------------------
Running org.apache.openejb.server.httpd.HttpEjbServerTest
Tests run: 0, Failures: 0, Errors: 0, Skipped: 0, Time elapsed: 0.032 sec
Running org.apache.openejb.server.httpd.SomeoneBrokeSurefireAndThisIsADirtyHackForItTest
WARNING: No test suite configuration file specified, assuming system properties contain all
needed information.  To specify a test suite configuration file by setting its location using
the system property "openejb.testsuite.properties"
org.apache.maven.surefire.booter.SurefireExecutionException: org.apache.openejb.server.httpd.SomeoneBrokeSurefireAndThisIsADirtyHackForItTest;
nested exception is java.lang.NoClassDefFoundError: org/apache/openejb/loader/SystemInstance;
nested exception is org.apache.maven.surefire.testset.TestSetFailedException: org.apache.openejb.server.httpd.SomeoneBrokeSurefireAndThisIsADirtyHackForItTest;
nested exception is java.lang.NoClassDefFoundError: org/apache/openejb/loader/SystemInstance
org.apache.maven.surefire.testset.TestSetFailedException: org.apache.openejb.server.httpd.SomeoneBrokeSurefireAndThisIsADirtyHackForItTest;
nested exception is java.lang.NoClassDefFoundError: org/apache/openejb/loader/SystemInstance
java.lang.NoClassDefFoundError: org/apache/openejb/loader/SystemInstance
	at org.apache.openejb.OpenEJB.isInitialized(OpenEJB.java:288)
	at org.apache.openejb.OpenEJB.init(OpenEJB.java:275)
	at org.apache.openejb.server.httpd.HttpEjbServerTest$HttpEjbTestServer.init(HttpEjbServerTest.java:77)
	at org.apache.openejb.test.TestManager.initServer(TestManager.java:142)
	at org.apache.openejb.test.TestManager.init(TestManager.java:72)
	at org.apache.openejb.server.httpd.HttpEjbServerTest.setUp(HttpEjbServerTest.java:48)
	at org.apache.openejb.test.TestSuite.run(TestSuite.java:41)
	at sun.reflect.NativeMethodAccessorImpl.invoke0(Native Method)
	at sun.reflect.NativeMethodAccessorImpl.invoke(NativeMethodAccessorImpl.java:39)
	at sun.reflect.DelegatingMethodAccessorImpl.invoke(DelegatingMethodAccessorImpl.java:25)
	at java.lang.reflect.Method.invoke(Method.java:585)
	at org.apache.maven.surefire.junit.JUnitTestSet.execute(JUnitTestSet.java:210)
	at org.apache.maven.surefire.suite.AbstractDirectoryTestSuite.executeTestSet(AbstractDirectoryTestSuite.java:135)
	at org.apache.maven.surefire.suite.AbstractDirectoryTestSuite.execute(AbstractDirectoryTestSuite.java:122)
	at org.apache.maven.surefire.Surefire.run(Surefire.java:129)
	at sun.reflect.NativeMethodAccessorImpl.invoke0(Native Method)
	at sun.reflect.NativeMethodAccessorImpl.invoke(NativeMethodAccessorImpl.java:39)
	at sun.reflect.DelegatingMethodAccessorImpl.invoke(DelegatingMethodAccessorImpl.java:25)
	at java.lang.reflect.Method.invoke(Method.java:585)
	at org.apache.maven.surefire.booter.SurefireBooter.runSuitesInProcess(SurefireBooter.java:225)
	at org.apache.maven.surefire.booter.SurefireBooter.main(SurefireBooter.java:747)
[INFO] ------------------------------------------------------------------------
[ERROR] BUILD FAILURE
[INFO] ------------------------------------------------------------------------
[INFO] There are test failures.
[INFO] ------------------------------------------------------------------------
[INFO] For more information, run Maven with the -e switch
[INFO] ------------------------------------------------------------------------
[INFO] Total time: 14 seconds
[INFO] Finished at: Tue May 08 06:31:16 PDT 2007
[INFO] Final Memory: 12M/21M
[INFO] ------------------------------------------------------------------------

****************************************************************************



Mime
View raw message