tomee-commits mailing list archives

Site index · List index
Message view « Date » · « Thread »
Top « Date » · « Thread »
From "Continuum@vmbuild.apache.org" <openejb-comm...@incubator.apache.org>
Subject [continuum] BUILD FAILURE: OpenEJB :: Container :: Core
Date Wed, 23 May 2007 03:09:22 GMT
Online report : http://vmbuild.apache.org/continuum/servlet/continuum/target/ProjectBuild.vm/view/ProjectBuild/id/158/buildId/156662
Build statistics:
  State: Failed
  Previous State: Failed
  Started at: Tue, 22 May 2007 20:03:43 -0700
  Finished at: Tue, 22 May 2007 20:09:21 -0700
  Total time: 5m 38s
  Build Trigger: Schedule
  Exit code: 1
  Building machine hostname: vmbuild.apache.org
  Operating system : Linux(unknown)
  Java version : 1.5.0_06(Sun Microsystems Inc.)

Changes
         dain          added caused by exception to transaction commit failed exception
             /incubator/openejb/trunk/openejb3/container/openejb-core/src/main/java/org/apache/openejb/core/cmp/jpa/JpaCmpEngine.java
        
****************************************************************************
Output:
****************************************************************************
[INFO] Scanning for projects...
[INFO] ----------------------------------------------------------------------------
[INFO] Building OpenEJB :: Container :: Core
[INFO]    task-segment: [install]
[INFO] ----------------------------------------------------------------------------
[INFO] [resources:resources]
[INFO] Using default encoding to copy filtered resources.
[INFO] [dependency:copy {execution: copy}]
[INFO] Configured Artifact: org.apache.openejb:openejb-javaagent:3.0-incubating-SNAPSHOT:jar
[INFO] org.apache.openejb:openejb-javaagent:3.0-incubating-SNAPSHOT:jar already exists in
/x1/continuum/working-directory/158/target
[INFO] snapshot org.apache.openejb:openejb-itests-app:3.0-incubating-SNAPSHOT: checking for
updates from codehaus-snapshot
[INFO] snapshot org.apache.openejb:openejb-itests-app:3.0-incubating-SNAPSHOT: checking for
updates from apache-m2-snapshot
[INFO] snapshot org.apache.openejb:openejb-itests-app:3.0-incubating-SNAPSHOT: checking for
updates from apache.snapshots
[INFO] snapshot org.apache.openejb:itests:3.0-incubating-SNAPSHOT: checking for updates from
codehaus-snapshot
[INFO] snapshot org.apache.openejb:itests:3.0-incubating-SNAPSHOT: checking for updates from
apache-m2-snapshot
[INFO] snapshot org.apache.openejb:itests:3.0-incubating-SNAPSHOT: checking for updates from
apache.snapshots
[INFO] snapshot org.apache.openejb:openejb-itests-beans:3.0-incubating-SNAPSHOT: checking
for updates from codehaus-snapshot
[INFO] snapshot org.apache.openejb:openejb-itests-beans:3.0-incubating-SNAPSHOT: checking
for updates from apache-m2-snapshot
[INFO] snapshot org.apache.openejb:openejb-itests-beans:3.0-incubating-SNAPSHOT: checking
for updates from apache.snapshots
[INFO] snapshot org.apache.openejb:openejb-itests-client:3.0-incubating-SNAPSHOT: checking
for updates from codehaus-snapshot
[INFO] snapshot org.apache.openejb:openejb-itests-client:3.0-incubating-SNAPSHOT: checking
for updates from apache-m2-snapshot
[INFO] snapshot org.apache.openejb:openejb-itests-client:3.0-incubating-SNAPSHOT: checking
for updates from apache.snapshots
[INFO] [compiler:compile]
Compiling 1 source file to /x1/continuum/working-directory/158/target/classes
Downloading: http://people.apache.org/repo/m2-incubating-repository/org/apache/axis2/axis2-jaxws-api/20070522.030019-105/axis2-jaxws-api-20070522.030019-105.pom
Downloading: http://repo1.maven.org/maven2/org/apache/axis2/axis2-jaxws-api/20070522.030019-105/axis2-jaxws-api-20070522.030019-105.pom
[INFO] [antrun:run {execution: default}]
[INFO] Executing tasks
[INFO] Executed tasks
[INFO] [resources:testResources]
[INFO] Using default encoding to copy filtered resources.
[INFO] [compiler:testCompile]
[INFO] Nothing to compile - all classes are up to date
[INFO] [surefire:test]
[INFO] Surefire report directory: /x1/continuum/working-directory/158/target/surefire-reports

-------------------------------------------------------
 T E S T S
-------------------------------------------------------
Running org.apache.openejb.config.OpenEjb2CmpConversionTest
Tests run: 9, Failures: 0, Errors: 0, Skipped: 0, Time elapsed: 10.51 sec
Running org.apache.openejb.core.stateless.JaxWsWebServiceInvocationTest
Tests run: 1, Failures: 0, Errors: 0, Skipped: 0, Time elapsed: 5.197 sec
Running org.apache.openejb.core.stateless.StatelessInterceptorTest
Tests run: 1, Failures: 0, Errors: 0, Skipped: 0, Time elapsed: 4.72 sec
Running org.apache.openejb.core.mdb.MdbTest
Tests run: 1, Failures: 0, Errors: 0, Skipped: 0, Time elapsed: 11.405 sec
Running org.apache.openejb.core.stateful.StatefulInterceptorTest
Tests run: 1, Failures: 0, Errors: 0, Skipped: 0, Time elapsed: 5.859 sec
Running org.apache.openejb.config.ConfigureServiceTest
Tests run: 4, Failures: 0, Errors: 0, Skipped: 0, Time elapsed: 1.37 sec
Running org.apache.openejb.core.mdb.SimpleJmsTest
Tests run: 1, Failures: 0, Errors: 0, Skipped: 0, Time elapsed: 11.466 sec
Running org.apache.openejb.config.SunQueryFilterTest
Tests run: 5, Failures: 0, Errors: 0, Skipped: 0, Time elapsed: 0.089 sec
Running org.apache.openejb.config.SunCmpConversionTest
Tests run: 8, Failures: 0, Errors: 0, Skipped: 0, Time elapsed: 11.4 sec
Running org.apache.openejb.core.stateful.Compat3to2Test
Tests run: 1, Failures: 0, Errors: 0, Skipped: 0, Time elapsed: 4.752 sec
Running org.apache.openejb.ApplicationTest
WARNING: No test suite configuration file specified, assuming system properties contain all
needed information.  To specify a test suite configuration file by setting its location using
the system property "openejb.testsuite.properties"
test server = org.apache.openejb.test.IvmTestServer
entry = java.naming.factory.initial:org.apache.openejb.client.LocalInitialContextFactory
Apache OpenEJB 3.0-incubating-SNAPSHOT    build: 20070522-08:04
http://incubator.apache.org/openejb
Cannot start the test database: java.lang.IllegalStateException Cannot create initial context:
javax.naming.NamingException Attempted to load OpenEJB. No existing resource adapter defined
with id 'Default JMS Resource Adapter'.
Tests run: 1, Failures: 0, Errors: 1, Skipped: 0, Time elapsed: 9.187 sec <<< FAILURE!
Running org.apache.openejb.core.stateless.JaxRpcWebServiceInvocationTest
Tests run: 2, Failures: 0, Errors: 0, Skipped: 0, Time elapsed: 4.386 sec
Running org.apache.openejb.core.mdb.JmsProxyTest
Tests run: 1, Failures: 0, Errors: 0, Skipped: 0, Time elapsed: 11.176 sec
Running org.apache.openejb.assembler.classic.JdbcConfigTest
Tests run: 1, Failures: 0, Errors: 0, Skipped: 0, Time elapsed: 2.527 sec
Running org.apache.openejb.util.ClassesTest
Tests run: 1, Failures: 0, Errors: 0, Skipped: 0, Time elapsed: 0.071 sec
Running org.apache.openejb.core.ivm.naming.IvmContextTest
Tests run: 1, Failures: 0, Errors: 0, Skipped: 0, Time elapsed: 0.138 sec
Running org.apache.openejb.config.JaxbUnmarshallerTest
Tests run: 1, Failures: 0, Errors: 0, Skipped: 0, Time elapsed: 1.938 sec
Running org.apache.openejb.core.stateful.StatefulContainerTest
Tests run: 2, Failures: 0, Errors: 0, Skipped: 0, Time elapsed: 5.502 sec
Running org.apache.openejb.core.cmp.jpa.JpaTest
Tests run: 2, Failures: 0, Errors: 0, Skipped: 0, Time elapsed: 8.169 sec
Running org.apache.openejb.DependenceValidationTest
Tests run: 1, Failures: 0, Errors: 0, Skipped: 0, Time elapsed: 1.93 sec
Running org.apache.openejb.core.stateless.CrossClassLoaderProxyTest
Tests run: 4, Failures: 0, Errors: 0, Skipped: 0, Time elapsed: 1.215 sec
Running org.apache.openejb.core.stateless.ExtendedInjectionTest
Tests run: 2, Failures: 0, Errors: 0, Skipped: 0, Time elapsed: 1.211 sec
Running org.apache.openejb.core.stateful.StatefulSessionBeanTest
Tests run: 1, Failures: 0, Errors: 0, Skipped: 0, Time elapsed: 5.142 sec
Running org.apache.openejb.assembler.classic.RedeployTest
Tests run: 1, Failures: 0, Errors: 0, Skipped: 0, Time elapsed: 30.544 sec
Running org.apache.openejb.resource.SharedLocalConnectionManagerTest
Tests run: 1, Failures: 0, Errors: 0, Skipped: 0, Time elapsed: 1.242 sec
Running org.apache.openejb.assembler.classic.InterceptorBindingInfoComparatorTest
Tests run: 2, Failures: 0, Errors: 0, Skipped: 0, Time elapsed: 0.311 sec
Running org.apache.openejb.assembler.classic.MdbConfigTest
Tests run: 1, Failures: 0, Errors: 0, Skipped: 0, Time elapsed: 10.883 sec
Running org.apache.openejb.core.security.PropertiesLoginModuleTest
Path to login config: /x1/continuum/working-directory/158/target/test-classes/login.config
Path to login config: /x1/continuum/working-directory/158/target/test-classes/login.config
Path to login config: /x1/continuum/working-directory/158/target/test-classes/login.config
Tests run: 3, Failures: 0, Errors: 3, Skipped: 0, Time elapsed: 0.442 sec <<< FAILURE!
Running org.apache.openejb.assembler.classic.PersistenceUnitRefTest
Tests run: 1, Failures: 0, Errors: 0, Skipped: 0, Time elapsed: 0.21 sec
Running org.apache.openejb.config.OpenEjb2ConversionTest
Tests run: 9, Failures: 0, Errors: 0, Skipped: 0, Time elapsed: 10.144 sec
Running org.apache.openejb.resource.GeronimoConnectionManagerTest
Tests run: 1, Failures: 0, Errors: 0, Skipped: 0, Time elapsed: 1.366 sec
Running org.apache.openejb.core.mdb.JmsTest
Tests run: 1, Failures: 0, Errors: 0, Skipped: 0, Time elapsed: 11.078 sec
Running org.apache.openejb.SomeoneBrokeSurefireAndThisIsADirtyHackForItTest
WARNING: No test suite configuration file specified, assuming system properties contain all
needed information.  To specify a test suite configuration file by setting its location using
the system property "openejb.testsuite.properties"
test server = org.apache.openejb.test.IvmTestServer
entry = java.naming.factory.initial:org.apache.openejb.client.LocalInitialContextFactory
Apache OpenEJB 3.0-incubating-SNAPSHOT    build: 20070522-08:04
http://incubator.apache.org/openejb
Cannot start the test database: java.lang.IllegalStateException Cannot create initial context:
javax.naming.NamingException Attempted to load OpenEJB. org.apache.xbean.recipe.MissingAccessorException:
Unable to find a valid setter method: public void org.apache.openejb.core.mdb.MdbContainer.setServerUrl(java.lang.String):
Unable to find a valid setter method: public void org.apache.openejb.core.mdb.MdbContainer.setServerUrl(java.lang.String)
Tests run: 1, Failures: 0, Errors: 1, Skipped: 0, Time elapsed: 15.548 sec <<< FAILURE!
Running org.apache.openejb.iTest
Tests run: 0, Failures: 0, Errors: 0, Skipped: 0, Time elapsed: 0.049 sec
Running org.apache.openejb.core.stateless.StatelessContainerTest
Tests run: 3, Failures: 0, Errors: 0, Skipped: 0, Time elapsed: 1.063 sec
Running org.apache.openejb.core.TemporaryClassLoaderTest
Tests run: 1, Failures: 0, Errors: 0, Skipped: 0, Time elapsed: 0.209 sec
Running org.apache.openejb.core.security.SecurityTest
Tests run: 1, Failures: 0, Errors: 1, Skipped: 0, Time elapsed: 4.477 sec <<< FAILURE!
Running org.apache.openejb.assembler.classic.OpenEjbConfigurationValidationTest
Tests run: 1, Failures: 0, Errors: 0, Skipped: 0, Time elapsed: 0.219 sec

Results :
Tests run: 79, Failures: 0, Errors: 6, Skipped: 0

[INFO] ------------------------------------------------------------------------
[ERROR] BUILD FAILURE
[INFO] ------------------------------------------------------------------------
[INFO] There are test failures.
[INFO] ------------------------------------------------------------------------
[INFO] For more information, run Maven with the -e switch
[INFO] ------------------------------------------------------------------------
[INFO] Total time: 5 minutes 35 seconds
[INFO] Finished at: Tue May 22 20:09:21 PDT 2007
[INFO] Final Memory: 17M/36M
[INFO] ------------------------------------------------------------------------

****************************************************************************



Mime
View raw message