tomee-commits mailing list archives

Site index · List index
Message view « Date » · « Thread »
Top « Date » · « Thread »
From "Continuum@vmbuild.apache.org" <openejb-comm...@incubator.apache.org>
Subject [continuum] BUILD FAILURE: OpenEJB :: Container :: Core
Date Thu, 24 May 2007 04:10:54 GMT
Online report : http://vmbuild.apache.org/continuum/servlet/continuum/target/ProjectBuild.vm/view/ProjectBuild/id/158/buildId/158192
Build statistics:
  State: Failed
  Previous State: Failed
  Started at: Wed, 23 May 2007 21:03:52 -0700
  Finished at: Wed, 23 May 2007 21:10:53 -0700
  Total time: 7m 1s
  Build Trigger: Schedule
  Exit code: 1
  Building machine hostname: vmbuild.apache.org
  Operating system : Linux(unknown)
  Java version : 1.5.0_06(Sun Microsystems Inc.)

Changes
         dain          Stateful create methods don't get session synchronization call backs
Don't call the beforeCommit method when the transaction is marked rollback only
             /incubator/openejb/trunk/openejb3/container/openejb-core/src/main/java/org/apache/openejb/core/stateful/SessionSynchronizationCoordinator.java
            /incubator/openejb/trunk/openejb3/container/openejb-core/src/main/java/org/apache/openejb/core/stateful/SessionSynchronizationTxPolicy.java
        
****************************************************************************
Output:
****************************************************************************
[INFO] Scanning for projects...
[INFO] ----------------------------------------------------------------------------
[INFO] Building OpenEJB :: Container :: Core
[INFO]    task-segment: [install]
[INFO] ----------------------------------------------------------------------------
[INFO] [resources:resources]
[INFO] Using default encoding to copy filtered resources.
[INFO] [dependency:copy {execution: copy}]
[INFO] Configured Artifact: org.apache.openejb:openejb-javaagent:3.0-incubating-SNAPSHOT:jar
[INFO] org.apache.openejb:openejb-javaagent:3.0-incubating-SNAPSHOT:jar already exists in
/x1/continuum/working-directory/158/target
[INFO] [compiler:compile]
Compiling 2 source files to /x1/continuum/working-directory/158/target/classes
Downloading: http://people.apache.org/repo/m2-incubating-repository/org/apache/axis2/axis2-jaxws-api/20070523.060016-107/axis2-jaxws-api-20070523.060016-107.pom
Downloading: http://repo1.maven.org/maven2/org/apache/axis2/axis2-jaxws-api/20070523.060016-107/axis2-jaxws-api-20070523.060016-107.pom
[INFO] [antrun:run {execution: default}]
[INFO] Executing tasks
[INFO] Executed tasks
[INFO] [resources:testResources]
[INFO] Using default encoding to copy filtered resources.
[INFO] [compiler:testCompile]
[INFO] Nothing to compile - all classes are up to date
[INFO] [surefire:test]
[INFO] Surefire report directory: /x1/continuum/working-directory/158/target/surefire-reports

-------------------------------------------------------
 T E S T S
-------------------------------------------------------
Running org.apache.openejb.config.OpenEjb2CmpConversionTest
Tests run: 9, Failures: 0, Errors: 0, Skipped: 0, Time elapsed: 14.229 sec
Running org.apache.openejb.core.stateless.JaxWsWebServiceInvocationTest
Tests run: 1, Failures: 0, Errors: 0, Skipped: 0, Time elapsed: 6.391 sec
Running org.apache.openejb.core.stateless.StatelessInterceptorTest
Tests run: 1, Failures: 0, Errors: 0, Skipped: 0, Time elapsed: 6.406 sec
Running org.apache.openejb.core.mdb.MdbTest
Tests run: 1, Failures: 0, Errors: 0, Skipped: 0, Time elapsed: 12.352 sec
Running org.apache.openejb.core.stateful.StatefulInterceptorTest
Tests run: 1, Failures: 0, Errors: 0, Skipped: 0, Time elapsed: 5.951 sec
Running org.apache.openejb.config.ConfigureServiceTest
Tests run: 4, Failures: 0, Errors: 0, Skipped: 0, Time elapsed: 1.868 sec
Running org.apache.openejb.core.mdb.SimpleJmsTest
Tests run: 1, Failures: 0, Errors: 0, Skipped: 0, Time elapsed: 12.398 sec
Running org.apache.openejb.config.SunQueryFilterTest
Tests run: 5, Failures: 0, Errors: 0, Skipped: 0, Time elapsed: 0.138 sec
Running org.apache.openejb.config.SunCmpConversionTest
Tests run: 8, Failures: 0, Errors: 0, Skipped: 0, Time elapsed: 14.646 sec
Running org.apache.openejb.core.stateful.Compat3to2Test
Tests run: 1, Failures: 0, Errors: 0, Skipped: 0, Time elapsed: 6.783 sec
Running org.apache.openejb.ApplicationTest
WARNING: No test suite configuration file specified, assuming system properties contain all
needed information.  To specify a test suite configuration file by setting its location using
the system property "openejb.testsuite.properties"
test server = org.apache.openejb.test.IvmTestServer
entry = java.naming.factory.initial:org.apache.openejb.client.LocalInitialContextFactory
Apache OpenEJB 3.0-incubating-SNAPSHOT    build: 20070523-09:04
http://incubator.apache.org/openejb
Cannot start the test database: java.lang.IllegalStateException Cannot create initial context:
javax.naming.NamingException Attempted to load OpenEJB. No existing resource adapter defined
with id 'Default JMS Resource Adapter'.
Tests run: 1, Failures: 0, Errors: 1, Skipped: 0, Time elapsed: 11.071 sec <<< FAILURE!
Running org.apache.openejb.core.stateless.JaxRpcWebServiceInvocationTest
Tests run: 2, Failures: 0, Errors: 0, Skipped: 0, Time elapsed: 6.173 sec
Running org.apache.openejb.core.mdb.JmsProxyTest
Tests run: 1, Failures: 0, Errors: 0, Skipped: 0, Time elapsed: 12.243 sec
Running org.apache.openejb.assembler.classic.JdbcConfigTest
Tests run: 1, Failures: 0, Errors: 0, Skipped: 0, Time elapsed: 3.282 sec
Running org.apache.openejb.util.ClassesTest
Tests run: 1, Failures: 0, Errors: 0, Skipped: 0, Time elapsed: 0.072 sec
Running org.apache.openejb.core.ivm.naming.IvmContextTest
Tests run: 1, Failures: 0, Errors: 0, Skipped: 0, Time elapsed: 0.128 sec
Running org.apache.openejb.config.JaxbUnmarshallerTest
Tests run: 1, Failures: 0, Errors: 0, Skipped: 0, Time elapsed: 2.552 sec
Running org.apache.openejb.core.stateful.StatefulContainerTest
Tests run: 2, Failures: 0, Errors: 0, Skipped: 0, Time elapsed: 7.626 sec
Running org.apache.openejb.core.cmp.jpa.JpaTest
Tests run: 2, Failures: 0, Errors: 0, Skipped: 0, Time elapsed: 11.573 sec
Running org.apache.openejb.DependenceValidationTest
Tests run: 1, Failures: 0, Errors: 0, Skipped: 0, Time elapsed: 2.491 sec
Running org.apache.openejb.core.stateless.CrossClassLoaderProxyTest
Tests run: 4, Failures: 0, Errors: 0, Skipped: 0, Time elapsed: 1.854 sec
Running org.apache.openejb.core.stateless.ExtendedInjectionTest
Tests run: 2, Failures: 0, Errors: 0, Skipped: 0, Time elapsed: 1.166 sec
Running org.apache.openejb.core.stateful.StatefulSessionBeanTest
Tests run: 1, Failures: 0, Errors: 0, Skipped: 0, Time elapsed: 6.669 sec
Running org.apache.openejb.assembler.classic.RedeployTest
Tests run: 1, Failures: 0, Errors: 0, Skipped: 0, Time elapsed: 38.601 sec
Running org.apache.openejb.resource.SharedLocalConnectionManagerTest
Tests run: 1, Failures: 0, Errors: 0, Skipped: 0, Time elapsed: 1.465 sec
Running org.apache.openejb.assembler.classic.InterceptorBindingInfoComparatorTest
Tests run: 2, Failures: 0, Errors: 0, Skipped: 0, Time elapsed: 0.45 sec
Running org.apache.openejb.assembler.classic.MdbConfigTest
Tests run: 1, Failures: 0, Errors: 0, Skipped: 0, Time elapsed: 12.373 sec
Running org.apache.openejb.core.security.PropertiesLoginModuleTest
Path to login config: /x1/continuum/working-directory/158/target/test-classes/login.config
Path to login config: /x1/continuum/working-directory/158/target/test-classes/login.config
Path to login config: /x1/continuum/working-directory/158/target/test-classes/login.config
Tests run: 3, Failures: 0, Errors: 3, Skipped: 0, Time elapsed: 0.668 sec <<< FAILURE!
Running org.apache.openejb.assembler.classic.PersistenceUnitRefTest
Tests run: 1, Failures: 0, Errors: 0, Skipped: 0, Time elapsed: 0.289 sec
Running org.apache.openejb.config.OpenEjb2ConversionTest
Tests run: 9, Failures: 0, Errors: 0, Skipped: 0, Time elapsed: 14.399 sec
Running org.apache.openejb.resource.GeronimoConnectionManagerTest
Tests run: 1, Failures: 0, Errors: 0, Skipped: 0, Time elapsed: 1.798 sec
Running org.apache.openejb.core.mdb.JmsTest
Tests run: 1, Failures: 0, Errors: 0, Skipped: 0, Time elapsed: 12.112 sec
Running org.apache.openejb.SomeoneBrokeSurefireAndThisIsADirtyHackForItTest
WARNING: No test suite configuration file specified, assuming system properties contain all
needed information.  To specify a test suite configuration file by setting its location using
the system property "openejb.testsuite.properties"
test server = org.apache.openejb.test.IvmTestServer
entry = java.naming.factory.initial:org.apache.openejb.client.LocalInitialContextFactory
Apache OpenEJB 3.0-incubating-SNAPSHOT    build: 20070523-09:04
http://incubator.apache.org/openejb
Cannot start the test database: java.lang.IllegalStateException Cannot create initial context:
javax.naming.NamingException Attempted to load OpenEJB. org.apache.xbean.recipe.MissingAccessorException:
Unable to find a valid setter method: public void org.apache.openejb.core.mdb.MdbContainer.setServerUrl(java.lang.String):
Unable to find a valid setter method: public void org.apache.openejb.core.mdb.MdbContainer.setServerUrl(java.lang.String)
Tests run: 1, Failures: 0, Errors: 1, Skipped: 0, Time elapsed: 20.217 sec <<< FAILURE!
Running org.apache.openejb.iTest
Tests run: 0, Failures: 0, Errors: 0, Skipped: 0, Time elapsed: 0.026 sec
Running org.apache.openejb.core.stateless.StatelessContainerTest
Tests run: 3, Failures: 0, Errors: 0, Skipped: 0, Time elapsed: 1.417 sec
Running org.apache.openejb.core.TemporaryClassLoaderTest
Tests run: 1, Failures: 0, Errors: 0, Skipped: 0, Time elapsed: 0.289 sec
Running org.apache.openejb.core.security.SecurityTest
Tests run: 1, Failures: 0, Errors: 1, Skipped: 0, Time elapsed: 6.279 sec <<< FAILURE!
Running org.apache.openejb.assembler.classic.OpenEjbConfigurationValidationTest
Tests run: 1, Failures: 0, Errors: 0, Skipped: 0, Time elapsed: 0.334 sec

Results :
Tests run: 79, Failures: 0, Errors: 6, Skipped: 0

[INFO] ------------------------------------------------------------------------
[ERROR] BUILD FAILURE
[INFO] ------------------------------------------------------------------------
[INFO] There are test failures.
[INFO] ------------------------------------------------------------------------
[INFO] For more information, run Maven with the -e switch
[INFO] ------------------------------------------------------------------------
[INFO] Total time: 6 minutes 58 seconds
[INFO] Finished at: Wed May 23 21:10:53 PDT 2007
[INFO] Final Memory: 17M/36M
[INFO] ------------------------------------------------------------------------

****************************************************************************



Mime
View raw message