tomee-commits mailing list archives

Site index · List index
Message view « Date » · « Thread »
Top « Date » · « Thread »
From "Continuum@vmbuild.apache.org" <openejb-comm...@incubator.apache.org>
Subject [continuum] BUILD FAILURE: OpenEJB :: Container :: Core
Date Sun, 06 May 2007 12:13:02 GMT
Online report : http://vmbuild.apache.org/continuum/servlet/continuum/target/ProjectBuild.vm/view/ProjectBuild/id/158/buildId/136688
Build statistics:
  State: Failed
  Previous State: Failed
  Started at: Sun, 6 May 2007 05:05:58 -0700
  Finished at: Sun, 6 May 2007 05:13:02 -0700
  Total time: 7m 3s
  Build Trigger: Schedule
  Exit code: 1
  Building machine hostname: vmbuild.apache.org
  Operating system : Linux(unknown)
  Java version : 1.5.0_06(Sun Microsystems Inc.)

Changes
         manugeorge          OPENEJB-576. WebService Annotation processing changes. Thanks
to Jarek
             /incubator/openejb/trunk/openejb3/container/openejb-core/src/main/java/org/apache/openejb/config/AnnotationDeployer.java
        
****************************************************************************
Output:
****************************************************************************
[INFO] Scanning for projects...
[INFO] ----------------------------------------------------------------------------
[INFO] Building OpenEJB :: Container :: Core
[INFO]    task-segment: [install]
[INFO] ----------------------------------------------------------------------------
[INFO] [resources:resources]
[INFO] Using default encoding to copy filtered resources.
[INFO] [dependency:copy {execution: copy}]
[INFO] Configured Artifact: org.apache.openejb:openejb-javaagent:3.0-incubating-SNAPSHOT:jar
[INFO] snapshot org.apache.openejb:openejb-javaagent:3.0-incubating-SNAPSHOT: checking for
updates from codehaus-snapshot
[INFO] snapshot org.apache.openejb:openejb-javaagent:3.0-incubating-SNAPSHOT: checking for
updates from apache-m2-snapshot
[INFO] snapshot org.apache.openejb:openejb-javaagent:3.0-incubating-SNAPSHOT: checking for
updates from apache.snapshots
[INFO] org.apache.openejb:openejb-javaagent:3.0-incubating-SNAPSHOT:jar already exists in
/x1/continuum/working-directory/158/target
[INFO] snapshot org.apache.openejb:openejb-loader:3.0-incubating-SNAPSHOT: checking for updates
from codehaus-snapshot
[INFO] snapshot org.apache.openejb:openejb-loader:3.0-incubating-SNAPSHOT: checking for updates
from apache-m2-snapshot
[INFO] snapshot org.apache.openejb:openejb-loader:3.0-incubating-SNAPSHOT: checking for updates
from apache.snapshots
[INFO] snapshot org.apache.openejb:openejb-jee:3.0-incubating-SNAPSHOT: checking for updates
from codehaus-snapshot
[INFO] snapshot org.apache.openejb:openejb-jee:3.0-incubating-SNAPSHOT: checking for updates
from apache-m2-snapshot
[INFO] snapshot org.apache.openejb:openejb-jee:3.0-incubating-SNAPSHOT: checking for updates
from apache.snapshots
[INFO] snapshot org.apache.xbean:xbean-finder:3.0-SNAPSHOT: checking for updates from codehaus-snapshot
[INFO] snapshot org.apache.xbean:xbean-finder:3.0-SNAPSHOT: checking for updates from apache-m2-snapshot
[INFO] snapshot org.apache.xbean:xbean-finder:3.0-SNAPSHOT: checking for updates from apache.snapshots
[INFO] snapshot org.apache.xbean:xbean:3.0-SNAPSHOT: checking for updates from codehaus-snapshot
[INFO] snapshot org.apache.xbean:xbean:3.0-SNAPSHOT: checking for updates from apache-m2-snapshot
[INFO] snapshot org.apache.xbean:xbean:3.0-SNAPSHOT: checking for updates from apache.snapshots
[INFO] snapshot org.apache.geronimo.specs:geronimo-stax-api_1.0_spec:1.0-SNAPSHOT: checking
for updates from codehaus-snapshot
[INFO] snapshot org.apache.geronimo.specs:geronimo-stax-api_1.0_spec:1.0-SNAPSHOT: checking
for updates from apache-m2-snapshot
[INFO] snapshot org.apache.geronimo.specs:geronimo-stax-api_1.0_spec:1.0-SNAPSHOT: checking
for updates from apache.snapshots
[INFO] snapshot org.apache.openejb:openejb-itests-app:3.0-incubating-SNAPSHOT: checking for
updates from codehaus-snapshot
[INFO] snapshot org.apache.openejb:openejb-itests-app:3.0-incubating-SNAPSHOT: checking for
updates from apache-m2-snapshot
[INFO] snapshot org.apache.openejb:openejb-itests-app:3.0-incubating-SNAPSHOT: checking for
updates from apache.snapshots
[INFO] snapshot org.apache.openejb:itests:3.0-incubating-SNAPSHOT: checking for updates from
codehaus-snapshot
[INFO] snapshot org.apache.openejb:itests:3.0-incubating-SNAPSHOT: checking for updates from
apache-m2-snapshot
[INFO] snapshot org.apache.openejb:itests:3.0-incubating-SNAPSHOT: checking for updates from
apache.snapshots
[INFO] snapshot org.apache.openejb:openejb-itests-beans:3.0-incubating-SNAPSHOT: checking
for updates from codehaus-snapshot
[INFO] snapshot org.apache.openejb:openejb-itests-beans:3.0-incubating-SNAPSHOT: checking
for updates from apache-m2-snapshot
[INFO] snapshot org.apache.openejb:openejb-itests-beans:3.0-incubating-SNAPSHOT: checking
for updates from apache.snapshots
[INFO] snapshot org.apache.openjpa:openjpa-persistence-jdbc:0.9.7-incubating-SNAPSHOT: checking
for updates from codehaus-snapshot
[INFO] snapshot org.apache.openjpa:openjpa-persistence-jdbc:0.9.7-incubating-SNAPSHOT: checking
for updates from apache-m2-snapshot
[INFO] snapshot org.apache.openjpa:openjpa-persistence-jdbc:0.9.7-incubating-SNAPSHOT: checking
for updates from apache.snapshots
[INFO] snapshot org.apache.openjpa:openjpa:0.9.7-incubating-SNAPSHOT: checking for updates
from codehaus-snapshot
[INFO] snapshot org.apache.openjpa:openjpa:0.9.7-incubating-SNAPSHOT: checking for updates
from apache-m2-snapshot
[INFO] snapshot org.apache.openjpa:openjpa:0.9.7-incubating-SNAPSHOT: checking for updates
from apache.snapshots
[INFO] snapshot org.apache.openjpa:openjpa-jdbc-5:0.9.7-incubating-SNAPSHOT: checking for
updates from codehaus-snapshot
[INFO] snapshot org.apache.openjpa:openjpa-jdbc-5:0.9.7-incubating-SNAPSHOT: checking for
updates from apache-m2-snapshot
[INFO] snapshot org.apache.openjpa:openjpa-jdbc-5:0.9.7-incubating-SNAPSHOT: checking for
updates from apache.snapshots
[INFO] snapshot org.apache.openjpa:openjpa-jdbc:0.9.7-incubating-SNAPSHOT: checking for updates
from codehaus-snapshot
[INFO] snapshot org.apache.openjpa:openjpa-jdbc:0.9.7-incubating-SNAPSHOT: checking for updates
from apache-m2-snapshot
[INFO] snapshot org.apache.openjpa:openjpa-jdbc:0.9.7-incubating-SNAPSHOT: checking for updates
from apache.snapshots
[INFO] snapshot org.apache.openjpa:openjpa-kernel:0.9.7-incubating-SNAPSHOT: checking for
updates from codehaus-snapshot
[INFO] snapshot org.apache.openjpa:openjpa-kernel:0.9.7-incubating-SNAPSHOT: checking for
updates from apache-m2-snapshot
[INFO] snapshot org.apache.openjpa:openjpa-kernel:0.9.7-incubating-SNAPSHOT: checking for
updates from apache.snapshots
[INFO] snapshot org.apache.openjpa:openjpa-lib:0.9.7-incubating-SNAPSHOT: checking for updates
from codehaus-snapshot
[INFO] snapshot org.apache.openjpa:openjpa-lib:0.9.7-incubating-SNAPSHOT: checking for updates
from apache-m2-snapshot
[INFO] snapshot org.apache.openjpa:openjpa-lib:0.9.7-incubating-SNAPSHOT: checking for updates
from apache.snapshots
[INFO] snapshot org.apache.openjpa:openjpa-persistence:0.9.7-incubating-SNAPSHOT: checking
for updates from codehaus-snapshot
[INFO] snapshot org.apache.openjpa:openjpa-persistence:0.9.7-incubating-SNAPSHOT: checking
for updates from apache-m2-snapshot
[INFO] snapshot org.apache.openjpa:openjpa-persistence:0.9.7-incubating-SNAPSHOT: checking
for updates from apache.snapshots
[INFO] snapshot org.apache.openjpa:openjpa-kernel-5:0.9.7-incubating-SNAPSHOT: checking for
updates from codehaus-snapshot
[INFO] snapshot org.apache.openjpa:openjpa-kernel-5:0.9.7-incubating-SNAPSHOT: checking for
updates from apache-m2-snapshot
[INFO] snapshot org.apache.openjpa:openjpa-kernel-5:0.9.7-incubating-SNAPSHOT: checking for
updates from apache.snapshots
[INFO] snapshot org.apache.openejb:openejb-itests-client:3.0-incubating-SNAPSHOT: checking
for updates from codehaus-snapshot
[INFO] snapshot org.apache.openejb:openejb-itests-client:3.0-incubating-SNAPSHOT: checking
for updates from apache-m2-snapshot
[INFO] snapshot org.apache.openejb:openejb-itests-client:3.0-incubating-SNAPSHOT: checking
for updates from apache.snapshots
[INFO] snapshot org.apache.geronimo.modules:geronimo-connector:2.0-SNAPSHOT: checking for
updates from codehaus-snapshot
[INFO] snapshot org.apache.geronimo.modules:geronimo-connector:2.0-SNAPSHOT: checking for
updates from apache-m2-snapshot
[INFO] snapshot org.apache.geronimo.modules:geronimo-connector:2.0-SNAPSHOT: checking for
updates from apache.snapshots
[INFO] snapshot org.apache.geronimo.modules:modules:2.0-SNAPSHOT: checking for updates from
codehaus-snapshot
[INFO] snapshot org.apache.geronimo.modules:modules:2.0-SNAPSHOT: checking for updates from
apache-m2-snapshot
[INFO] snapshot org.apache.geronimo.modules:modules:2.0-SNAPSHOT: checking for updates from
apache.snapshots
[INFO] snapshot org.apache.geronimo:geronimo:2.0-SNAPSHOT: checking for updates from codehaus-snapshot
[INFO] snapshot org.apache.geronimo:geronimo:2.0-SNAPSHOT: checking for updates from apache-m2-snapshot
[INFO] snapshot org.apache.geronimo:geronimo:2.0-SNAPSHOT: checking for updates from apache.snapshots
[INFO] snapshot org.apache.geronimo.genesis.config:project-config:1.2-SNAPSHOT: checking for
updates from apache-snapshots
[INFO] snapshot org.apache.geronimo.genesis.config:project-config:1.2-SNAPSHOT: checking for
updates from codehaus-snapshot
[INFO] snapshot org.apache.geronimo.genesis.config:project-config:1.2-SNAPSHOT: checking for
updates from apache-m2-snapshot
[INFO] snapshot org.apache.geronimo.genesis.config:project-config:1.2-SNAPSHOT: checking for
updates from apache.snapshots
[INFO] snapshot org.apache.geronimo.genesis.config:config:1.2-SNAPSHOT: checking for updates
from apache-snapshots
[INFO] snapshot org.apache.geronimo.genesis.config:config:1.2-SNAPSHOT: checking for updates
from codehaus-snapshots
[INFO] snapshot org.apache.geronimo.genesis.config:config:1.2-SNAPSHOT: checking for updates
from codehaus-snapshot
[INFO] snapshot org.apache.geronimo.genesis.config:config:1.2-SNAPSHOT: checking for updates
from apache-m2-snapshot
[INFO] snapshot org.apache.geronimo.genesis.config:config:1.2-SNAPSHOT: checking for updates
from apache.snapshots
[INFO] snapshot org.apache.geronimo.genesis:genesis:1.2-SNAPSHOT: checking for updates from
apache-snapshots
[INFO] snapshot org.apache.geronimo.genesis:genesis:1.2-SNAPSHOT: checking for updates from
codehaus-snapshots
[INFO] snapshot org.apache.geronimo.genesis:genesis:1.2-SNAPSHOT: checking for updates from
codehaus-snapshot
[INFO] snapshot org.apache.geronimo.genesis:genesis:1.2-SNAPSHOT: checking for updates from
apache-m2-snapshot
[INFO] snapshot org.apache.geronimo.genesis:genesis:1.2-SNAPSHOT: checking for updates from
apache.snapshots
[INFO] snapshot org.apache.geronimo.modules:geronimo-transaction:2.0-SNAPSHOT: checking for
updates from codehaus-snapshot
[INFO] snapshot org.apache.geronimo.modules:geronimo-transaction:2.0-SNAPSHOT: checking for
updates from apache-m2-snapshot
[INFO] snapshot org.apache.geronimo.modules:geronimo-transaction:2.0-SNAPSHOT: checking for
updates from apache.snapshots
[INFO] snapshot org.apache.geronimo.modules:geronimo-core:2.0-SNAPSHOT: checking for updates
from codehaus-snapshot
[INFO] snapshot org.apache.geronimo.modules:geronimo-core:2.0-SNAPSHOT: checking for updates
from apache-m2-snapshot
[INFO] snapshot org.apache.geronimo.modules:geronimo-core:2.0-SNAPSHOT: checking for updates
from apache.snapshots
[INFO] snapshot org.apache.geronimo.modules:geronimo-system:2.0-SNAPSHOT: checking for updates
from codehaus-snapshot
[INFO] snapshot org.apache.geronimo.modules:geronimo-system:2.0-SNAPSHOT: checking for updates
from apache-m2-snapshot
[INFO] snapshot org.apache.geronimo.modules:geronimo-system:2.0-SNAPSHOT: checking for updates
from apache.snapshots
[INFO] snapshot org.apache.geronimo.modules:geronimo-cli:2.0-SNAPSHOT: checking for updates
from codehaus-snapshot
[INFO] snapshot org.apache.geronimo.modules:geronimo-cli:2.0-SNAPSHOT: checking for updates
from apache-m2-snapshot
[INFO] snapshot org.apache.geronimo.modules:geronimo-cli:2.0-SNAPSHOT: checking for updates
from apache.snapshots
Downloading: http://snapshots.repository.codehaus.org/org/apache/geronimo/modules/geronimo-cli/2.0-SNAPSHOT/geronimo-cli-2.0-SNAPSHOT.pom
[WARNING] Unable to get resource 'org.apache.geronimo.modules:geronimo-cli:pom:2.0-SNAPSHOT'
from repository codehaus-snapshot (http://snapshots.repository.codehaus.org)
Downloading: http://people.apache.org/repo/m2-snapshot-repository/org/apache/geronimo/modules/geronimo-cli/2.0-SNAPSHOT/geronimo-cli-2.0-SNAPSHOT.pom
[WARNING] Unable to get resource 'org.apache.geronimo.modules:geronimo-cli:pom:2.0-SNAPSHOT'
from repository apache-m2-snapshot (http://people.apache.org/repo/m2-snapshot-repository)
Downloading: http://people.apache.org/repo/m2-snapshot-repository/org/apache/geronimo/modules/geronimo-cli/2.0-SNAPSHOT/geronimo-cli-2.0-SNAPSHOT.pom
[WARNING] Unable to get resource 'org.apache.geronimo.modules:geronimo-cli:pom:2.0-SNAPSHOT'
from repository apache.snapshots (http://people.apache.org/repo/m2-snapshot-repository)
[INFO] snapshot org.apache.geronimo.modules:geronimo-util:2.0-SNAPSHOT: checking for updates
from codehaus-snapshot
[INFO] snapshot org.apache.geronimo.modules:geronimo-util:2.0-SNAPSHOT: checking for updates
from apache-m2-snapshot
[INFO] snapshot org.apache.geronimo.modules:geronimo-util:2.0-SNAPSHOT: checking for updates
from apache.snapshots
[INFO] snapshot org.apache.geronimo.modules:geronimo-kernel:2.0-SNAPSHOT: checking for updates
from codehaus-snapshot
[INFO] snapshot org.apache.geronimo.modules:geronimo-kernel:2.0-SNAPSHOT: checking for updates
from apache-m2-snapshot
[INFO] snapshot org.apache.geronimo.modules:geronimo-kernel:2.0-SNAPSHOT: checking for updates
from apache.snapshots
[INFO] snapshot org.apache.geronimo.modules:geronimo-transaction-jta11:2.0-SNAPSHOT: checking
for updates from codehaus-snapshot
[INFO] snapshot org.apache.geronimo.modules:geronimo-transaction-jta11:2.0-SNAPSHOT: checking
for updates from apache-m2-snapshot
[INFO] snapshot org.apache.geronimo.modules:geronimo-transaction-jta11:2.0-SNAPSHOT: checking
for updates from apache.snapshots
[INFO] snapshot org.apache.geronimo.javamail:geronimo-javamail_1.4_mail:1.1-SNAPSHOT: checking
for updates from codehaus-snapshot
[INFO] snapshot org.apache.geronimo.javamail:geronimo-javamail_1.4_mail:1.1-SNAPSHOT: checking
for updates from apache-m2-snapshot
[INFO] snapshot org.apache.geronimo.javamail:geronimo-javamail_1.4_mail:1.1-SNAPSHOT: checking
for updates from apache.snapshots
[INFO] snapshot org.apache.geronimo.javamail:javamail:1.1-SNAPSHOT: checking for updates from
codehaus-snapshot
[INFO] snapshot org.apache.geronimo.javamail:javamail:1.1-SNAPSHOT: checking for updates from
apache-m2-snapshot
[INFO] snapshot org.apache.geronimo.javamail:javamail:1.1-SNAPSHOT: checking for updates from
apache.snapshots
[INFO] snapshot org.apache.geronimo.javamail:geronimo-javamail_1.4_provider:1.1-SNAPSHOT:
checking for updates from codehaus-snapshot
[INFO] snapshot org.apache.geronimo.javamail:geronimo-javamail_1.4_provider:1.1-SNAPSHOT:
checking for updates from apache-m2-snapshot
[INFO] snapshot org.apache.geronimo.javamail:geronimo-javamail_1.4_provider:1.1-SNAPSHOT:
checking for updates from apache.snapshots
[INFO] snapshot org.apache.geronimo.specs:geronimo-javamail_1.4_spec:1.0-SNAPSHOT: checking
for updates from codehaus-snapshot
[INFO] snapshot org.apache.geronimo.specs:geronimo-javamail_1.4_spec:1.0-SNAPSHOT: checking
for updates from apache-m2-snapshot
[INFO] snapshot org.apache.geronimo.specs:geronimo-javamail_1.4_spec:1.0-SNAPSHOT: checking
for updates from apache.snapshots
[INFO] snapshot org.apache.xbean:xbean-reflect:3.0-SNAPSHOT: checking for updates from codehaus-snapshot
[INFO] snapshot org.apache.xbean:xbean-reflect:3.0-SNAPSHOT: checking for updates from apache-m2-snapshot
[INFO] snapshot org.apache.xbean:xbean-reflect:3.0-SNAPSHOT: checking for updates from apache.snapshots
[INFO] snapshot org.apache.xbean:xbean-naming:3.0-SNAPSHOT: checking for updates from codehaus-snapshot
[INFO] snapshot org.apache.xbean:xbean-naming:3.0-SNAPSHOT: checking for updates from apache-m2-snapshot
[INFO] snapshot org.apache.xbean:xbean-naming:3.0-SNAPSHOT: checking for updates from apache.snapshots
[WARNING] 
	Artifact junit:junit:jar:4.1:test retains local scope 'test' overriding broader scope 'compile'
	given by a dependency. If this is not intended, modify or remove the local scope.

[WARNING] 
	Artifact hsqldb:hsqldb:jar:1.8.0.7:test retains local scope 'test' overriding broader scope
'compile'
	given by a dependency. If this is not intended, modify or remove the local scope.

[INFO] snapshot org.apache.axis2:axis2-jaxws-api:SNAPSHOT: checking for updates from codehaus-snapshot
[INFO] snapshot org.apache.axis2:axis2-jaxws-api:SNAPSHOT: checking for updates from apache-m2-snapshot
[INFO] snapshot org.apache.axis2:axis2-jaxws-api:SNAPSHOT: checking for updates from apache.snapshots
[INFO] snapshot org.apache.axis2:axis2-parent:SNAPSHOT: checking for updates from codehaus-snapshot
[INFO] snapshot org.apache.axis2:axis2-parent:SNAPSHOT: checking for updates from apache-m2-snapshot
[INFO] snapshot org.apache.axis2:axis2-parent:SNAPSHOT: checking for updates from apache.snapshots
Downloading: http://people.apache.org/repo/m2-snapshot-repository/org/apache/axis2/axis2-parent/SNAPSHOT/axis2-parent-20070506.092942-192.pom
28K downloaded
[INFO] snapshot org.apache.axis2:axis2-saaj-api:SNAPSHOT: checking for updates from codehaus-snapshot
[INFO] snapshot org.apache.axis2:axis2-saaj-api:SNAPSHOT: checking for updates from apache-m2-snapshot
[INFO] snapshot org.apache.axis2:axis2-saaj-api:SNAPSHOT: checking for updates from apache.snapshots
[INFO] [compiler:compile]
Compiling 1 source file to /x1/continuum/working-directory/158/target/classes
Downloading: http://people.apache.org/repo/m2-incubating-repository/org/apache/axis2/axis2-jaxws-api/20070505.190015-76/axis2-jaxws-api-20070505.190015-76.pom
[WARNING] Unable to get resource 'org.apache.axis2:axis2-jaxws-api:pom:20070505.190015-76'
from repository apache-incubating-repository (http://people.apache.org/repo/m2-incubating-repository)
Downloading: http://repo1.maven.org/maven2/org/apache/axis2/axis2-jaxws-api/20070505.190015-76/axis2-jaxws-api-20070505.190015-76.pom
[WARNING] Unable to get resource 'org.apache.axis2:axis2-jaxws-api:pom:20070505.190015-76'
from repository central (http://repo1.maven.org/maven2)
[INFO] [antrun:run {execution: default}]
[INFO] Executing tasks
[INFO] Executed tasks
[INFO] [resources:testResources]
[INFO] Using default encoding to copy filtered resources.
[INFO] [compiler:testCompile]
[INFO] Nothing to compile - all classes are up to date
[INFO] [surefire:test]
[INFO] Surefire report directory: /x1/continuum/working-directory/158/target/surefire-reports

-------------------------------------------------------
 T E S T S
-------------------------------------------------------
Running org.apache.openejb.config.OpenEjb2CmpConversionTest
Tests run: 9, Failures: 0, Errors: 0, Skipped: 0, Time elapsed: 14.599 sec
Running org.apache.openejb.core.stateless.JaxWsWebServiceInvocationTest
Tests run: 1, Failures: 0, Errors: 0, Skipped: 0, Time elapsed: 6.585 sec
Running org.apache.openejb.core.stateless.StatelessInterceptorTest
Tests run: 1, Failures: 0, Errors: 0, Skipped: 0, Time elapsed: 6.25 sec
Running org.apache.openejb.core.mdb.MdbTest
Tests run: 1, Failures: 0, Errors: 0, Skipped: 0, Time elapsed: 12.323 sec
Running org.apache.openejb.core.stateful.StatefulInterceptorTest
Tests run: 1, Failures: 0, Errors: 0, Skipped: 0, Time elapsed: 5.903 sec
Running org.apache.openejb.config.ConfigureServiceTest
Tests run: 4, Failures: 0, Errors: 0, Skipped: 0, Time elapsed: 1.904 sec
Running org.apache.openejb.core.mdb.SimpleJmsTest
Tests run: 1, Failures: 0, Errors: 0, Skipped: 0, Time elapsed: 12.135 sec
Running org.apache.openejb.config.SunQueryFilterTest
Tests run: 5, Failures: 0, Errors: 0, Skipped: 0, Time elapsed: 0.139 sec
Running org.apache.openejb.config.SunCmpConversionTest
Tests run: 8, Failures: 0, Errors: 0, Skipped: 0, Time elapsed: 13.853 sec
Running org.apache.openejb.core.stateful.Compat3to2Test
Tests run: 1, Failures: 0, Errors: 0, Skipped: 0, Time elapsed: 6.246 sec
Running org.apache.openejb.ApplicationTest
WARNING: No test suite configuration file specified, assuming system properties contain all
needed information.  To specify a test suite configuration file by setting its location using
the system property "openejb.testsuite.properties"
test server = org.apache.openejb.test.IvmTestServer
entry = java.naming.factory.initial:org.apache.openejb.client.LocalInitialContextFactory
Apache OpenEJB 3.0-incubating-SNAPSHOT    build: 20070506-05:06
http://incubator.apache.org/openejb
Cannot start the test database: java.lang.IllegalStateException Cannot create initial context:
javax.naming.NamingException Attempted to load OpenEJB. No existing resource adapter defined
with id 'Default JMS Resource Adapter'.
Tests run: 1, Failures: 0, Errors: 1, Skipped: 0, Time elapsed: 12.72 sec <<< FAILURE!
Running org.apache.openejb.core.stateless.JaxRpcWebServiceInvocationTest
Tests run: 2, Failures: 0, Errors: 0, Skipped: 0, Time elapsed: 5.904 sec
Running org.apache.openejb.core.mdb.JmsProxyTest
Tests run: 1, Failures: 0, Errors: 0, Skipped: 0, Time elapsed: 12.336 sec
Running org.apache.openejb.assembler.classic.JdbcConfigTest
Tests run: 1, Failures: 0, Errors: 0, Skipped: 0, Time elapsed: 3.182 sec
Running org.apache.openejb.util.ClassesTest
Tests run: 1, Failures: 0, Errors: 0, Skipped: 0, Time elapsed: 0.098 sec
Running org.apache.openejb.core.ivm.naming.IvmContextTest
Tests run: 1, Failures: 0, Errors: 0, Skipped: 0, Time elapsed: 0.112 sec
Running org.apache.openejb.config.JaxbUnmarshallerTest
Tests run: 1, Failures: 0, Errors: 0, Skipped: 0, Time elapsed: 2.431 sec
Running org.apache.openejb.core.stateful.StatefulContainerTest
Tests run: 2, Failures: 0, Errors: 0, Skipped: 0, Time elapsed: 6.808 sec
Running org.apache.openejb.core.cmp.jpa.JpaTest
Tests run: 2, Failures: 0, Errors: 0, Skipped: 0, Time elapsed: 11.616 sec
Running org.apache.openejb.DependenceValidationTest
Tests run: 1, Failures: 0, Errors: 0, Skipped: 0, Time elapsed: 2.863 sec
Running org.apache.openejb.core.stateless.CrossClassLoaderProxyTest
Tests run: 4, Failures: 0, Errors: 0, Skipped: 0, Time elapsed: 1.744 sec
Running org.apache.openejb.core.stateless.ExtendedInjectionTest
Tests run: 2, Failures: 0, Errors: 0, Skipped: 0, Time elapsed: 1.644 sec
Running org.apache.openejb.core.stateful.StatefulSessionBeanTest
Tests run: 1, Failures: 0, Errors: 0, Skipped: 0, Time elapsed: 6.565 sec
Running org.apache.openejb.assembler.classic.RedeployTest
Tests run: 1, Failures: 0, Errors: 0, Skipped: 0, Time elapsed: 37.38 sec
Running org.apache.openejb.resource.SharedLocalConnectionManagerTest
Tests run: 1, Failures: 0, Errors: 0, Skipped: 0, Time elapsed: 1.539 sec
Running org.apache.openejb.assembler.classic.InterceptorBindingInfoComparatorTest
Tests run: 2, Failures: 0, Errors: 0, Skipped: 0, Time elapsed: 0.34 sec
Running org.apache.openejb.assembler.classic.MdbConfigTest
Tests run: 1, Failures: 0, Errors: 0, Skipped: 0, Time elapsed: 12.061 sec
Running org.apache.openejb.core.security.PropertiesLoginModuleTest
Path to login config: /x1/continuum/working-directory/158/target/test-classes/login.config
Path to login config: /x1/continuum/working-directory/158/target/test-classes/login.config
Path to login config: /x1/continuum/working-directory/158/target/test-classes/login.config
Tests run: 3, Failures: 0, Errors: 3, Skipped: 0, Time elapsed: 0.478 sec <<< FAILURE!
Running org.apache.openejb.assembler.classic.PersistenceUnitRefTest
Tests run: 1, Failures: 0, Errors: 0, Skipped: 0, Time elapsed: 0.215 sec
Running org.apache.openejb.config.OpenEjb2ConversionTest
Tests run: 9, Failures: 0, Errors: 0, Skipped: 0, Time elapsed: 10.499 sec
Running org.apache.openejb.resource.GeronimoConnectionManagerTest
Tests run: 1, Failures: 0, Errors: 0, Skipped: 0, Time elapsed: 1.342 sec
Running org.apache.openejb.core.mdb.JmsTest
Tests run: 1, Failures: 0, Errors: 0, Skipped: 0, Time elapsed: 12.095 sec
Running org.apache.openejb.SomeoneBrokeSurefireAndThisIsADirtyHackForItTest
WARNING: No test suite configuration file specified, assuming system properties contain all
needed information.  To specify a test suite configuration file by setting its location using
the system property "openejb.testsuite.properties"
test server = org.apache.openejb.test.IvmTestServer
entry = java.naming.factory.initial:org.apache.openejb.client.LocalInitialContextFactory
Apache OpenEJB 3.0-incubating-SNAPSHOT    build: 20070506-05:06
http://incubator.apache.org/openejb
Cannot start the test database: java.lang.IllegalStateException Cannot create initial context:
javax.naming.NamingException Attempted to load OpenEJB. org.apache.xbean.recipe.MissingAccessorException:
Unable to find a valid setter method: public void org.apache.openejb.core.mdb.MdbContainer.setServerUrl(java.lang.String):
Unable to find a valid setter method: public void org.apache.openejb.core.mdb.MdbContainer.setServerUrl(java.lang.String)
Tests run: 1, Failures: 0, Errors: 1, Skipped: 0, Time elapsed: 21.224 sec <<< FAILURE!
Running org.apache.openejb.iTest
Tests run: 0, Failures: 0, Errors: 0, Skipped: 0, Time elapsed: 0.062 sec
Running org.apache.openejb.core.stateless.StatelessContainerTest
Tests run: 3, Failures: 0, Errors: 0, Skipped: 0, Time elapsed: 1.452 sec
Running org.apache.openejb.core.TemporaryClassLoaderTest
Tests run: 1, Failures: 0, Errors: 0, Skipped: 0, Time elapsed: 0.262 sec
Running org.apache.openejb.core.security.SecurityTest
Tests run: 1, Failures: 0, Errors: 1, Skipped: 0, Time elapsed: 6.219 sec <<< FAILURE!
Running org.apache.openejb.assembler.classic.OpenEjbConfigurationValidationTest
Tests run: 1, Failures: 0, Errors: 0, Skipped: 0, Time elapsed: 0.478 sec

Results :
Tests run: 79, Failures: 0, Errors: 6, Skipped: 0

[INFO] ------------------------------------------------------------------------
[ERROR] BUILD FAILURE
[INFO] ------------------------------------------------------------------------
[INFO] There are test failures.
[INFO] ------------------------------------------------------------------------
[INFO] For more information, run Maven with the -e switch
[INFO] ------------------------------------------------------------------------
[INFO] Total time: 6 minutes 59 seconds
[INFO] Finished at: Sun May 06 05:13:01 PDT 2007
[INFO] Final Memory: 17M/33M
[INFO] ------------------------------------------------------------------------

****************************************************************************



Mime
View raw message