tomee-commits mailing list archives

Site index · List index
Message view « Date » · « Thread »
Top « Date » · « Thread »
From "Continuum@vmbuild.apache.org" <openejb-comm...@incubator.apache.org>
Subject [continuum] BUILD FAILURE: OpenEJB :: Container :: Core
Date Wed, 23 May 2007 07:17:48 GMT
Online report : http://vmbuild.apache.org/continuum/servlet/continuum/target/ProjectBuild.vm/view/ProjectBuild/id/158/buildId/156943
Build statistics:
  State: Failed
  Previous State: Failed
  Started at: Wed, 23 May 2007 00:11:27 -0700
  Finished at: Wed, 23 May 2007 00:17:48 -0700
  Total time: 6m 20s
  Build Trigger: Schedule
  Exit code: 1
  Building machine hostname: vmbuild.apache.org
  Operating system : Linux(unknown)
  Java version : 1.5.0_06(Sun Microsystems Inc.)

Changes
         dblevins          Fixed remove syntax to return a value/exception for business interfaces
and to bury it for all else

             /incubator/openejb/trunk/openejb3/container/openejb-core/src/main/java/org/apache/openejb/core/stateful/StatefulContainer.java
        
****************************************************************************
Output:
****************************************************************************
[INFO] Scanning for projects...
[INFO] ----------------------------------------------------------------------------
[INFO] Building OpenEJB :: Container :: Core
[INFO]    task-segment: [install]
[INFO] ----------------------------------------------------------------------------
[INFO] [resources:resources]
[INFO] Using default encoding to copy filtered resources.
[INFO] [dependency:copy {execution: copy}]
[INFO] Configured Artifact: org.apache.openejb:openejb-javaagent:3.0-incubating-SNAPSHOT:jar
[INFO] snapshot org.apache.openejb:openejb-javaagent:3.0-incubating-SNAPSHOT: checking for
updates from codehaus-snapshot
[INFO] snapshot org.apache.openejb:openejb-javaagent:3.0-incubating-SNAPSHOT: checking for
updates from apache-m2-snapshot
[INFO] snapshot org.apache.openejb:openejb-javaagent:3.0-incubating-SNAPSHOT: checking for
updates from apache.snapshots
[INFO] org.apache.openejb:openejb-javaagent:3.0-incubating-SNAPSHOT:jar already exists in
/x1/continuum/working-directory/158/target
[INFO] snapshot org.apache.openejb:openejb-loader:3.0-incubating-SNAPSHOT: checking for updates
from codehaus-snapshot
[INFO] snapshot org.apache.openejb:openejb-loader:3.0-incubating-SNAPSHOT: checking for updates
from apache-m2-snapshot
[INFO] snapshot org.apache.openejb:openejb-loader:3.0-incubating-SNAPSHOT: checking for updates
from apache.snapshots
[INFO] snapshot org.apache.openejb:openejb-jee:3.0-incubating-SNAPSHOT: checking for updates
from codehaus-snapshot
[INFO] snapshot org.apache.openejb:openejb-jee:3.0-incubating-SNAPSHOT: checking for updates
from apache-m2-snapshot
[INFO] snapshot org.apache.openejb:openejb-jee:3.0-incubating-SNAPSHOT: checking for updates
from apache.snapshots
[INFO] snapshot org.apache.xbean:xbean-finder:3.0-SNAPSHOT: checking for updates from codehaus-snapshot
[INFO] snapshot org.apache.xbean:xbean-finder:3.0-SNAPSHOT: checking for updates from apache-m2-snapshot
[INFO] snapshot org.apache.xbean:xbean-finder:3.0-SNAPSHOT: checking for updates from apache.snapshots
[INFO] snapshot org.apache.xbean:xbean:3.0-SNAPSHOT: checking for updates from codehaus-snapshot
[INFO] snapshot org.apache.xbean:xbean:3.0-SNAPSHOT: checking for updates from apache-m2-snapshot
[INFO] snapshot org.apache.xbean:xbean:3.0-SNAPSHOT: checking for updates from apache.snapshots
[INFO] snapshot org.apache.geronimo.specs:geronimo-stax-api_1.0_spec:1.0-SNAPSHOT: checking
for updates from codehaus-snapshot
[INFO] snapshot org.apache.geronimo.specs:geronimo-stax-api_1.0_spec:1.0-SNAPSHOT: checking
for updates from apache-m2-snapshot
[INFO] snapshot org.apache.geronimo.specs:geronimo-stax-api_1.0_spec:1.0-SNAPSHOT: checking
for updates from apache.snapshots
[INFO] snapshot org.apache.openejb:openejb-itests-app:3.0-incubating-SNAPSHOT: checking for
updates from codehaus-snapshot
[INFO] snapshot org.apache.openejb:openejb-itests-app:3.0-incubating-SNAPSHOT: checking for
updates from apache-m2-snapshot
[INFO] snapshot org.apache.openejb:openejb-itests-app:3.0-incubating-SNAPSHOT: checking for
updates from apache.snapshots
[INFO] snapshot org.apache.openejb:itests:3.0-incubating-SNAPSHOT: checking for updates from
codehaus-snapshot
[INFO] snapshot org.apache.openejb:itests:3.0-incubating-SNAPSHOT: checking for updates from
apache-m2-snapshot
[INFO] snapshot org.apache.openejb:itests:3.0-incubating-SNAPSHOT: checking for updates from
apache.snapshots
[INFO] snapshot org.apache.openejb:openejb-itests-beans:3.0-incubating-SNAPSHOT: checking
for updates from codehaus-snapshot
[INFO] snapshot org.apache.openejb:openejb-itests-beans:3.0-incubating-SNAPSHOT: checking
for updates from apache-m2-snapshot
[INFO] snapshot org.apache.openejb:openejb-itests-beans:3.0-incubating-SNAPSHOT: checking
for updates from apache.snapshots
[INFO] snapshot org.apache.openjpa:openjpa-persistence-jdbc:0.9.8-incubating-SNAPSHOT: checking
for updates from codehaus-snapshot
[INFO] snapshot org.apache.openjpa:openjpa-persistence-jdbc:0.9.8-incubating-SNAPSHOT: checking
for updates from apache-m2-snapshot
[INFO] snapshot org.apache.openjpa:openjpa-persistence-jdbc:0.9.8-incubating-SNAPSHOT: checking
for updates from apache.snapshots
13K downloaded
[INFO] snapshot org.apache.openjpa:openjpa-parent:0.9.8-incubating-SNAPSHOT: checking for
updates from codehaus-snapshot
[INFO] snapshot org.apache.openjpa:openjpa-parent:0.9.8-incubating-SNAPSHOT: checking for
updates from apache-m2-snapshot
[INFO] snapshot org.apache.openjpa:openjpa-parent:0.9.8-incubating-SNAPSHOT: checking for
updates from apache.snapshots
13K downloaded
[INFO] snapshot org.apache.openjpa:openjpa-jdbc-5:0.9.8-incubating-SNAPSHOT: checking for
updates from codehaus-snapshot
[INFO] snapshot org.apache.openjpa:openjpa-jdbc-5:0.9.8-incubating-SNAPSHOT: checking for
updates from apache-m2-snapshot
[INFO] snapshot org.apache.openjpa:openjpa-jdbc-5:0.9.8-incubating-SNAPSHOT: checking for
updates from apache.snapshots
1K downloaded
[INFO] snapshot org.apache.openjpa:openjpa-jdbc:0.9.8-incubating-SNAPSHOT: checking for updates
from codehaus-snapshot
[INFO] snapshot org.apache.openjpa:openjpa-jdbc:0.9.8-incubating-SNAPSHOT: checking for updates
from apache-m2-snapshot
[INFO] snapshot org.apache.openjpa:openjpa-jdbc:0.9.8-incubating-SNAPSHOT: checking for updates
from apache.snapshots
1K downloaded
[INFO] snapshot org.apache.openjpa:openjpa-kernel:0.9.8-incubating-SNAPSHOT: checking for
updates from codehaus-snapshot
[INFO] snapshot org.apache.openjpa:openjpa-kernel:0.9.8-incubating-SNAPSHOT: checking for
updates from apache-m2-snapshot
[INFO] snapshot org.apache.openjpa:openjpa-kernel:0.9.8-incubating-SNAPSHOT: checking for
updates from apache.snapshots
4K downloaded
[INFO] snapshot org.apache.openjpa:openjpa-lib:0.9.8-incubating-SNAPSHOT: checking for updates
from codehaus-snapshot
[INFO] snapshot org.apache.openjpa:openjpa-lib:0.9.8-incubating-SNAPSHOT: checking for updates
from apache-m2-snapshot
[INFO] snapshot org.apache.openjpa:openjpa-lib:0.9.8-incubating-SNAPSHOT: checking for updates
from apache.snapshots
3K downloaded
[INFO] snapshot org.apache.openjpa:openjpa-persistence:0.9.8-incubating-SNAPSHOT: checking
for updates from codehaus-snapshot
[INFO] snapshot org.apache.openjpa:openjpa-persistence:0.9.8-incubating-SNAPSHOT: checking
for updates from apache-m2-snapshot
[INFO] snapshot org.apache.openjpa:openjpa-persistence:0.9.8-incubating-SNAPSHOT: checking
for updates from apache.snapshots
1K downloaded
[INFO] snapshot org.apache.openjpa:openjpa-kernel-5:0.9.8-incubating-SNAPSHOT: checking for
updates from codehaus-snapshot
[INFO] snapshot org.apache.openjpa:openjpa-kernel-5:0.9.8-incubating-SNAPSHOT: checking for
updates from apache-m2-snapshot
[INFO] snapshot org.apache.openjpa:openjpa-kernel-5:0.9.8-incubating-SNAPSHOT: checking for
updates from apache.snapshots
1K downloaded
[INFO] snapshot org.apache.openejb:openejb-itests-client:3.0-incubating-SNAPSHOT: checking
for updates from codehaus-snapshot
[INFO] snapshot org.apache.openejb:openejb-itests-client:3.0-incubating-SNAPSHOT: checking
for updates from apache-m2-snapshot
[INFO] snapshot org.apache.openejb:openejb-itests-client:3.0-incubating-SNAPSHOT: checking
for updates from apache.snapshots
[INFO] snapshot org.apache.geronimo.modules:geronimo-connector:2.0-SNAPSHOT: checking for
updates from codehaus-snapshot
[INFO] snapshot org.apache.geronimo.modules:geronimo-connector:2.0-SNAPSHOT: checking for
updates from apache-m2-snapshot
[INFO] snapshot org.apache.geronimo.modules:geronimo-connector:2.0-SNAPSHOT: checking for
updates from apache.snapshots
[INFO] snapshot org.apache.geronimo.modules:modules:2.0-SNAPSHOT: checking for updates from
codehaus-snapshot
[INFO] snapshot org.apache.geronimo.modules:modules:2.0-SNAPSHOT: checking for updates from
apache-m2-snapshot
[INFO] snapshot org.apache.geronimo.modules:modules:2.0-SNAPSHOT: checking for updates from
apache.snapshots
[INFO] snapshot org.apache.geronimo:geronimo:2.0-SNAPSHOT: checking for updates from codehaus-snapshot
[INFO] snapshot org.apache.geronimo:geronimo:2.0-SNAPSHOT: checking for updates from apache-m2-snapshot
[INFO] snapshot org.apache.geronimo:geronimo:2.0-SNAPSHOT: checking for updates from apache.snapshots
[INFO] snapshot org.apache.geronimo.genesis.config:project-config:1.2-SNAPSHOT: checking for
updates from apache-snapshots
[INFO] snapshot org.apache.geronimo.genesis.config:project-config:1.2-SNAPSHOT: checking for
updates from codehaus-snapshot
[INFO] snapshot org.apache.geronimo.genesis.config:project-config:1.2-SNAPSHOT: checking for
updates from apache-m2-snapshot
[INFO] snapshot org.apache.geronimo.genesis.config:project-config:1.2-SNAPSHOT: checking for
updates from apache.snapshots
[INFO] snapshot org.apache.geronimo.genesis.config:config:1.2-SNAPSHOT: checking for updates
from apache-snapshots
[INFO] snapshot org.apache.geronimo.genesis.config:config:1.2-SNAPSHOT: checking for updates
from codehaus-snapshots
[INFO] snapshot org.apache.geronimo.genesis.config:config:1.2-SNAPSHOT: checking for updates
from codehaus-snapshot
[INFO] snapshot org.apache.geronimo.genesis.config:config:1.2-SNAPSHOT: checking for updates
from apache-m2-snapshot
[INFO] snapshot org.apache.geronimo.genesis.config:config:1.2-SNAPSHOT: checking for updates
from apache.snapshots
[INFO] snapshot org.apache.geronimo.genesis:genesis:1.2-SNAPSHOT: checking for updates from
apache-snapshots
[INFO] snapshot org.apache.geronimo.genesis:genesis:1.2-SNAPSHOT: checking for updates from
codehaus-snapshots
[INFO] snapshot org.apache.geronimo.genesis:genesis:1.2-SNAPSHOT: checking for updates from
codehaus-snapshot
[INFO] snapshot org.apache.geronimo.genesis:genesis:1.2-SNAPSHOT: checking for updates from
apache-m2-snapshot
[INFO] snapshot org.apache.geronimo.genesis:genesis:1.2-SNAPSHOT: checking for updates from
apache.snapshots
[INFO] snapshot org.apache.geronimo.modules:geronimo-transaction:2.0-SNAPSHOT: checking for
updates from codehaus-snapshot
[INFO] snapshot org.apache.geronimo.modules:geronimo-transaction:2.0-SNAPSHOT: checking for
updates from apache-m2-snapshot
[INFO] snapshot org.apache.geronimo.modules:geronimo-transaction:2.0-SNAPSHOT: checking for
updates from apache.snapshots
[INFO] snapshot org.apache.geronimo.modules:geronimo-transaction-jta11:2.0-SNAPSHOT: checking
for updates from codehaus-snapshot
[INFO] snapshot org.apache.geronimo.modules:geronimo-transaction-jta11:2.0-SNAPSHOT: checking
for updates from apache-m2-snapshot
[INFO] snapshot org.apache.geronimo.modules:geronimo-transaction-jta11:2.0-SNAPSHOT: checking
for updates from apache.snapshots
[INFO] snapshot org.apache.geronimo.javamail:geronimo-javamail_1.4_mail:1.1-SNAPSHOT: checking
for updates from codehaus-snapshot
[INFO] snapshot org.apache.geronimo.javamail:geronimo-javamail_1.4_mail:1.1-SNAPSHOT: checking
for updates from apache-m2-snapshot
[INFO] snapshot org.apache.geronimo.javamail:geronimo-javamail_1.4_mail:1.1-SNAPSHOT: checking
for updates from apache.snapshots
[INFO] snapshot org.apache.geronimo.javamail:javamail:1.1-SNAPSHOT: checking for updates from
codehaus-snapshot
[INFO] snapshot org.apache.geronimo.javamail:javamail:1.1-SNAPSHOT: checking for updates from
apache-m2-snapshot
[INFO] snapshot org.apache.geronimo.javamail:javamail:1.1-SNAPSHOT: checking for updates from
apache.snapshots
[INFO] snapshot org.apache.geronimo.javamail:geronimo-javamail_1.4_provider:1.1-SNAPSHOT:
checking for updates from codehaus-snapshot
[INFO] snapshot org.apache.geronimo.javamail:geronimo-javamail_1.4_provider:1.1-SNAPSHOT:
checking for updates from apache-m2-snapshot
[INFO] snapshot org.apache.geronimo.javamail:geronimo-javamail_1.4_provider:1.1-SNAPSHOT:
checking for updates from apache.snapshots
[INFO] snapshot org.apache.geronimo.specs:geronimo-javamail_1.4_spec:1.0-SNAPSHOT: checking
for updates from codehaus-snapshot
[INFO] snapshot org.apache.geronimo.specs:geronimo-javamail_1.4_spec:1.0-SNAPSHOT: checking
for updates from apache-m2-snapshot
[INFO] snapshot org.apache.geronimo.specs:geronimo-javamail_1.4_spec:1.0-SNAPSHOT: checking
for updates from apache.snapshots
[INFO] snapshot org.apache.xbean:xbean-reflect:3.0-SNAPSHOT: checking for updates from codehaus-snapshot
[INFO] snapshot org.apache.xbean:xbean-reflect:3.0-SNAPSHOT: checking for updates from apache-m2-snapshot
[INFO] snapshot org.apache.xbean:xbean-reflect:3.0-SNAPSHOT: checking for updates from apache.snapshots
[INFO] snapshot org.apache.xbean:xbean-naming:3.0-SNAPSHOT: checking for updates from codehaus-snapshot
[INFO] snapshot org.apache.xbean:xbean-naming:3.0-SNAPSHOT: checking for updates from apache-m2-snapshot
[INFO] snapshot org.apache.xbean:xbean-naming:3.0-SNAPSHOT: checking for updates from apache.snapshots
[INFO] snapshot org.apache.axis2:axis2-jaxws-api:SNAPSHOT: checking for updates from codehaus-snapshot
[INFO] snapshot org.apache.axis2:axis2-jaxws-api:SNAPSHOT: checking for updates from apache-m2-snapshot
[INFO] snapshot org.apache.axis2:axis2-jaxws-api:SNAPSHOT: checking for updates from apache.snapshots
Downloading: http://people.apache.org/repo/m2-snapshot-repository/org/apache/axis2/axis2-jaxws-api/SNAPSHOT/axis2-jaxws-api-20070523.060016-107.pom
1K downloaded
[INFO] snapshot org.apache.axis2:axis2-parent:SNAPSHOT: checking for updates from codehaus-snapshot
[INFO] snapshot org.apache.axis2:axis2-parent:SNAPSHOT: checking for updates from apache-m2-snapshot
[INFO] snapshot org.apache.axis2:axis2-parent:SNAPSHOT: checking for updates from apache.snapshots
Downloading: http://people.apache.org/repo/m2-snapshot-repository/org/apache/axis2/axis2-parent/SNAPSHOT/axis2-parent-20070523.060016-276.pom
27K downloaded
[INFO] snapshot org.apache.axis2:axis2-saaj-api:SNAPSHOT: checking for updates from codehaus-snapshot
[INFO] snapshot org.apache.axis2:axis2-saaj-api:SNAPSHOT: checking for updates from apache-m2-snapshot
[INFO] snapshot org.apache.axis2:axis2-saaj-api:SNAPSHOT: checking for updates from apache.snapshots
Downloading: http://people.apache.org/repo/m2-snapshot-repository/org/apache/axis2/axis2-saaj-api/SNAPSHOT/axis2-saaj-api-20070523.060016-107.pom
1K downloaded
376K downloaded
189K downloaded
16K downloaded
Downloading: http://people.apache.org/repo/m2-snapshot-repository/org/apache/axis2/axis2-saaj-api/SNAPSHOT/axis2-saaj-api-20070523.060016-107.jar
25K downloaded
986K downloaded
Downloading: http://people.apache.org/repo/m2-snapshot-repository/org/apache/axis2/axis2-jaxws-api/SNAPSHOT/axis2-jaxws-api-20070523.060016-107.jar
37K downloaded
1056K downloaded
18K downloaded
88K downloaded
[INFO] [compiler:compile]
Compiling 1 source file to /x1/continuum/working-directory/158/target/classes
Downloading: http://people.apache.org/repo/m2-incubating-repository/org/apache/axis2/axis2-jaxws-api/20070523.060016-107/axis2-jaxws-api-20070523.060016-107.pom
Downloading: http://repo1.maven.org/maven2/org/apache/axis2/axis2-jaxws-api/20070523.060016-107/axis2-jaxws-api-20070523.060016-107.pom
[INFO] [antrun:run {execution: default}]
[INFO] Executing tasks
[INFO] Executed tasks
[INFO] [resources:testResources]
[INFO] Using default encoding to copy filtered resources.
[INFO] [compiler:testCompile]
[INFO] Nothing to compile - all classes are up to date
[INFO] [surefire:test]
[INFO] Surefire report directory: /x1/continuum/working-directory/158/target/surefire-reports

-------------------------------------------------------
 T E S T S
-------------------------------------------------------
Running org.apache.openejb.config.OpenEjb2CmpConversionTest
Tests run: 9, Failures: 0, Errors: 0, Skipped: 0, Time elapsed: 10.368 sec
Running org.apache.openejb.core.stateless.JaxWsWebServiceInvocationTest
Tests run: 1, Failures: 0, Errors: 0, Skipped: 0, Time elapsed: 5.046 sec
Running org.apache.openejb.core.stateless.StatelessInterceptorTest
Tests run: 1, Failures: 0, Errors: 0, Skipped: 0, Time elapsed: 4.652 sec
Running org.apache.openejb.core.mdb.MdbTest
Tests run: 1, Failures: 0, Errors: 0, Skipped: 0, Time elapsed: 12.166 sec
Running org.apache.openejb.core.stateful.StatefulInterceptorTest
Tests run: 1, Failures: 0, Errors: 0, Skipped: 0, Time elapsed: 4.651 sec
Running org.apache.openejb.config.ConfigureServiceTest
Tests run: 4, Failures: 0, Errors: 0, Skipped: 0, Time elapsed: 1.394 sec
Running org.apache.openejb.core.mdb.SimpleJmsTest
Tests run: 1, Failures: 0, Errors: 0, Skipped: 0, Time elapsed: 12.104 sec
Running org.apache.openejb.config.SunQueryFilterTest
Tests run: 5, Failures: 0, Errors: 0, Skipped: 0, Time elapsed: 0.08 sec
Running org.apache.openejb.config.SunCmpConversionTest
Tests run: 8, Failures: 0, Errors: 0, Skipped: 0, Time elapsed: 11.746 sec
Running org.apache.openejb.core.stateful.Compat3to2Test
Tests run: 1, Failures: 0, Errors: 0, Skipped: 0, Time elapsed: 4.889 sec
Running org.apache.openejb.ApplicationTest
WARNING: No test suite configuration file specified, assuming system properties contain all
needed information.  To specify a test suite configuration file by setting its location using
the system property "openejb.testsuite.properties"
test server = org.apache.openejb.test.IvmTestServer
entry = java.naming.factory.initial:org.apache.openejb.client.LocalInitialContextFactory
Apache OpenEJB 3.0-incubating-SNAPSHOT    build: 20070523-12:12
http://incubator.apache.org/openejb
Cannot start the test database: java.lang.IllegalStateException Cannot create initial context:
javax.naming.NamingException Attempted to load OpenEJB. No existing resource adapter defined
with id 'Default JMS Resource Adapter'.
Tests run: 1, Failures: 0, Errors: 1, Skipped: 0, Time elapsed: 8.855 sec <<< FAILURE!
Running org.apache.openejb.core.stateless.JaxRpcWebServiceInvocationTest
Tests run: 2, Failures: 0, Errors: 0, Skipped: 0, Time elapsed: 4.719 sec
Running org.apache.openejb.core.mdb.JmsProxyTest
Tests run: 1, Failures: 0, Errors: 0, Skipped: 0, Time elapsed: 10.983 sec
Running org.apache.openejb.assembler.classic.JdbcConfigTest
Tests run: 1, Failures: 0, Errors: 0, Skipped: 0, Time elapsed: 2.417 sec
Running org.apache.openejb.util.ClassesTest
Tests run: 1, Failures: 0, Errors: 0, Skipped: 0, Time elapsed: 0.064 sec
Running org.apache.openejb.core.ivm.naming.IvmContextTest
Tests run: 1, Failures: 0, Errors: 0, Skipped: 0, Time elapsed: 0.106 sec
Running org.apache.openejb.config.JaxbUnmarshallerTest
Tests run: 1, Failures: 0, Errors: 0, Skipped: 0, Time elapsed: 1.973 sec
Running org.apache.openejb.core.stateful.StatefulContainerTest
Tests run: 2, Failures: 0, Errors: 0, Skipped: 0, Time elapsed: 5.512 sec
Running org.apache.openejb.core.cmp.jpa.JpaTest
Tests run: 2, Failures: 0, Errors: 0, Skipped: 0, Time elapsed: 8.258 sec
Running org.apache.openejb.DependenceValidationTest
Tests run: 1, Failures: 0, Errors: 0, Skipped: 0, Time elapsed: 2.008 sec
Running org.apache.openejb.core.stateless.CrossClassLoaderProxyTest
Tests run: 4, Failures: 0, Errors: 0, Skipped: 0, Time elapsed: 1.252 sec
Running org.apache.openejb.core.stateless.ExtendedInjectionTest
Tests run: 2, Failures: 0, Errors: 0, Skipped: 0, Time elapsed: 1.131 sec
Running org.apache.openejb.core.stateful.StatefulSessionBeanTest
Tests run: 1, Failures: 0, Errors: 0, Skipped: 0, Time elapsed: 6.6 sec
Running org.apache.openejb.assembler.classic.RedeployTest
Tests run: 1, Failures: 0, Errors: 0, Skipped: 0, Time elapsed: 37.317 sec
Running org.apache.openejb.resource.SharedLocalConnectionManagerTest
Tests run: 1, Failures: 0, Errors: 0, Skipped: 0, Time elapsed: 1.413 sec
Running org.apache.openejb.assembler.classic.InterceptorBindingInfoComparatorTest
Tests run: 2, Failures: 0, Errors: 0, Skipped: 0, Time elapsed: 0.344 sec
Running org.apache.openejb.assembler.classic.MdbConfigTest
Tests run: 1, Failures: 0, Errors: 0, Skipped: 0, Time elapsed: 10.438 sec
Running org.apache.openejb.core.security.PropertiesLoginModuleTest
Path to login config: /x1/continuum/working-directory/158/target/test-classes/login.config
Path to login config: /x1/continuum/working-directory/158/target/test-classes/login.config
Path to login config: /x1/continuum/working-directory/158/target/test-classes/login.config
Tests run: 3, Failures: 0, Errors: 3, Skipped: 0, Time elapsed: 0.511 sec <<< FAILURE!
Running org.apache.openejb.assembler.classic.PersistenceUnitRefTest
Tests run: 1, Failures: 0, Errors: 0, Skipped: 0, Time elapsed: 0.226 sec
Running org.apache.openejb.config.OpenEjb2ConversionTest
Tests run: 9, Failures: 0, Errors: 0, Skipped: 0, Time elapsed: 11.088 sec
Running org.apache.openejb.resource.GeronimoConnectionManagerTest
Tests run: 1, Failures: 0, Errors: 0, Skipped: 0, Time elapsed: 1.558 sec
Running org.apache.openejb.core.mdb.JmsTest
Tests run: 1, Failures: 0, Errors: 0, Skipped: 0, Time elapsed: 12.177 sec
Running org.apache.openejb.SomeoneBrokeSurefireAndThisIsADirtyHackForItTest
WARNING: No test suite configuration file specified, assuming system properties contain all
needed information.  To specify a test suite configuration file by setting its location using
the system property "openejb.testsuite.properties"
test server = org.apache.openejb.test.IvmTestServer
entry = java.naming.factory.initial:org.apache.openejb.client.LocalInitialContextFactory
Apache OpenEJB 3.0-incubating-SNAPSHOT    build: 20070523-12:12
http://incubator.apache.org/openejb
Cannot start the test database: java.lang.IllegalStateException Cannot create initial context:
javax.naming.NamingException Attempted to load OpenEJB. org.apache.xbean.recipe.MissingAccessorException:
Unable to find a valid setter method: public void org.apache.openejb.core.mdb.MdbContainer.setServerUrl(java.lang.String):
Unable to find a valid setter method: public void org.apache.openejb.core.mdb.MdbContainer.setServerUrl(java.lang.String)
Tests run: 1, Failures: 0, Errors: 1, Skipped: 0, Time elapsed: 25.439 sec <<< FAILURE!
Running org.apache.openejb.iTest
Tests run: 0, Failures: 0, Errors: 0, Skipped: 0, Time elapsed: 0.055 sec
Running org.apache.openejb.core.stateless.StatelessContainerTest
Tests run: 3, Failures: 0, Errors: 0, Skipped: 0, Time elapsed: 1.215 sec
Running org.apache.openejb.core.TemporaryClassLoaderTest
Tests run: 1, Failures: 0, Errors: 0, Skipped: 0, Time elapsed: 0.442 sec
Running org.apache.openejb.core.security.SecurityTest
Tests run: 1, Failures: 0, Errors: 1, Skipped: 0, Time elapsed: 4.915 sec <<< FAILURE!
Running org.apache.openejb.assembler.classic.OpenEjbConfigurationValidationTest
Tests run: 1, Failures: 0, Errors: 0, Skipped: 0, Time elapsed: 0.219 sec

Results :
Tests run: 79, Failures: 0, Errors: 6, Skipped: 0

[INFO] ------------------------------------------------------------------------
[ERROR] BUILD FAILURE
[INFO] ------------------------------------------------------------------------
[INFO] There are test failures.
[INFO] ------------------------------------------------------------------------
[INFO] For more information, run Maven with the -e switch
[INFO] ------------------------------------------------------------------------
[INFO] Total time: 6 minutes 18 seconds
[INFO] Finished at: Wed May 23 00:17:47 PDT 2007
[INFO] Final Memory: 15M/33M
[INFO] ------------------------------------------------------------------------

****************************************************************************



Mime
View raw message