tomee-commits mailing list archives

Site index · List index
Message view « Date » · « Thread »
Top « Date » · « Thread »
From "Continuum@vmbuild.apache.org" <openejb-comm...@incubator.apache.org>
Subject [continuum] BUILD FAILURE: OpenEJB :: Container :: Core
Date Wed, 30 May 2007 16:12:05 GMT
Online report : http://vmbuild.apache.org/continuum/servlet/continuum/target/ProjectBuild.vm/view/ProjectBuild/id/158/buildId/166190
Build statistics:
  State: Failed
  Previous State: Failed
  Started at: Wed, 30 May 2007 09:06:13 -0700
  Finished at: Wed, 30 May 2007 09:12:05 -0700
  Total time: 5m 52s
  Build Trigger: Schedule
  Exit code: 1
  Building machine hostname: vmbuild.apache.org
  Operating system : Linux(unknown)
  Java version : 1.5.0_06(Sun Microsystems Inc.)

Changes
         dain          EJB object handler RegistryId class must be serializable
             /incubator/openejb/trunk/openejb3/container/openejb-core/src/main/java/org/apache/openejb/core/entity/EntityEjbObjectHandler.java
            /incubator/openejb/trunk/openejb3/container/openejb-core/src/main/java/org/apache/openejb/core/stateful/StatefulEjbObjectHandler.java
        
****************************************************************************
Output:
****************************************************************************
[INFO] Scanning for projects...
[INFO] ----------------------------------------------------------------------------
[INFO] Building OpenEJB :: Container :: Core
[INFO]    task-segment: [install]
[INFO] ----------------------------------------------------------------------------
[INFO] [resources:resources]
[INFO] Using default encoding to copy filtered resources.
[INFO] [dependency:copy {execution: copy}]
[INFO] Configured Artifact: org.apache.openejb:openejb-javaagent:3.0-incubating-SNAPSHOT:jar
[INFO] snapshot org.apache.openejb:openejb-javaagent:3.0-incubating-SNAPSHOT: checking for
updates from codehaus-snapshot
[INFO] snapshot org.apache.openejb:openejb-javaagent:3.0-incubating-SNAPSHOT: checking for
updates from apache-m2-snapshot
[INFO] snapshot org.apache.openejb:openejb-javaagent:3.0-incubating-SNAPSHOT: checking for
updates from apache.snapshots
[INFO] Copying openejb-javaagent-3.0-incubating-SNAPSHOT.jar to /x1/continuum/working-directory/158/target/openejb-javaagent-3.0-incubating-SNAPSHOT.jar
[INFO] snapshot org.apache.openejb:openejb-loader:3.0-incubating-SNAPSHOT: checking for updates
from codehaus-snapshot
[INFO] snapshot org.apache.openejb:openejb-loader:3.0-incubating-SNAPSHOT: checking for updates
from apache-m2-snapshot
[INFO] snapshot org.apache.openejb:openejb-loader:3.0-incubating-SNAPSHOT: checking for updates
from apache.snapshots
[INFO] snapshot org.apache.openejb:openejb-jee:3.0-incubating-SNAPSHOT: checking for updates
from codehaus-snapshot
[INFO] snapshot org.apache.openejb:openejb-jee:3.0-incubating-SNAPSHOT: checking for updates
from apache-m2-snapshot
[INFO] snapshot org.apache.openejb:openejb-jee:3.0-incubating-SNAPSHOT: checking for updates
from apache.snapshots
[INFO] snapshot org.apache.xbean:xbean-finder:3.0-SNAPSHOT: checking for updates from codehaus-snapshot
[INFO] snapshot org.apache.xbean:xbean-finder:3.0-SNAPSHOT: checking for updates from apache-m2-snapshot
[INFO] snapshot org.apache.xbean:xbean-finder:3.0-SNAPSHOT: checking for updates from apache.snapshots
[INFO] snapshot org.apache.xbean:xbean:3.0-SNAPSHOT: checking for updates from codehaus-snapshot
[INFO] snapshot org.apache.xbean:xbean:3.0-SNAPSHOT: checking for updates from apache-m2-snapshot
[INFO] snapshot org.apache.xbean:xbean:3.0-SNAPSHOT: checking for updates from apache.snapshots
[INFO] snapshot org.apache.geronimo.specs:geronimo-stax-api_1.0_spec:1.0-SNAPSHOT: checking
for updates from codehaus-snapshot
[INFO] snapshot org.apache.geronimo.specs:geronimo-stax-api_1.0_spec:1.0-SNAPSHOT: checking
for updates from apache-m2-snapshot
[INFO] snapshot org.apache.geronimo.specs:geronimo-stax-api_1.0_spec:1.0-SNAPSHOT: checking
for updates from apache.snapshots
[INFO] snapshot org.apache.openejb:openejb-itests-app:3.0-incubating-SNAPSHOT: checking for
updates from codehaus-snapshot
[INFO] snapshot org.apache.openejb:openejb-itests-app:3.0-incubating-SNAPSHOT: checking for
updates from apache-m2-snapshot
[INFO] snapshot org.apache.openejb:openejb-itests-app:3.0-incubating-SNAPSHOT: checking for
updates from apache.snapshots
[INFO] snapshot org.apache.openejb:itests:3.0-incubating-SNAPSHOT: checking for updates from
codehaus-snapshot
[INFO] snapshot org.apache.openejb:itests:3.0-incubating-SNAPSHOT: checking for updates from
apache-m2-snapshot
[INFO] snapshot org.apache.openejb:itests:3.0-incubating-SNAPSHOT: checking for updates from
apache.snapshots
[INFO] snapshot org.apache.openejb:openejb-itests-beans:3.0-incubating-SNAPSHOT: checking
for updates from codehaus-snapshot
[INFO] snapshot org.apache.openejb:openejb-itests-beans:3.0-incubating-SNAPSHOT: checking
for updates from apache-m2-snapshot
[INFO] snapshot org.apache.openejb:openejb-itests-beans:3.0-incubating-SNAPSHOT: checking
for updates from apache.snapshots
[INFO] snapshot org.apache.openjpa:openjpa-persistence-jdbc:1.0.0-SNAPSHOT: checking for updates
from codehaus-snapshot
[INFO] snapshot org.apache.openjpa:openjpa-persistence-jdbc:1.0.0-SNAPSHOT: checking for updates
from apache-m2-snapshot
[INFO] snapshot org.apache.openjpa:openjpa-persistence-jdbc:1.0.0-SNAPSHOT: checking for updates
from apache.snapshots
Downloading: http://people.apache.org/repo/m2-snapshot-repository/org/apache/openjpa/openjpa-persistence-jdbc/1.0.0-SNAPSHOT/openjpa-persistence-jdbc-1.0.0-SNAPSHOT.pom
13K downloaded
[INFO] snapshot org.apache.openjpa:openjpa-parent:1.0.0-SNAPSHOT: checking for updates from
codehaus-snapshot
[INFO] snapshot org.apache.openjpa:openjpa-parent:1.0.0-SNAPSHOT: checking for updates from
apache-m2-snapshot
[INFO] snapshot org.apache.openjpa:openjpa-parent:1.0.0-SNAPSHOT: checking for updates from
apache.snapshots
[INFO] snapshot org.apache.openjpa:openjpa-jdbc-5:1.0.0-SNAPSHOT: checking for updates from
codehaus-snapshot
[INFO] snapshot org.apache.openjpa:openjpa-jdbc-5:1.0.0-SNAPSHOT: checking for updates from
apache-m2-snapshot
[INFO] snapshot org.apache.openjpa:openjpa-jdbc-5:1.0.0-SNAPSHOT: checking for updates from
apache.snapshots
Downloading: http://people.apache.org/repo/m2-snapshot-repository/org/apache/openjpa/openjpa-jdbc-5/1.0.0-SNAPSHOT/openjpa-jdbc-5-1.0.0-SNAPSHOT.pom
1K downloaded
[INFO] snapshot org.apache.openjpa:openjpa-jdbc:1.0.0-SNAPSHOT: checking for updates from
codehaus-snapshot
[INFO] snapshot org.apache.openjpa:openjpa-jdbc:1.0.0-SNAPSHOT: checking for updates from
apache-m2-snapshot
[INFO] snapshot org.apache.openjpa:openjpa-jdbc:1.0.0-SNAPSHOT: checking for updates from
apache.snapshots
Downloading: http://people.apache.org/repo/m2-snapshot-repository/org/apache/openjpa/openjpa-jdbc/1.0.0-SNAPSHOT/openjpa-jdbc-1.0.0-SNAPSHOT.pom
1K downloaded
[INFO] snapshot org.apache.openjpa:openjpa-kernel:1.0.0-SNAPSHOT: checking for updates from
codehaus-snapshot
[INFO] snapshot org.apache.openjpa:openjpa-kernel:1.0.0-SNAPSHOT: checking for updates from
apache-m2-snapshot
[INFO] snapshot org.apache.openjpa:openjpa-kernel:1.0.0-SNAPSHOT: checking for updates from
apache.snapshots
Downloading: http://people.apache.org/repo/m2-snapshot-repository/org/apache/openjpa/openjpa-kernel/1.0.0-SNAPSHOT/openjpa-kernel-1.0.0-SNAPSHOT.pom
4K downloaded
[INFO] snapshot org.apache.openjpa:openjpa-lib:1.0.0-SNAPSHOT: checking for updates from codehaus-snapshot
[INFO] snapshot org.apache.openjpa:openjpa-lib:1.0.0-SNAPSHOT: checking for updates from apache-m2-snapshot
[INFO] snapshot org.apache.openjpa:openjpa-lib:1.0.0-SNAPSHOT: checking for updates from apache.snapshots
3K downloaded
[INFO] snapshot org.apache.openjpa:openjpa-persistence:1.0.0-SNAPSHOT: checking for updates
from codehaus-snapshot
[INFO] snapshot org.apache.openjpa:openjpa-persistence:1.0.0-SNAPSHOT: checking for updates
from apache-m2-snapshot
[INFO] snapshot org.apache.openjpa:openjpa-persistence:1.0.0-SNAPSHOT: checking for updates
from apache.snapshots
Downloading: http://people.apache.org/repo/m2-snapshot-repository/org/apache/openjpa/openjpa-persistence/1.0.0-SNAPSHOT/openjpa-persistence-1.0.0-SNAPSHOT.pom
1K downloaded
[INFO] snapshot org.apache.openjpa:openjpa-kernel-5:1.0.0-SNAPSHOT: checking for updates from
codehaus-snapshot
[INFO] snapshot org.apache.openjpa:openjpa-kernel-5:1.0.0-SNAPSHOT: checking for updates from
apache-m2-snapshot
[INFO] snapshot org.apache.openjpa:openjpa-kernel-5:1.0.0-SNAPSHOT: checking for updates from
apache.snapshots
Downloading: http://people.apache.org/repo/m2-snapshot-repository/org/apache/openjpa/openjpa-kernel-5/1.0.0-SNAPSHOT/openjpa-kernel-5-1.0.0-SNAPSHOT.pom
1K downloaded
[INFO] snapshot org.apache.openejb:openejb-itests-client:3.0-incubating-SNAPSHOT: checking
for updates from codehaus-snapshot
[INFO] snapshot org.apache.openejb:openejb-itests-client:3.0-incubating-SNAPSHOT: checking
for updates from apache-m2-snapshot
[INFO] snapshot org.apache.openejb:openejb-itests-client:3.0-incubating-SNAPSHOT: checking
for updates from apache.snapshots
[INFO] snapshot org.apache.geronimo.modules:geronimo-connector:2.0-SNAPSHOT: checking for
updates from codehaus-snapshot
[INFO] snapshot org.apache.geronimo.modules:geronimo-connector:2.0-SNAPSHOT: checking for
updates from apache-m2-snapshot
[INFO] snapshot org.apache.geronimo.modules:geronimo-connector:2.0-SNAPSHOT: checking for
updates from apache.snapshots
[INFO] snapshot org.apache.geronimo.modules:modules:2.0-SNAPSHOT: checking for updates from
codehaus-snapshot
[INFO] snapshot org.apache.geronimo.modules:modules:2.0-SNAPSHOT: checking for updates from
apache-m2-snapshot
[INFO] snapshot org.apache.geronimo.modules:modules:2.0-SNAPSHOT: checking for updates from
apache.snapshots
[INFO] snapshot org.apache.geronimo:geronimo:2.0-SNAPSHOT: checking for updates from codehaus-snapshot
[INFO] snapshot org.apache.geronimo:geronimo:2.0-SNAPSHOT: checking for updates from apache-m2-snapshot
[INFO] snapshot org.apache.geronimo:geronimo:2.0-SNAPSHOT: checking for updates from apache.snapshots
[INFO] snapshot org.apache.geronimo.genesis.config:project-config:1.2-SNAPSHOT: checking for
updates from apache-snapshots
[INFO] snapshot org.apache.geronimo.genesis.config:project-config:1.2-SNAPSHOT: checking for
updates from codehaus-snapshot
[INFO] snapshot org.apache.geronimo.genesis.config:project-config:1.2-SNAPSHOT: checking for
updates from apache-m2-snapshot
[INFO] snapshot org.apache.geronimo.genesis.config:project-config:1.2-SNAPSHOT: checking for
updates from apache.snapshots
[INFO] snapshot org.apache.geronimo.genesis.config:config:1.2-SNAPSHOT: checking for updates
from apache-snapshots
[INFO] snapshot org.apache.geronimo.genesis.config:config:1.2-SNAPSHOT: checking for updates
from codehaus-snapshots
[INFO] snapshot org.apache.geronimo.genesis.config:config:1.2-SNAPSHOT: checking for updates
from codehaus-snapshot
[INFO] snapshot org.apache.geronimo.genesis.config:config:1.2-SNAPSHOT: checking for updates
from apache-m2-snapshot
[INFO] snapshot org.apache.geronimo.genesis.config:config:1.2-SNAPSHOT: checking for updates
from apache.snapshots
[INFO] snapshot org.apache.geronimo.genesis:genesis:1.2-SNAPSHOT: checking for updates from
apache-snapshots
[INFO] snapshot org.apache.geronimo.genesis:genesis:1.2-SNAPSHOT: checking for updates from
codehaus-snapshots
[INFO] snapshot org.apache.geronimo.genesis:genesis:1.2-SNAPSHOT: checking for updates from
codehaus-snapshot
[INFO] snapshot org.apache.geronimo.genesis:genesis:1.2-SNAPSHOT: checking for updates from
apache-m2-snapshot
[INFO] snapshot org.apache.geronimo.genesis:genesis:1.2-SNAPSHOT: checking for updates from
apache.snapshots
[INFO] snapshot org.apache.geronimo.modules:geronimo-transaction:2.0-SNAPSHOT: checking for
updates from codehaus-snapshot
[INFO] snapshot org.apache.geronimo.modules:geronimo-transaction:2.0-SNAPSHOT: checking for
updates from apache-m2-snapshot
[INFO] snapshot org.apache.geronimo.modules:geronimo-transaction:2.0-SNAPSHOT: checking for
updates from apache.snapshots
[INFO] snapshot org.apache.geronimo.modules:geronimo-transaction-jta11:2.0-SNAPSHOT: checking
for updates from codehaus-snapshot
[INFO] snapshot org.apache.geronimo.modules:geronimo-transaction-jta11:2.0-SNAPSHOT: checking
for updates from apache-m2-snapshot
[INFO] snapshot org.apache.geronimo.modules:geronimo-transaction-jta11:2.0-SNAPSHOT: checking
for updates from apache.snapshots
[INFO] snapshot org.apache.geronimo.javamail:geronimo-javamail_1.4_mail:1.1-SNAPSHOT: checking
for updates from codehaus-snapshot
[INFO] snapshot org.apache.geronimo.javamail:geronimo-javamail_1.4_mail:1.1-SNAPSHOT: checking
for updates from apache-m2-snapshot
[INFO] snapshot org.apache.geronimo.javamail:geronimo-javamail_1.4_mail:1.1-SNAPSHOT: checking
for updates from apache.snapshots
[INFO] snapshot org.apache.geronimo.javamail:javamail:1.1-SNAPSHOT: checking for updates from
codehaus-snapshot
[INFO] snapshot org.apache.geronimo.javamail:javamail:1.1-SNAPSHOT: checking for updates from
apache-m2-snapshot
[INFO] snapshot org.apache.geronimo.javamail:javamail:1.1-SNAPSHOT: checking for updates from
apache.snapshots
[INFO] snapshot org.apache.geronimo.javamail:geronimo-javamail_1.4_provider:1.1-SNAPSHOT:
checking for updates from codehaus-snapshot
[INFO] snapshot org.apache.geronimo.javamail:geronimo-javamail_1.4_provider:1.1-SNAPSHOT:
checking for updates from apache-m2-snapshot
[INFO] snapshot org.apache.geronimo.javamail:geronimo-javamail_1.4_provider:1.1-SNAPSHOT:
checking for updates from apache.snapshots
[INFO] snapshot org.apache.geronimo.specs:geronimo-javamail_1.4_spec:1.0-SNAPSHOT: checking
for updates from codehaus-snapshot
[INFO] snapshot org.apache.geronimo.specs:geronimo-javamail_1.4_spec:1.0-SNAPSHOT: checking
for updates from apache-m2-snapshot
[INFO] snapshot org.apache.geronimo.specs:geronimo-javamail_1.4_spec:1.0-SNAPSHOT: checking
for updates from apache.snapshots
[INFO] snapshot org.apache.xbean:xbean-reflect:3.0-SNAPSHOT: checking for updates from codehaus-snapshot
[INFO] snapshot org.apache.xbean:xbean-reflect:3.0-SNAPSHOT: checking for updates from apache-m2-snapshot
[INFO] snapshot org.apache.xbean:xbean-reflect:3.0-SNAPSHOT: checking for updates from apache.snapshots
[INFO] snapshot org.apache.xbean:xbean-naming:3.0-SNAPSHOT: checking for updates from codehaus-snapshot
[INFO] snapshot org.apache.xbean:xbean-naming:3.0-SNAPSHOT: checking for updates from apache-m2-snapshot
[INFO] snapshot org.apache.xbean:xbean-naming:3.0-SNAPSHOT: checking for updates from apache.snapshots
[INFO] snapshot org.apache.axis2:axis2-jaxws-api:SNAPSHOT: checking for updates from codehaus-snapshot
[INFO] snapshot org.apache.axis2:axis2-jaxws-api:SNAPSHOT: checking for updates from apache-m2-snapshot
[INFO] snapshot org.apache.axis2:axis2-jaxws-api:SNAPSHOT: checking for updates from apache.snapshots
Downloading: http://people.apache.org/repo/m2-snapshot-repository/org/apache/axis2/axis2-jaxws-api/SNAPSHOT/axis2-jaxws-api-20070530.140020-140.pom
1K downloaded
[INFO] snapshot org.apache.axis2:axis2-parent:SNAPSHOT: checking for updates from codehaus-snapshot
[INFO] snapshot org.apache.axis2:axis2-parent:SNAPSHOT: checking for updates from apache-m2-snapshot
[INFO] snapshot org.apache.axis2:axis2-parent:SNAPSHOT: checking for updates from apache.snapshots
Downloading: http://people.apache.org/repo/m2-snapshot-repository/org/apache/axis2/axis2-parent/SNAPSHOT/axis2-parent-20070530.160015-312.pom
28K downloaded
[INFO] snapshot org.apache.axis2:axis2-saaj-api:SNAPSHOT: checking for updates from codehaus-snapshot
[INFO] snapshot org.apache.axis2:axis2-saaj-api:SNAPSHOT: checking for updates from apache-m2-snapshot
[INFO] snapshot org.apache.axis2:axis2-saaj-api:SNAPSHOT: checking for updates from apache.snapshots
Downloading: http://people.apache.org/repo/m2-snapshot-repository/org/apache/axis2/axis2-saaj-api/SNAPSHOT/axis2-saaj-api-20070530.140020-141.pom
1K downloaded
Downloading: http://people.apache.org/repo/m2-snapshot-repository/org/apache/openjpa/openjpa-kernel/1.0.0-SNAPSHOT/openjpa-kernel-1.0.0-SNAPSHOT.jar
1056K downloaded
376K downloaded
Downloading: http://people.apache.org/repo/m2-snapshot-repository/org/apache/openjpa/openjpa-jdbc-5/1.0.0-SNAPSHOT/openjpa-jdbc-5-1.0.0-SNAPSHOT.jar
16K downloaded
Downloading: http://people.apache.org/repo/m2-snapshot-repository/org/apache/openjpa/openjpa-persistence-jdbc/1.0.0-SNAPSHOT/openjpa-persistence-jdbc-1.0.0-SNAPSHOT.jar
88K downloaded
Downloading: http://people.apache.org/repo/m2-snapshot-repository/org/apache/openjpa/openjpa-kernel-5/1.0.0-SNAPSHOT/openjpa-kernel-5-1.0.0-SNAPSHOT.jar
18K downloaded
Downloading: http://people.apache.org/repo/m2-snapshot-repository/org/apache/axis2/axis2-saaj-api/SNAPSHOT/axis2-saaj-api-20070530.140020-141.jar
25K downloaded
Downloading: http://people.apache.org/repo/m2-snapshot-repository/org/apache/axis2/axis2-jaxws-api/SNAPSHOT/axis2-jaxws-api-20070530.140020-140.jar
37K downloaded
Downloading: http://people.apache.org/repo/m2-snapshot-repository/org/apache/openjpa/openjpa-jdbc/1.0.0-SNAPSHOT/openjpa-jdbc-1.0.0-SNAPSHOT.jar
986K downloaded
Downloading: http://people.apache.org/repo/m2-snapshot-repository/org/apache/openjpa/openjpa-persistence/1.0.0-SNAPSHOT/openjpa-persistence-1.0.0-SNAPSHOT.jar
189K downloaded
[INFO] [compiler:compile]
Compiling 2 source files to /x1/continuum/working-directory/158/target/classes
Downloading: http://people.apache.org/repo/m2-incubating-repository/org/apache/axis2/axis2-jaxws-api/20070530.140020-140/axis2-jaxws-api-20070530.140020-140.pom
Downloading: http://tomcat.apache.org/dev/dist/m2-repository/org/apache/axis2/axis2-jaxws-api/20070530.140020-140/axis2-jaxws-api-20070530.140020-140.pom
Downloading: http://repo1.maven.org/maven2/org/apache/axis2/axis2-jaxws-api/20070530.140020-140/axis2-jaxws-api-20070530.140020-140.pom
[INFO] [antrun:run {execution: default}]
[INFO] Executing tasks
[INFO] Executed tasks
[INFO] [resources:testResources]
[INFO] Using default encoding to copy filtered resources.
[INFO] [compiler:testCompile]
[INFO] Nothing to compile - all classes are up to date
[INFO] [surefire:test]
[INFO] Surefire report directory: /x1/continuum/working-directory/158/target/surefire-reports

-------------------------------------------------------
 T E S T S
-------------------------------------------------------
Running org.apache.openejb.config.OpenEjb2CmpConversionTest
Tests run: 9, Failures: 2, Errors: 7, Skipped: 0, Time elapsed: 7.447 sec <<< FAILURE!
Running org.apache.openejb.core.stateless.JaxWsWebServiceInvocationTest
Tests run: 1, Failures: 0, Errors: 0, Skipped: 0, Time elapsed: 5.18 sec
Running org.apache.openejb.core.stateless.StatelessInterceptorTest
Tests run: 1, Failures: 0, Errors: 0, Skipped: 0, Time elapsed: 4.633 sec
Running org.apache.openejb.core.mdb.MdbTest
Tests run: 1, Failures: 0, Errors: 0, Skipped: 0, Time elapsed: 11.98 sec
Running org.apache.openejb.core.stateful.StatefulInterceptorTest
Tests run: 1, Failures: 0, Errors: 0, Skipped: 0, Time elapsed: 4.721 sec
Running org.apache.openejb.config.ConfigureServiceTest
Tests run: 4, Failures: 0, Errors: 0, Skipped: 0, Time elapsed: 1.33 sec
Running org.apache.openejb.core.mdb.SimpleJmsTest
Tests run: 1, Failures: 0, Errors: 0, Skipped: 0, Time elapsed: 10.953 sec
Running org.apache.openejb.config.SunQueryFilterTest
Tests run: 5, Failures: 0, Errors: 0, Skipped: 0, Time elapsed: 0.189 sec
Running org.apache.openejb.config.SunCmpConversionTest
Tests run: 8, Failures: 0, Errors: 0, Skipped: 0, Time elapsed: 11.389 sec
Running org.apache.openejb.core.stateful.Compat3to2Test
Tests run: 1, Failures: 0, Errors: 1, Skipped: 0, Time elapsed: 4.724 sec <<< FAILURE!
Running org.apache.openejb.ApplicationTest
WARNING: No test suite configuration file specified, assuming system properties contain all
needed information.  To specify a test suite configuration file by setting its location using
the system property "openejb.testsuite.properties"
test server = org.apache.openejb.test.IvmTestServer
entry = java.naming.factory.initial:org.apache.openejb.client.LocalInitialContextFactory
Apache OpenEJB 3.0-incubating-SNAPSHOT    build: 20070530-09:06
http://incubator.apache.org/openejb
Cannot start the test database: java.lang.IllegalStateException Cannot create initial context:
javax.naming.NamingException Attempted to load OpenEJB. No existing resource adapter defined
with id 'Default JMS Resource Adapter'.
Tests run: 1, Failures: 0, Errors: 1, Skipped: 0, Time elapsed: 9.269 sec <<< FAILURE!
Running org.apache.openejb.core.stateless.JaxRpcWebServiceInvocationTest
Tests run: 2, Failures: 0, Errors: 0, Skipped: 0, Time elapsed: 4.306 sec
Running org.apache.openejb.core.mdb.JmsProxyTest
Tests run: 1, Failures: 0, Errors: 0, Skipped: 0, Time elapsed: 10.981 sec
Running org.apache.openejb.assembler.classic.JdbcConfigTest
Tests run: 1, Failures: 0, Errors: 0, Skipped: 0, Time elapsed: 2.422 sec
Running org.apache.openejb.util.ClassesTest
Tests run: 1, Failures: 0, Errors: 0, Skipped: 0, Time elapsed: 0.066 sec
Running org.apache.openejb.core.ivm.naming.IvmContextTest
Tests run: 4, Failures: 0, Errors: 0, Skipped: 0, Time elapsed: 0.163 sec
Running org.apache.openejb.config.JaxbUnmarshallerTest
Tests run: 1, Failures: 0, Errors: 0, Skipped: 0, Time elapsed: 1.965 sec
Running org.apache.openejb.core.stateful.StatefulContainerTest
Tests run: 2, Failures: 0, Errors: 0, Skipped: 0, Time elapsed: 5.319 sec
Running org.apache.openejb.core.cmp.jpa.JpaTest
Tests run: 2, Failures: 0, Errors: 0, Skipped: 0, Time elapsed: 8.478 sec
Running org.apache.openejb.DependenceValidationTest
Tests run: 1, Failures: 0, Errors: 0, Skipped: 0, Time elapsed: 1.933 sec
Running org.apache.openejb.core.stateless.CrossClassLoaderProxyTest
Tests run: 4, Failures: 0, Errors: 0, Skipped: 0, Time elapsed: 1.154 sec
Running org.apache.openejb.core.stateless.ExtendedInjectionTest
Tests run: 2, Failures: 0, Errors: 0, Skipped: 0, Time elapsed: 1.17 sec
Running org.apache.openejb.core.stateful.StatefulSessionBeanTest
Tests run: 1, Failures: 0, Errors: 0, Skipped: 0, Time elapsed: 5.409 sec
Running org.apache.openejb.assembler.classic.RedeployTest
Tests run: 1, Failures: 0, Errors: 0, Skipped: 0, Time elapsed: 32.755 sec
Running org.apache.openejb.resource.SharedLocalConnectionManagerTest
Tests run: 1, Failures: 0, Errors: 0, Skipped: 0, Time elapsed: 1.344 sec
Running org.apache.openejb.assembler.classic.InterceptorBindingInfoComparatorTest
Tests run: 2, Failures: 0, Errors: 0, Skipped: 0, Time elapsed: 0.314 sec
Running org.apache.openejb.assembler.classic.MdbConfigTest
Tests run: 1, Failures: 0, Errors: 0, Skipped: 0, Time elapsed: 9.742 sec
Running org.apache.openejb.core.security.PropertiesLoginModuleTest
Path to login config: /x1/continuum/working-directory/158/target/test-classes/login.config
Path to login config: /x1/continuum/working-directory/158/target/test-classes/login.config
Path to login config: /x1/continuum/working-directory/158/target/test-classes/login.config
Tests run: 3, Failures: 0, Errors: 3, Skipped: 0, Time elapsed: 0.507 sec <<< FAILURE!
Running org.apache.openejb.assembler.classic.PersistenceUnitRefTest
Tests run: 1, Failures: 0, Errors: 0, Skipped: 0, Time elapsed: 0.201 sec
Running org.apache.openejb.config.OpenEjb2ConversionTest
Tests run: 9, Failures: 0, Errors: 0, Skipped: 0, Time elapsed: 10.563 sec
Running org.apache.openejb.resource.GeronimoConnectionManagerTest
Tests run: 1, Failures: 0, Errors: 0, Skipped: 0, Time elapsed: 1.344 sec
Running org.apache.openejb.core.mdb.JmsTest
Tests run: 1, Failures: 0, Errors: 0, Skipped: 0, Time elapsed: 11.75 sec
Running org.apache.openejb.SomeoneBrokeSurefireAndThisIsADirtyHackForItTest
WARNING: No test suite configuration file specified, assuming system properties contain all
needed information.  To specify a test suite configuration file by setting its location using
the system property "openejb.testsuite.properties"
test server = org.apache.openejb.test.IvmTestServer
entry = java.naming.factory.initial:org.apache.openejb.client.LocalInitialContextFactory
Apache OpenEJB 3.0-incubating-SNAPSHOT    build: 20070530-09:06
http://incubator.apache.org/openejb
Cannot start the test database: java.lang.IllegalStateException Cannot create initial context:
javax.naming.NamingException Attempted to load OpenEJB. org.apache.xbean.recipe.MissingAccessorException:
Unable to find a valid setter method: public void org.apache.openejb.core.mdb.MdbContainer.setServerUrl(java.lang.String):
Unable to find a valid setter method: public void org.apache.openejb.core.mdb.MdbContainer.setServerUrl(java.lang.String)
Tests run: 1, Failures: 0, Errors: 1, Skipped: 0, Time elapsed: 15.619 sec <<< FAILURE!
Running org.apache.openejb.iTest
Tests run: 0, Failures: 0, Errors: 0, Skipped: 0, Time elapsed: 0.026 sec
Running org.apache.openejb.core.stateless.StatelessContainerTest
Tests run: 3, Failures: 0, Errors: 0, Skipped: 0, Time elapsed: 0.986 sec
Running org.apache.openejb.core.TemporaryClassLoaderTest
Tests run: 1, Failures: 0, Errors: 0, Skipped: 0, Time elapsed: 0.191 sec
Running org.apache.openejb.core.security.SecurityTest
Tests run: 1, Failures: 0, Errors: 1, Skipped: 0, Time elapsed: 4.676 sec <<< FAILURE!
Running org.apache.openejb.assembler.classic.OpenEjbConfigurationValidationTest
Tests run: 1, Failures: 0, Errors: 0, Skipped: 0, Time elapsed: 0.206 sec

Results :
Tests run: 82, Failures: 2, Errors: 14, Skipped: 0

[INFO] ------------------------------------------------------------------------
[ERROR] BUILD FAILURE
[INFO] ------------------------------------------------------------------------
[INFO] There are test failures.
[INFO] ------------------------------------------------------------------------
[INFO] For more information, run Maven with the -e switch
[INFO] ------------------------------------------------------------------------
[INFO] Total time: 5 minutes 49 seconds
[INFO] Finished at: Wed May 30 09:12:04 PDT 2007
[INFO] Final Memory: 15M/34M
[INFO] ------------------------------------------------------------------------

****************************************************************************



Mime
View raw message