tomee-commits mailing list archives

Site index · List index
Message view « Date » · « Thread »
Top « Date » · « Thread »
From "Continuum@vmbuild.apache.org" <openejb-comm...@incubator.apache.org>
Subject [continuum] BUILD FAILURE: OpenEJB :: Container :: Core
Date Tue, 29 May 2007 23:05:06 GMT
Online report : http://vmbuild.apache.org/continuum/servlet/continuum/target/ProjectBuild.vm/view/ProjectBuild/id/158/buildId/165296
Build statistics:
  State: Failed
  Previous State: Failed
  Started at: Tue, 29 May 2007 15:59:26 -0700
  Finished at: Tue, 29 May 2007 16:05:06 -0700
  Total time: 5m 39s
  Build Trigger: Schedule
  Exit code: 1
  Building machine hostname: vmbuild.apache.org
  Operating system : Linux(unknown)
  Java version : 1.5.0_06(Sun Microsystems Inc.)

Changes
         dain          Attempted removal of a stateful EJB enrolled in a transaction should
cause a RemoveException
             /incubator/openejb/trunk/openejb3/container/openejb-core/src/main/java/org/apache/openejb/core/stateful/StatefulContainer.java
            /incubator/openejb/trunk/openejb3/container/openejb-core/src/main/java/org/apache/openejb/core/stateful/StatefulInstanceManager.java
            /incubator/openejb/trunk/openejb3/container/openejb-core/src/test/java/org/apache/openejb/core/stateful/StatefulContainerTest.java
            /incubator/openejb/trunk/openejb3/container/openejb-core/src/test/java/org/apache/openejb/core/stateful/StatefulSessionBeanTest.java
        
****************************************************************************
Output:
****************************************************************************
[INFO] Scanning for projects...
[INFO] ----------------------------------------------------------------------------
[INFO] Building OpenEJB :: Container :: Core
[INFO]    task-segment: [install]
[INFO] ----------------------------------------------------------------------------
[INFO] [resources:resources]
[INFO] Using default encoding to copy filtered resources.
[INFO] [dependency:copy {execution: copy}]
[INFO] Configured Artifact: org.apache.openejb:openejb-javaagent:3.0-incubating-SNAPSHOT:jar
[INFO] org.apache.openejb:openejb-javaagent:3.0-incubating-SNAPSHOT:jar already exists in
/x1/continuum/working-directory/158/target
[INFO] [compiler:compile]
Compiling 2 source files to /x1/continuum/working-directory/158/target/classes
Downloading: http://people.apache.org/repo/m2-incubating-repository/org/apache/axis2/axis2-jaxws-api/20070529.180017-138/axis2-jaxws-api-20070529.180017-138.pom
Downloading: http://tomcat.apache.org/dev/dist/m2-repository/org/apache/axis2/axis2-jaxws-api/20070529.180017-138/axis2-jaxws-api-20070529.180017-138.pom
Downloading: http://repo1.maven.org/maven2/org/apache/axis2/axis2-jaxws-api/20070529.180017-138/axis2-jaxws-api-20070529.180017-138.pom
[INFO] [antrun:run {execution: default}]
[INFO] Executing tasks
[INFO] Executed tasks
[INFO] [resources:testResources]
[INFO] Using default encoding to copy filtered resources.
[INFO] [compiler:testCompile]
Compiling 2 source files to /x1/continuum/working-directory/158/target/test-classes
[INFO] [surefire:test]
[INFO] Surefire report directory: /x1/continuum/working-directory/158/target/surefire-reports

-------------------------------------------------------
 T E S T S
-------------------------------------------------------
Running org.apache.openejb.config.OpenEjb2CmpConversionTest
Tests run: 9, Failures: 2, Errors: 7, Skipped: 0, Time elapsed: 7.294 sec <<< FAILURE!
Running org.apache.openejb.core.stateless.JaxWsWebServiceInvocationTest
Tests run: 1, Failures: 0, Errors: 0, Skipped: 0, Time elapsed: 5.207 sec
Running org.apache.openejb.core.stateless.StatelessInterceptorTest
Tests run: 1, Failures: 0, Errors: 0, Skipped: 0, Time elapsed: 4.628 sec
Running org.apache.openejb.core.mdb.MdbTest
Tests run: 1, Failures: 0, Errors: 0, Skipped: 0, Time elapsed: 11.964 sec
Running org.apache.openejb.core.stateful.StatefulInterceptorTest
Tests run: 1, Failures: 0, Errors: 0, Skipped: 0, Time elapsed: 4.503 sec
Running org.apache.openejb.config.ConfigureServiceTest
Tests run: 4, Failures: 0, Errors: 0, Skipped: 0, Time elapsed: 1.359 sec
Running org.apache.openejb.core.mdb.SimpleJmsTest
Tests run: 1, Failures: 0, Errors: 0, Skipped: 0, Time elapsed: 10.998 sec
Running org.apache.openejb.config.SunQueryFilterTest
Tests run: 5, Failures: 0, Errors: 0, Skipped: 0, Time elapsed: 0.081 sec
Running org.apache.openejb.config.SunCmpConversionTest
Tests run: 8, Failures: 0, Errors: 0, Skipped: 0, Time elapsed: 12.191 sec
Running org.apache.openejb.core.stateful.Compat3to2Test
Tests run: 1, Failures: 0, Errors: 1, Skipped: 0, Time elapsed: 5.118 sec <<< FAILURE!
Running org.apache.openejb.ApplicationTest
WARNING: No test suite configuration file specified, assuming system properties contain all
needed information.  To specify a test suite configuration file by setting its location using
the system property "openejb.testsuite.properties"
test server = org.apache.openejb.test.IvmTestServer
entry = java.naming.factory.initial:org.apache.openejb.client.LocalInitialContextFactory
Apache OpenEJB 3.0-incubating-SNAPSHOT    build: 20070529-03:59
http://incubator.apache.org/openejb
Cannot start the test database: java.lang.IllegalStateException Cannot create initial context:
javax.naming.NamingException Attempted to load OpenEJB. No existing resource adapter defined
with id 'Default JMS Resource Adapter'.
Tests run: 1, Failures: 0, Errors: 1, Skipped: 0, Time elapsed: 8.924 sec <<< FAILURE!
Running org.apache.openejb.core.stateless.JaxRpcWebServiceInvocationTest
Tests run: 2, Failures: 0, Errors: 0, Skipped: 0, Time elapsed: 4.203 sec
Running org.apache.openejb.core.mdb.JmsProxyTest
Tests run: 1, Failures: 0, Errors: 0, Skipped: 0, Time elapsed: 10.962 sec
Running org.apache.openejb.assembler.classic.JdbcConfigTest
Tests run: 1, Failures: 0, Errors: 0, Skipped: 0, Time elapsed: 2.544 sec
Running org.apache.openejb.util.ClassesTest
Tests run: 1, Failures: 0, Errors: 0, Skipped: 0, Time elapsed: 0.06 sec
Running org.apache.openejb.core.ivm.naming.IvmContextTest
Tests run: 4, Failures: 0, Errors: 0, Skipped: 0, Time elapsed: 0.141 sec
Running org.apache.openejb.config.JaxbUnmarshallerTest
Tests run: 1, Failures: 0, Errors: 0, Skipped: 0, Time elapsed: 1.8 sec
Running org.apache.openejb.core.stateful.StatefulContainerTest
Tests run: 2, Failures: 0, Errors: 0, Skipped: 0, Time elapsed: 5.504 sec
Running org.apache.openejb.core.cmp.jpa.JpaTest
Tests run: 2, Failures: 0, Errors: 0, Skipped: 0, Time elapsed: 8.61 sec
Running org.apache.openejb.DependenceValidationTest
Tests run: 1, Failures: 0, Errors: 0, Skipped: 0, Time elapsed: 2.083 sec
Running org.apache.openejb.core.stateless.CrossClassLoaderProxyTest
Tests run: 4, Failures: 0, Errors: 0, Skipped: 0, Time elapsed: 1.212 sec
Running org.apache.openejb.core.stateless.ExtendedInjectionTest
Tests run: 2, Failures: 0, Errors: 0, Skipped: 0, Time elapsed: 1.117 sec
Running org.apache.openejb.core.stateful.StatefulSessionBeanTest
Tests run: 1, Failures: 0, Errors: 0, Skipped: 0, Time elapsed: 4.634 sec
Running org.apache.openejb.assembler.classic.RedeployTest
Tests run: 1, Failures: 0, Errors: 0, Skipped: 0, Time elapsed: 31.455 sec
Running org.apache.openejb.resource.SharedLocalConnectionManagerTest
Tests run: 1, Failures: 0, Errors: 0, Skipped: 0, Time elapsed: 1.371 sec
Running org.apache.openejb.assembler.classic.InterceptorBindingInfoComparatorTest
Tests run: 2, Failures: 0, Errors: 0, Skipped: 0, Time elapsed: 0.311 sec
Running org.apache.openejb.assembler.classic.MdbConfigTest
Tests run: 1, Failures: 0, Errors: 0, Skipped: 0, Time elapsed: 9.63 sec
Running org.apache.openejb.core.security.PropertiesLoginModuleTest
Path to login config: /x1/continuum/working-directory/158/target/test-classes/login.config
Path to login config: /x1/continuum/working-directory/158/target/test-classes/login.config
Path to login config: /x1/continuum/working-directory/158/target/test-classes/login.config
Tests run: 3, Failures: 0, Errors: 3, Skipped: 0, Time elapsed: 0.441 sec <<< FAILURE!
Running org.apache.openejb.assembler.classic.PersistenceUnitRefTest
Tests run: 1, Failures: 0, Errors: 0, Skipped: 0, Time elapsed: 0.211 sec
Running org.apache.openejb.config.OpenEjb2ConversionTest
Tests run: 9, Failures: 0, Errors: 0, Skipped: 0, Time elapsed: 10.644 sec
Running org.apache.openejb.resource.GeronimoConnectionManagerTest
Tests run: 1, Failures: 0, Errors: 0, Skipped: 0, Time elapsed: 1.316 sec
Running org.apache.openejb.core.mdb.JmsTest
Tests run: 1, Failures: 0, Errors: 0, Skipped: 0, Time elapsed: 11.182 sec
Running org.apache.openejb.SomeoneBrokeSurefireAndThisIsADirtyHackForItTest
WARNING: No test suite configuration file specified, assuming system properties contain all
needed information.  To specify a test suite configuration file by setting its location using
the system property "openejb.testsuite.properties"
test server = org.apache.openejb.test.IvmTestServer
entry = java.naming.factory.initial:org.apache.openejb.client.LocalInitialContextFactory
Apache OpenEJB 3.0-incubating-SNAPSHOT    build: 20070529-03:59
http://incubator.apache.org/openejb
Cannot start the test database: java.lang.IllegalStateException Cannot create initial context:
javax.naming.NamingException Attempted to load OpenEJB. org.apache.xbean.recipe.MissingAccessorException:
Unable to find a valid setter method: public void org.apache.openejb.core.mdb.MdbContainer.setServerUrl(java.lang.String):
Unable to find a valid setter method: public void org.apache.openejb.core.mdb.MdbContainer.setServerUrl(java.lang.String)
Tests run: 1, Failures: 0, Errors: 1, Skipped: 0, Time elapsed: 16.426 sec <<< FAILURE!
Running org.apache.openejb.iTest
Tests run: 0, Failures: 0, Errors: 0, Skipped: 0, Time elapsed: 0.051 sec
Running org.apache.openejb.core.stateless.StatelessContainerTest
Tests run: 3, Failures: 0, Errors: 0, Skipped: 0, Time elapsed: 1.083 sec
Running org.apache.openejb.core.TemporaryClassLoaderTest
Tests run: 1, Failures: 0, Errors: 0, Skipped: 0, Time elapsed: 0.193 sec
Running org.apache.openejb.core.security.SecurityTest
Tests run: 1, Failures: 0, Errors: 1, Skipped: 0, Time elapsed: 5.773 sec <<< FAILURE!
Running org.apache.openejb.assembler.classic.OpenEjbConfigurationValidationTest
Tests run: 1, Failures: 0, Errors: 0, Skipped: 0, Time elapsed: 0.257 sec

Results :
Tests run: 82, Failures: 2, Errors: 14, Skipped: 0

[INFO] ------------------------------------------------------------------------
[ERROR] BUILD FAILURE
[INFO] ------------------------------------------------------------------------
[INFO] There are test failures.
[INFO] ------------------------------------------------------------------------
[INFO] For more information, run Maven with the -e switch
[INFO] ------------------------------------------------------------------------
[INFO] Total time: 5 minutes 36 seconds
[INFO] Finished at: Tue May 29 16:05:05 PDT 2007
[INFO] Final Memory: 15M/40M
[INFO] ------------------------------------------------------------------------

****************************************************************************



Mime
View raw message