tomee-commits mailing list archives

Site index · List index
Message view « Date » · « Thread »
Top « Date » · « Thread »
From "Continuum@vmbuild.apache.org" <openejb-comm...@incubator.apache.org>
Subject [continuum] BUILD FAILURE: OpenEJB :: Container :: Core
Date Fri, 01 Jun 2007 00:05:26 GMT
Online report : http://vmbuild.apache.org/continuum/servlet/continuum/target/ProjectBuild.vm/view/ProjectBuild/id/158/buildId/167717
Build statistics:
  State: Failed
  Previous State: Failed
  Started at: Thu, 31 May 2007 16:59:48 -0700
  Finished at: Thu, 31 May 2007 17:05:26 -0700
  Total time: 5m 38s
  Build Trigger: Forced
  Exit code: 1
  Building machine hostname: vmbuild.apache.org
  Operating system : Linux(unknown)
  Java version : 1.5.0_06(Sun Microsystems Inc.)

Changes
      No files changed
  
****************************************************************************
Output:
****************************************************************************
[INFO] Scanning for projects...
[INFO] ----------------------------------------------------------------------------
[INFO] Building OpenEJB :: Container :: Core
[INFO]    task-segment: [install]
[INFO] ----------------------------------------------------------------------------
[INFO] [resources:resources]
[INFO] Using default encoding to copy filtered resources.
[INFO] [dependency:copy {execution: copy}]
[INFO] Configured Artifact: org.apache.openejb:openejb-javaagent:3.0-incubating-SNAPSHOT:jar
[INFO] org.apache.openejb:openejb-javaagent:3.0-incubating-SNAPSHOT:jar already exists in
/x1/continuum/working-directory/158/target
[INFO] [compiler:compile]
[INFO] Nothing to compile - all classes are up to date
Downloading: http://people.apache.org/repo/m2-incubating-repository/org/apache/axis2/axis2-jaxws-api/20070530.160015-141/axis2-jaxws-api-20070530.160015-141.pom
Downloading: http://tomcat.apache.org/dev/dist/m2-repository/org/apache/axis2/axis2-jaxws-api/20070530.160015-141/axis2-jaxws-api-20070530.160015-141.pom
Downloading: http://repo1.maven.org/maven2/org/apache/axis2/axis2-jaxws-api/20070530.160015-141/axis2-jaxws-api-20070530.160015-141.pom
[INFO] [antrun:run {execution: default}]
[INFO] Executing tasks
[INFO] Executed tasks
[INFO] [resources:testResources]
[INFO] Using default encoding to copy filtered resources.
[INFO] [compiler:testCompile]
[INFO] Nothing to compile - all classes are up to date
[INFO] [surefire:test]
[INFO] Surefire report directory: /x1/continuum/working-directory/158/target/surefire-reports

-------------------------------------------------------
 T E S T S
-------------------------------------------------------
Running org.apache.openejb.config.OpenEjb2CmpConversionTest
Tests run: 9, Failures: 2, Errors: 7, Skipped: 0, Time elapsed: 6.965 sec <<< FAILURE!
Running org.apache.openejb.core.stateless.JaxWsWebServiceInvocationTest
Tests run: 1, Failures: 0, Errors: 0, Skipped: 0, Time elapsed: 5.195 sec
Running org.apache.openejb.core.stateless.StatelessInterceptorTest
Tests run: 1, Failures: 0, Errors: 0, Skipped: 0, Time elapsed: 4.739 sec
Running org.apache.openejb.core.mdb.MdbTest
Tests run: 1, Failures: 0, Errors: 0, Skipped: 0, Time elapsed: 12.265 sec
Running org.apache.openejb.core.stateful.StatefulInterceptorTest
Tests run: 1, Failures: 0, Errors: 0, Skipped: 0, Time elapsed: 5.001 sec
Running org.apache.openejb.config.ConfigureServiceTest
Tests run: 4, Failures: 0, Errors: 0, Skipped: 0, Time elapsed: 1.32 sec
Running org.apache.openejb.core.mdb.SimpleJmsTest
Tests run: 1, Failures: 0, Errors: 0, Skipped: 0, Time elapsed: 11.101 sec
Running org.apache.openejb.config.SunQueryFilterTest
Tests run: 5, Failures: 0, Errors: 0, Skipped: 0, Time elapsed: 0.082 sec
Running org.apache.openejb.config.SunCmpConversionTest
Tests run: 8, Failures: 0, Errors: 0, Skipped: 0, Time elapsed: 11.256 sec
Running org.apache.openejb.core.stateful.Compat3to2Test
Tests run: 1, Failures: 0, Errors: 0, Skipped: 0, Time elapsed: 5.184 sec
Running org.apache.openejb.ApplicationTest
WARNING: No test suite configuration file specified, assuming system properties contain all
needed information.  To specify a test suite configuration file by setting its location using
the system property "openejb.testsuite.properties"
test server = org.apache.openejb.test.IvmTestServer
entry = java.naming.factory.initial:org.apache.openejb.client.LocalInitialContextFactory
Apache OpenEJB 3.0-incubating-SNAPSHOT    build: 20070531-05:00
http://incubator.apache.org/openejb
Cannot start the test database: java.lang.IllegalStateException Cannot create initial context:
javax.naming.NamingException Attempted to load OpenEJB. No existing resource adapter defined
with id 'Default JMS Resource Adapter'.
Tests run: 1, Failures: 0, Errors: 1, Skipped: 0, Time elapsed: 9.317 sec <<< FAILURE!
Running org.apache.openejb.core.stateless.JaxRpcWebServiceInvocationTest
Tests run: 2, Failures: 0, Errors: 0, Skipped: 0, Time elapsed: 4.625 sec
Running org.apache.openejb.core.mdb.JmsProxyTest
Tests run: 1, Failures: 0, Errors: 0, Skipped: 0, Time elapsed: 11.14 sec
Running org.apache.openejb.assembler.classic.JdbcConfigTest
Tests run: 1, Failures: 0, Errors: 0, Skipped: 0, Time elapsed: 2.517 sec
Running org.apache.openejb.util.ClassesTest
Tests run: 1, Failures: 0, Errors: 0, Skipped: 0, Time elapsed: 0.052 sec
Running org.apache.openejb.core.ivm.naming.IvmContextTest
Tests run: 4, Failures: 0, Errors: 0, Skipped: 0, Time elapsed: 0.135 sec
Running org.apache.openejb.config.JaxbUnmarshallerTest
Tests run: 1, Failures: 0, Errors: 0, Skipped: 0, Time elapsed: 1.867 sec
Running org.apache.openejb.core.stateful.StatefulContainerTest
Tests run: 2, Failures: 0, Errors: 0, Skipped: 0, Time elapsed: 5.503 sec
Running org.apache.openejb.core.cmp.jpa.JpaTest
Tests run: 2, Failures: 0, Errors: 0, Skipped: 0, Time elapsed: 8.562 sec
Running org.apache.openejb.DependenceValidationTest
Tests run: 1, Failures: 0, Errors: 0, Skipped: 0, Time elapsed: 1.996 sec
Running org.apache.openejb.core.stateless.CrossClassLoaderProxyTest
Tests run: 4, Failures: 0, Errors: 0, Skipped: 0, Time elapsed: 1.282 sec
Running org.apache.openejb.core.stateless.ExtendedInjectionTest
Tests run: 2, Failures: 0, Errors: 0, Skipped: 0, Time elapsed: 1.447 sec
Running org.apache.openejb.core.stateful.StatefulSessionBeanTest
Tests run: 1, Failures: 0, Errors: 0, Skipped: 0, Time elapsed: 5.295 sec
Running org.apache.openejb.assembler.classic.RedeployTest
Tests run: 1, Failures: 0, Errors: 0, Skipped: 0, Time elapsed: 31.639 sec
Running org.apache.openejb.resource.SharedLocalConnectionManagerTest
Tests run: 1, Failures: 0, Errors: 0, Skipped: 0, Time elapsed: 1.39 sec
Running org.apache.openejb.assembler.classic.InterceptorBindingInfoComparatorTest
Tests run: 2, Failures: 0, Errors: 0, Skipped: 0, Time elapsed: 0.332 sec
Running org.apache.openejb.assembler.classic.MdbConfigTest
Tests run: 1, Failures: 0, Errors: 0, Skipped: 0, Time elapsed: 10.93 sec
Running org.apache.openejb.core.security.PropertiesLoginModuleTest
Path to login config: /x1/continuum/working-directory/158/target/test-classes/login.config
Path to login config: /x1/continuum/working-directory/158/target/test-classes/login.config
Path to login config: /x1/continuum/working-directory/158/target/test-classes/login.config
Tests run: 3, Failures: 0, Errors: 3, Skipped: 0, Time elapsed: 0.512 sec <<< FAILURE!
Running org.apache.openejb.assembler.classic.PersistenceUnitRefTest
Tests run: 1, Failures: 0, Errors: 0, Skipped: 0, Time elapsed: 0.273 sec
Running org.apache.openejb.config.OpenEjb2ConversionTest
Tests run: 9, Failures: 0, Errors: 0, Skipped: 0, Time elapsed: 11.674 sec
Running org.apache.openejb.resource.GeronimoConnectionManagerTest
Tests run: 1, Failures: 0, Errors: 0, Skipped: 0, Time elapsed: 1.277 sec
Running org.apache.openejb.core.mdb.JmsTest
Tests run: 1, Failures: 0, Errors: 0, Skipped: 0, Time elapsed: 11.009 sec
Running org.apache.openejb.SomeoneBrokeSurefireAndThisIsADirtyHackForItTest
WARNING: No test suite configuration file specified, assuming system properties contain all
needed information.  To specify a test suite configuration file by setting its location using
the system property "openejb.testsuite.properties"
test server = org.apache.openejb.test.IvmTestServer
entry = java.naming.factory.initial:org.apache.openejb.client.LocalInitialContextFactory
Apache OpenEJB 3.0-incubating-SNAPSHOT    build: 20070531-05:00
http://incubator.apache.org/openejb
Cannot start the test database: java.lang.IllegalStateException Cannot create initial context:
javax.naming.NamingException Attempted to load OpenEJB. org.apache.xbean.recipe.MissingAccessorException:
Unable to find a valid setter method: public void org.apache.openejb.core.mdb.MdbContainer.setServerUrl(java.lang.String):
Unable to find a valid setter method: public void org.apache.openejb.core.mdb.MdbContainer.setServerUrl(java.lang.String)
Tests run: 1, Failures: 0, Errors: 1, Skipped: 0, Time elapsed: 17.191 sec <<< FAILURE!
Running org.apache.openejb.iTest
Tests run: 0, Failures: 0, Errors: 0, Skipped: 0, Time elapsed: 0.028 sec
Running org.apache.openejb.core.stateless.StatelessContainerTest
Tests run: 3, Failures: 0, Errors: 0, Skipped: 0, Time elapsed: 1.007 sec
Running org.apache.openejb.core.TemporaryClassLoaderTest
Tests run: 1, Failures: 0, Errors: 0, Skipped: 0, Time elapsed: 0.25 sec
Running org.apache.openejb.core.security.SecurityTest
Tests run: 1, Failures: 0, Errors: 1, Skipped: 0, Time elapsed: 4.462 sec <<< FAILURE!
Running org.apache.openejb.assembler.classic.OpenEjbConfigurationValidationTest
Tests run: 1, Failures: 0, Errors: 0, Skipped: 0, Time elapsed: 0.206 sec

Results :
Tests run: 82, Failures: 2, Errors: 13, Skipped: 0

[INFO] ------------------------------------------------------------------------
[ERROR] BUILD FAILURE
[INFO] ------------------------------------------------------------------------
[INFO] There are test failures.
[INFO] ------------------------------------------------------------------------
[INFO] For more information, run Maven with the -e switch
[INFO] ------------------------------------------------------------------------
[INFO] Total time: 5 minutes 35 seconds
[INFO] Finished at: Thu May 31 17:05:25 PDT 2007
[INFO] Final Memory: 17M/30M
[INFO] ------------------------------------------------------------------------

****************************************************************************



Mime
View raw message