tomee-commits mailing list archives

Site index · List index
Message view « Date » · « Thread »
Top « Date » · « Thread »
From "Continuum@vmbuild.apache.org" <openejb-comm...@incubator.apache.org>
Subject [continuum] BUILD FAILURE: OpenEJB :: Server :: Axis
Date Sat, 05 May 2007 00:27:23 GMT
Online report : http://vmbuild.apache.org/continuum/servlet/continuum/target/ProjectBuild.vm/view/ProjectBuild/id/170/buildId/134847
Build statistics:
  State: Failed
  Previous State: Failed
  Started at: Fri, 4 May 2007 17:27:10 -0700
  Finished at: Fri, 4 May 2007 17:27:22 -0700
  Total time: 12s
  Build Trigger: Forced
  Exit code: 1
  Building machine hostname: vmbuild.apache.org
  Operating system : Linux(unknown)
  Java version : 1.5.0_06(Sun Microsystems Inc.)

Changes
      No files changed
  
****************************************************************************
Output:
****************************************************************************
[INFO] Scanning for projects...
[INFO] ----------------------------------------------------------------------------
[INFO] Building OpenEJB :: Server :: Axis
[INFO]    task-segment: [install]
[INFO] ----------------------------------------------------------------------------
[INFO] [resources:resources]
[INFO] Using default encoding to copy filtered resources.
[WARNING] POM for 'org.apache.openejb:openejb-core:pom:3.0-incubating-SNAPSHOT:compile' is
invalid. It will be ignored for artifact resolution. Reason: Failed to validate POM
[WARNING] POM for 'org.apache.openejb:openejb-core:pom:3.0-incubating-SNAPSHOT:compile' is
invalid. It will be ignored for artifact resolution. Reason: Failed to validate POM
Downloading: http://people.apache.org/repo/m2-incubating-repository/axis/axis-jaxrpc/1.4/axis-jaxrpc-1.4.pom
[WARNING] Unable to get resource 'axis:axis-jaxrpc:pom:1.4' from repository apache-incubating-repository
(http://people.apache.org/repo/m2-incubating-repository)
Downloading: http://repo1.maven.org/maven2/axis/axis-jaxrpc/1.4/axis-jaxrpc-1.4.pom
[WARNING] Unable to get resource 'axis:axis-jaxrpc:pom:1.4' from repository central (http://repo1.maven.org/maven2)
Downloading: http://people.apache.org/repo/m2-incubating-repository/axis/axis-saaj/1.4/axis-saaj-1.4.pom
[WARNING] Unable to get resource 'axis:axis-saaj:pom:1.4' from repository apache-incubating-repository
(http://people.apache.org/repo/m2-incubating-repository)
Downloading: http://repo1.maven.org/maven2/axis/axis-saaj/1.4/axis-saaj-1.4.pom
[WARNING] Unable to get resource 'axis:axis-saaj:pom:1.4' from repository central (http://repo1.maven.org/maven2)
[INFO] [compiler:compile]
Compiling 1 source file to /x1/continuum/working-directory/170/target/classes
[INFO] ------------------------------------------------------------------------
[ERROR] BUILD FAILURE
[INFO] ------------------------------------------------------------------------
[INFO] Compilation failure

/x1/continuum/working-directory/170/src/main/java/org/apache/openejb/server/axis/EjbContainerProvider.java:[43,25]
package javax.interceptor does not exist

/x1/continuum/working-directory/170/src/main/java/org/apache/openejb/server/axis/EjbContainerProvider.java:[44,25]
package javax.interceptor does not exist

/x1/continuum/working-directory/170/src/main/java/org/apache/openejb/server/axis/EjbContainerProvider.java:[125,32]
cannot find symbol
symbol  : class InvocationContext
location: class org.apache.openejb.server.axis.EjbContainerProvider.AxisRpcInterceptor

/x1/continuum/working-directory/170/src/main/java/org/apache/openejb/server/axis/EjbContainerProvider.java:[124,9]
cannot find symbol
symbol  : class AroundInvoke
location: class org.apache.openejb.server.axis.EjbContainerProvider.AxisRpcInterceptor

/x1/continuum/working-directory/170/src/main/java/org/apache/openejb/server/axis/EjbContainerProvider.java:[92,37]
cannot find symbol
symbol  : method invoke(java.lang.Object,java.lang.Class,java.lang.reflect.Method,java.lang.Object[],<nulltype>)
location: interface org.apache.openejb.RpcContainer


[INFO] ------------------------------------------------------------------------
[INFO] For more information, run Maven with the -e switch
[INFO] ------------------------------------------------------------------------
[INFO] Total time: 9 seconds
[INFO] Finished at: Fri May 04 17:27:22 PDT 2007
[INFO] Final Memory: 8M/17M
[INFO] ------------------------------------------------------------------------

****************************************************************************



Mime
View raw message