tomee-users mailing list archives

Site index · List index
Message view « Date » · « Thread »
Top « Date » · « Thread »
From "Valdemar Ferreira de Barros Junior \(CTS\)" <Valdemar.Bar...@sicoob.com.br>
Subject stacktrace
Date Wed, 18 Jul 2012 17:33:56 GMT
Informações - ********************************************************************************

Informações - OpenEJB http://openejb.apache.org/

Informações - Startup: Wed Jul 18 13:59:02 BRT 2012

Informações - Copyright 1999-2012 (C) Apache OpenEJB Project, All Rights Reserved.

Informações - Version: 4.0.0

Informações - Build date: 20120426

Informações - Build time: 08:49

Informações - ********************************************************************************

Informações - openejb.home = C:\SisbrIDE\workspace\EJBTestContainer

Informações - openejb.base = C:\SisbrIDE\workspace\EJBTestContainer

Informações - Created new singletonService org.apache.openejb.cdi.ThreadSingletonServiceImpl@6816af10

Informações - succeeded in installing singleton service

Informações - Cannot find the configuration file [conf/openejb.xml].  Will attempt to create
one for the beans deployed.

Informações - Configuring Service(id=Default Security Service, type=SecurityService, provider-id=Default
Security Service)

Informações - Configuring Service(id=Default Transaction Manager, type=TransactionManager,
provider-id=Default Transaction Manager)

Informações - Configuring Service(id=movieDatabaseUnmanaged, type=Resource, provider-id=Default
JDBC Database)

Informações - Configuring Service(id=movieDatabase, type=Resource, provider-id=Default JDBC
Database)

Advertência - Inspecting classpath for applications: 130 urls.

Advertência - ADJUST THE EXCLUDE/INCLUDE!!!.  Current settings: openejb.deployments.classpath.exclude='',
openejb.deployments.classpath.include='.*'

Grave - FATAL ERROR: Unknown error in Assembler.  Please send the following stack trace and
this message to users@openejb.apache.org :

java.lang.ArrayIndexOutOfBoundsException: 26

      at org.apache.xbean.asm.ClassReader.readClass(Unknown Source)

      at org.apache.xbean.asm.ClassReader.accept(Unknown Source)

      at org.apache.xbean.asm.ClassReader.accept(Unknown Source)

      at org.apache.openejb.util.AnnotationFinder.readClassDef(AnnotationFinder.java:282)

      at org.apache.openejb.util.AnnotationFinder.find(AnnotationFinder.java:162)

      at org.apache.openejb.config.DeploymentLoader.checkAnnotations(DeploymentLoader.java:1610)

      at org.apache.openejb.config.DeploymentLoader.discoverModuleType(DeploymentLoader.java:1564)

      at org.apache.openejb.config.DeploymentsResolver.processUrls(DeploymentsResolver.java:425)

      at org.apache.openejb.config.DeploymentsResolver.loadFromClasspath(DeploymentsResolver.java:264)

      at org.apache.openejb.config.ConfigurationFactory.getModulesFromClassPath(ConfigurationFactory.java:550)

      at org.apache.openejb.config.ConfigurationFactory.getOpenEjbConfiguration(ConfigurationFactory.java:463)

      at org.apache.openejb.assembler.classic.Assembler.getOpenEjbConfiguration(Assembler.java:345)

      at org.apache.openejb.assembler.classic.Assembler.build(Assembler.java:324)

      at org.apache.openejb.OpenEJB$Instance.<init>(OpenEJB.java:144)

      at org.apache.openejb.OpenEJB$Instance.<init>(OpenEJB.java:65)

      at org.apache.openejb.OpenEJB.init(OpenEJB.java:290)

      at org.apache.openejb.OpenEJB.init(OpenEJB.java:269)

      at sun.reflect.NativeMethodAccessorImpl.invoke0(Native Method)

      at sun.reflect.NativeMethodAccessorImpl.invoke(NativeMethodAccessorImpl.java:57)

      at sun.reflect.DelegatingMethodAccessorImpl.invoke(DelegatingMethodAccessorImpl.java:43)

      at java.lang.reflect.Method.invoke(Method.java:601)

      at org.apache.openejb.loader.OpenEJBInstance.init(OpenEJBInstance.java:36)

      at org.apache.openejb.core.LocalInitialContextFactory.init(LocalInitialContextFactory.java:69)

      at org.apache.openejb.core.LocalInitialContextFactory.init(LocalInitialContextFactory.java:51)

      at org.apache.openejb.core.LocalInitialContextFactory.getInitialContext(LocalInitialContextFactory.java:40)

      at javax.naming.spi.NamingManager.getInitialContext(NamingManager.java:684)

      at javax.naming.InitialContext.getDefaultInitCtx(InitialContext.java:307)

      at javax.naming.InitialContext.init(InitialContext.java:242)

      at javax.naming.InitialContext.<init>(InitialContext.java:216)

      at br.com.sicoob.TesteContainerEJB.testandoContainer(TesteContainerEJB.java:32)

      at sun.reflect.NativeMethodAccessorImpl.invoke0(Native Method)

      at sun.reflect.NativeMethodAccessorImpl.invoke(NativeMethodAccessorImpl.java:57)

      at sun.reflect.DelegatingMethodAccessorImpl.invoke(DelegatingMethodAccessorImpl.java:43)

      at java.lang.reflect.Method.invoke(Method.java:601)

      at org.testng.internal.MethodInvocationHelper.invokeMethod(MethodInvocationHelper.java:80)

      at org.testng.internal.Invoker.invokeMethod(Invoker.java:715)

      at org.testng.internal.Invoker.invokeTestMethod(Invoker.java:907)

      at org.testng.internal.Invoker.invokeTestMethods(Invoker.java:1237)

      at org.testng.internal.TestMethodWorker.invokeTestMethods(TestMethodWorker.java:127)

      at org.testng.internal.TestMethodWorker.run(TestMethodWorker.java:111)

      at org.testng.TestRunner.privateRun(TestRunner.java:767)

      at org.testng.TestRunner.run(TestRunner.java:617)

      at org.testng.SuiteRunner.runTest(SuiteRunner.java:334)

      at org.testng.SuiteRunner.runSequentially(SuiteRunner.java:329)

      at org.testng.SuiteRunner.privateRun(SuiteRunner.java:291)

      at org.testng.SuiteRunner.run(SuiteRunner.java:240)

      at org.testng.SuiteRunnerWorker.runSuite(SuiteRunnerWorker.java:51)

      at org.testng.SuiteRunnerWorker.run(SuiteRunnerWorker.java:85)

      at org.testng.TestNG.runSuitesSequentially(TestNG.java:1197)

      at org.testng.TestNG.runSuitesLocally(TestNG.java:1122)

      at org.testng.TestNG.run(TestNG.java:1030)

      at org.testng.remote.RemoteTestNG.run(RemoteTestNG.java:111)

      at org.testng.remote.RemoteTestNG.initAndRun(RemoteTestNG.java:204)

      at org.testng.remote.RemoteTestNG.main(RemoteTestNG.java:175)

 

Grave - OpenEJB has encountered a fatal error and cannot be started: Assembler failed to build
the container system.

org.apache.openejb.OpenEJBException: java.lang.ArrayIndexOutOfBoundsException: 26: 26

      at org.apache.openejb.assembler.classic.Assembler.build(Assembler.java:338)

      at org.apache.openejb.OpenEJB$Instance.<init>(OpenEJB.java:144)

      at org.apache.openejb.OpenEJB$Instance.<init>(OpenEJB.java:65)

      at org.apache.openejb.OpenEJB.init(OpenEJB.java:290)

      at org.apache.openejb.OpenEJB.init(OpenEJB.java:269)

      at sun.reflect.NativeMethodAccessorImpl.invoke0(Native Method)

      at sun.reflect.NativeMethodAccessorImpl.invoke(NativeMethodAccessorImpl.java:57)

      at sun.reflect.DelegatingMethodAccessorImpl.invoke(DelegatingMethodAccessorImpl.java:43)

      at java.lang.reflect.Method.invoke(Method.java:601)

      at org.apache.openejb.loader.OpenEJBInstance.init(OpenEJBInstance.java:36)

      at org.apache.openejb.core.LocalInitialContextFactory.init(LocalInitialContextFactory.java:69)

      at org.apache.openejb.core.LocalInitialContextFactory.init(LocalInitialContextFactory.java:51)

      at org.apache.openejb.core.LocalInitialContextFactory.getInitialContext(LocalInitialContextFactory.java:40)

      at javax.naming.spi.NamingManager.getInitialContext(NamingManager.java:684)

      at javax.naming.InitialContext.getDefaultInitCtx(InitialContext.java:307)

      at javax.naming.InitialContext.init(InitialContext.java:242)

      at javax.naming.InitialContext.<init>(InitialContext.java:216)

      at br.com.sicoob.TesteContainerEJB.testandoContainer(TesteContainerEJB.java:32)

      at sun.reflect.NativeMethodAccessorImpl.invoke0(Native Method)

      at sun.reflect.NativeMethodAccessorImpl.invoke(NativeMethodAccessorImpl.java:57)

      at sun.reflect.DelegatingMethodAccessorImpl.invoke(DelegatingMethodAccessorImpl.java:43)

      at java.lang.reflect.Method.invoke(Method.java:601)

      at org.testng.internal.MethodInvocationHelper.invokeMethod(MethodInvocationHelper.java:80)

      at org.testng.internal.Invoker.invokeMethod(Invoker.java:715)

      at org.testng.internal.Invoker.invokeTestMethod(Invoker.java:907)

      at org.testng.internal.Invoker.invokeTestMethods(Invoker.java:1237)

      at org.testng.internal.TestMethodWorker.invokeTestMethods(TestMethodWorker.java:127)

      at org.testng.internal.TestMethodWorker.run(TestMethodWorker.java:111)

      at org.testng.TestRunner.privateRun(TestRunner.java:767)

      at org.testng.TestRunner.run(TestRunner.java:617)

      at org.testng.SuiteRunner.runTest(SuiteRunner.java:334)

      at org.testng.SuiteRunner.runSequentially(SuiteRunner.java:329)

      at org.testng.SuiteRunner.privateRun(SuiteRunner.java:291)

      at org.testng.SuiteRunner.run(SuiteRunner.java:240)

      at org.testng.SuiteRunnerWorker.runSuite(SuiteRunnerWorker.java:51)

      at org.testng.SuiteRunnerWorker.run(SuiteRunnerWorker.java:85)

      at org.testng.TestNG.runSuitesSequentially(TestNG.java:1197)

      at org.testng.TestNG.runSuitesLocally(TestNG.java:1122)

      at org.testng.TestNG.run(TestNG.java:1030)

      at org.testng.remote.RemoteTestNG.run(RemoteTestNG.java:111)

      at org.testng.remote.RemoteTestNG.initAndRun(RemoteTestNG.java:204)

      at org.testng.remote.RemoteTestNG.main(RemoteTestNG.java:175)

Caused by: java.lang.ArrayIndexOutOfBoundsException: 26

      at org.apache.xbean.asm.ClassReader.readClass(Unknown Source)

      at org.apache.xbean.asm.ClassReader.accept(Unknown Source)

      at org.apache.xbean.asm.ClassReader.accept(Unknown Source)

      at org.apache.openejb.util.AnnotationFinder.readClassDef(AnnotationFinder.java:282)

      at org.apache.openejb.util.AnnotationFinder.find(AnnotationFinder.java:162)

      at org.apache.openejb.config.DeploymentLoader.checkAnnotations(DeploymentLoader.java:1610)

      at org.apache.openejb.config.DeploymentLoader.discoverModuleType(DeploymentLoader.java:1564)

      at org.apache.openejb.config.DeploymentsResolver.processUrls(DeploymentsResolver.java:425)

      at org.apache.openejb.config.DeploymentsResolver.loadFromClasspath(DeploymentsResolver.java:264)

      at org.apache.openejb.config.ConfigurationFactory.getModulesFromClassPath(ConfigurationFactory.java:550)

      at org.apache.openejb.config.ConfigurationFactory.getOpenEjbConfiguration(ConfigurationFactory.java:463)

      at org.apache.openejb.assembler.classic.Assembler.getOpenEjbConfiguration(Assembler.java:345)

      at org.apache.openejb.assembler.classic.Assembler.build(Assembler.java:324)

      ... 41 more

javax.naming.NamingException: Attempted to load OpenEJB. java.lang.ArrayIndexOutOfBoundsException:
26: 26 [Root exception is org.apache.openejb.OpenEJBException: java.lang.ArrayIndexOutOfBoundsException:
26: 26]

      at org.apache.openejb.core.LocalInitialContextFactory.init(LocalInitialContextFactory.java:53)

      at org.apache.openejb.core.LocalInitialContextFactory.getInitialContext(LocalInitialContextFactory.java:40)

      at javax.naming.spi.NamingManager.getInitialContext(NamingManager.java:684)

      at javax.naming.InitialContext.getDefaultInitCtx(InitialContext.java:307)

      at javax.naming.InitialContext.init(InitialContext.java:242)

      at javax.naming.InitialContext.<init>(InitialContext.java:216)

      at br.com.sicoob.TesteContainerEJB.testandoContainer(TesteContainerEJB.java:32)

      at sun.reflect.NativeMethodAccessorImpl.invoke0(Native Method)

      at sun.reflect.NativeMethodAccessorImpl.invoke(NativeMethodAccessorImpl.java:57)

      at sun.reflect.DelegatingMethodAccessorImpl.invoke(DelegatingMethodAccessorImpl.java:43)

      at java.lang.reflect.Method.invoke(Method.java:601)

      at org.testng.internal.MethodInvocationHelper.invokeMethod(MethodInvocationHelper.java:80)

      at org.testng.internal.Invoker.invokeMethod(Invoker.java:715)

      at org.testng.internal.Invoker.invokeTestMethod(Invoker.java:907)

      at org.testng.internal.Invoker.invokeTestMethods(Invoker.java:1237)

      at org.testng.internal.TestMethodWorker.invokeTestMethods(TestMethodWorker.java:127)

      at org.testng.internal.TestMethodWorker.run(TestMethodWorker.java:111)

      at org.testng.TestRunner.privateRun(TestRunner.java:767)

      at org.testng.TestRunner.run(TestRunner.java:617)

      at org.testng.SuiteRunner.runTest(SuiteRunner.java:334)

      at org.testng.SuiteRunner.runSequentially(SuiteRunner.java:329)

      at org.testng.SuiteRunner.privateRun(SuiteRunner.java:291)

      at org.testng.SuiteRunner.run(SuiteRunner.java:240)

      at org.testng.SuiteRunnerWorker.runSuite(SuiteRunnerWorker.java:51)

      at org.testng.SuiteRunnerWorker.run(SuiteRunnerWorker.java:85)

      at org.testng.TestNG.runSuitesSequentially(TestNG.java:1197)

      at org.testng.TestNG.runSuitesLocally(TestNG.java:1122)

      at org.testng.TestNG.run(TestNG.java:1030)

      at org.testng.remote.RemoteTestNG.run(RemoteTestNG.java:111)

      at org.testng.remote.RemoteTestNG.initAndRun(RemoteTestNG.java:204)

      at org.testng.remote.RemoteTestNG.main(RemoteTestNG.java:175)

Caused by: org.apache.openejb.OpenEJBException: java.lang.ArrayIndexOutOfBoundsException:
26: 26

      at org.apache.openejb.assembler.classic.Assembler.build(Assembler.java:338)

      at org.apache.openejb.OpenEJB$Instance.<init>(OpenEJB.java:144)

      at org.apache.openejb.OpenEJB$Instance.<init>(OpenEJB.java:65)

      at org.apache.openejb.OpenEJB.init(OpenEJB.java:290)

      at org.apache.openejb.OpenEJB.init(OpenEJB.java:269)

      at sun.reflect.NativeMethodAccessorImpl.invoke0(Native Method)

      at sun.reflect.NativeMethodAccessorImpl.invoke(NativeMethodAccessorImpl.java:57)

      at sun.reflect.DelegatingMethodAccessorImpl.invoke(DelegatingMethodAccessorImpl.java:43)

      at java.lang.reflect.Method.invoke(Method.java:601)

      at org.apache.openejb.loader.OpenEJBInstance.init(OpenEJBInstance.java:36)

      at org.apache.openejb.core.LocalInitialContextFactory.init(LocalInitialContextFactory.java:69)

      at org.apache.openejb.core.LocalInitialContextFactory.init(LocalInitialContextFactory.java:51)

      ... 30 more

Caused by: java.lang.ArrayIndexOutOfBoundsException: 26

      at org.apache.xbean.asm.ClassReader.readClass(Unknown Source)

      at org.apache.xbean.asm.ClassReader.accept(Unknown Source)

      at org.apache.xbean.asm.ClassReader.accept(Unknown Source)

      at org.apache.openejb.util.AnnotationFinder.readClassDef(AnnotationFinder.java:282)

      at org.apache.openejb.util.AnnotationFinder.find(AnnotationFinder.java:162)

      at org.apache.openejb.config.DeploymentLoader.checkAnnotations(DeploymentLoader.java:1610)

      at org.apache.openejb.config.DeploymentLoader.discoverModuleType(DeploymentLoader.java:1564)

      at org.apache.openejb.config.DeploymentsResolver.processUrls(DeploymentsResolver.java:425)

      at org.apache.openejb.config.DeploymentsResolver.loadFromClasspath(DeploymentsResolver.java:264)

      at org.apache.openejb.config.ConfigurationFactory.getModulesFromClassPath(ConfigurationFactory.java:550)

      at org.apache.openejb.config.ConfigurationFactory.getOpenEjbConfiguration(ConfigurationFactory.java:463)

      at org.apache.openejb.assembler.classic.Assembler.getOpenEjbConfiguration(Assembler.java:345)

      at org.apache.openejb.assembler.classic.Assembler.build(Assembler.java:324)

      ... 41 more

PASSED: testandoContainer

 

===============================================

    Default test

    Tests run: 1, Failures: 0, Skips: 0

===============================================

 

 

===============================================

Default suite

Total tests run: 1, Failures: 0, Skips: 0

===============================================

 

[TestNG] Time taken by [TestListenerAdapter] Passed:0 Failed:0 Skipped:0]: 0 ms

[TestNG] Time taken by org.testng.reporters.EmailableReporter@25b80053: 8 ms

[TestNG] Time taken by org.testng.reporters.XMLReporter@26832b87: 12 ms

[TestNG] Time taken by org.testng.reporters.SuiteHTMLReporter@20404991: 18 ms

[TestNG] Time taken by org.testng.reporters.jq.Main@612e4ffa: 27 ms

[TestNG] Time taken by org.testng.reporters.JUnitReportReporter@306897b6: 3 ms

 

 

 Valdemar Jr

Gerencia de Sistemas Corporativos - Gesic

Desenvolvedor Java

valdemar.barros@sicoob.com.br <mailto:eduardo.monteiro@sicoob.com.br> 

www.sicoob.com.br <http://www.sicoob.com.br> 

Sicoob  Confederação

 


Mime
  • Unnamed multipart/related (inline, None, 0 bytes)
View raw message