tomee-users mailing list archives

Site index · List index
Message view « Date » · « Thread »
Top « Date » · « Thread »
From MarkD <markd...@yahoo.com>
Subject 7.0.5 - arquillian remote adapter
Date Tue, 31 Jul 2018 11:22:20 GMT
Hi,

I have updated to 7.0.5 and when running tests I get the output below. I
have included the POM first. Any ideas?

POM:
<?xml version="1.0" encoding="UTF-8"?>
<project xmlns="http://maven.apache.org/POM/4.0.0"
         xmlns:xsi="http://www.w3.org/2001/XMLSchema-instance"
         xsi:schemaLocation="http://maven.apache.org/POM/4.0.0
http://maven.apache.org/xsd/maven-4.0.0.xsd">
<modelVersion>4.0.0</modelVersion>

    <groupId>com.orgcust.frontend</groupId>
    <artifactId>front-end</artifactId>
    <version>1.0-SNAPSHOT</version>
    <packaging>war</packaging>


<properties>
    <project.build.sourceEncoding>UTF-8</project.build.sourceEncoding>
    <maven.compiler.source>1.8</maven.compiler.source>
    <maven.compiler.target>1.8</maven.compiler.target>
    <tomee.version>7.0.5</tomee.version>
    <tomee.classifier>plus</tomee.classifier>
    <junit.version>4.12</junit.version>
    <johnzon.version>1.1.3</johnzon.version>
    <json.spec.version>1.0</json.spec.version>

    <skipTests>true</skipTests>
</properties>


<build>
    <plugins>
        <plugin>
            <groupId>org.apache.tomee.maven</groupId>
            <artifactId>tomee-maven-plugin</artifactId>
            <version>${tomee.version}</version>
            <configuration>
                <tomeeClassifier>${tomee.classifier}</tomeeClassifier>
                <webapps>
                   
<webapp>${project.groupId}:${project.artifactId}:${project.version}</webapp>
                </webapps>
                
                <reloadOnUpdate>true</reloadOnUpdate>

                <synchronization>
                   
<binariesDir>${project.build.outputDirectory}</binariesDir>
                   
<targetBinariesDir>${project.build.directory}/apache-tomee/webapps/${project.artifactId}-${project.version}/WEB-INF/classes</targetBinariesDir>
                    <extensions>
                        <extension>.class</extension>
                        <extension>.properties</extension>
                        <extension>.xhtml</extension>
                        <extension>.css</extension>
                        <extension>.js</extension>
                    </extensions>
                </synchronization>
                <systemVariables>
                    <openejb.system.apps>true</openejb.system.apps>
                    <tomee.remote.support>true</tomee.remote.support>
                   
<tomee.serialization.class.blacklist>-</tomee.serialization.class.blacklist>
                   
<tomee.serialization.class.whitelist></tomee.serialization.class.whitelist>

                </systemVariables>
               
<warFile>${project.build.directory}/${project.artifactId}-${project.version}.war</warFile>
            </configuration>
        </plugin>
        <plugin>
            <artifactId>maven-antrun-plugin</artifactId>
            <version>1.8</version>
            <executions>
                <execution>
                    <phase>package</phase>
                    <configuration>
                        <target>
                            <copy
file="${project.build.directory}/${project.build.finalName}.war"
                                  todir="devops/docker-artifacts" />
                        </target>
                    </configuration>
                    <goals>
                        <goal>run</goal>
                    </goals>
                </execution>
            </executions>
        </plugin>
        <plugin>
            <groupId>org.apache.maven.plugins</groupId>
            <artifactId>maven-compiler-plugin</artifactId>
            <version>3.7.0</version>
        </plugin>
        <plugin>
            <groupId>org.apache.maven.plugins</groupId>
            <artifactId>maven-surefire-plugin</artifactId>
            <version>2.17</version>
            <configuration>
                <skipTests>${skipTests}</skipTests>
            </configuration>
        </plugin>
    </plugins>
</build>

<dependencyManagement>
    <dependencies>
        <dependency>
            <groupId>org.arquillian</groupId>
            <artifactId>arquillian-universe</artifactId>
            <version>1.2.0.1</version>
            <scope>import</scope>
            <type>pom</type>
        </dependency>
    </dependencies>
</dependencyManagement>

<dependencies>
    <dependency>
        <groupId>javax</groupId>
        <artifactId>javaee-api</artifactId>
        <version>8.0</version>
        <scope>provided</scope>
    </dependency>
    <dependency>
        <groupId>org.apache.tomee</groupId>
        <artifactId>apache-tomee</artifactId>
        <version>${tomee.version}</version>
        <scope>provided</scope>
    </dependency>
    <dependency>
        <groupId>org.apache.tomee</groupId>
        <artifactId>arquillian-tomee-webapp-remote</artifactId>
        <version>${tomee.version}</version>
        <scope>test</scope>
    </dependency>
    <dependency>
        <groupId>org.apache.myfaces.core</groupId>
        <artifactId>myfaces-api</artifactId>
        <version>2.2.12</version>
        <scope>provided</scope>
    </dependency>
    <dependency>
        <groupId>org.apache.myfaces.core</groupId>
        <artifactId>myfaces-impl</artifactId>
        <version>2.2.12</version>
        <scope>provided</scope>
    </dependency>

    <dependency>
        <groupId>junit</groupId>
        <artifactId>junit</artifactId>
        <version>${junit.version}</version>
        <scope>test</scope>
    </dependency>
    <dependency>
        <groupId>org.mockito</groupId>
        <artifactId>mockito-core</artifactId>
        <version>2.11.0</version>
        <scope>test</scope>
    </dependency>


    <dependency>
        <groupId>org.apache.johnzon</groupId>
        <artifactId>johnzon-core</artifactId>
        <version>${johnzon.version}</version>
        <scope>provided</scope>
    </dependency>
    <dependency>
        <groupId>org.apache.geronimo.specs</groupId>
        <artifactId>geronimo-json_1.1_spec</artifactId>
        <version>${json.spec.version}</version>
        <scope>provided</scope> 
    </dependency>
    <dependency>
        <groupId>org.apache.johnzon</groupId>
        <artifactId>johnzon-mapper</artifactId>
        <version>${johnzon.version}</version>
        <scope>provided</scope>
    </dependency>
    <dependency>
        <groupId>org.apache.johnzon</groupId>
        <artifactId>johnzon-jaxrs</artifactId>
        <version>${johnzon.version}</version>
        <scope>provided</scope>
    </dependency>

    <dependency>
        <groupId>com.mark.libraries</groupId>
        <artifactId>exception-handling</artifactId>
        <version>0.6.0-SNAPSHOT</version>
    </dependency>



    <dependency>
        <groupId>org.arquillian.universe</groupId>
        <artifactId>arquillian-junit</artifactId>
        <type>pom</type>
        <scope>test</scope>
    </dependency>
    <dependency>
        <groupId>org.arquillian.universe</groupId>
        <artifactId>arquillian-drone</artifactId>
        <type>pom</type>
        <scope>test</scope>
    </dependency>
    <dependency>
        <groupId>org.arquillian.universe</groupId>
        <artifactId>arquillian-warp-jsf</artifactId>
        <type>pom</type>
        <scope>test</scope>
    </dependency>




    <dependency>
        <groupId>org.slf4j</groupId>
        <artifactId>slf4j-simple</artifactId>
        <version>1.6.4</version>
        <scope>test</scope>
    </dependency>


    <dependency>
        <groupId>com.github.tomakehurst</groupId>
        <artifactId>wiremock-standalone</artifactId>
        <version>2.8.0</version>
        <scope>test</scope>
        <exclusions>
            <exclusion>
                <artifactId>*</artifactId>
                <groupId>*</groupId>
            </exclusion>
        </exclusions>
    </dependency>
    <dependency>
        <groupId>org.apache.cxf</groupId>
        <artifactId>cxf-rt-frontend-jaxrs</artifactId>
        <version>3.1.13</version>
        <scope>provided</scope>
    </dependency>

    <dependency>
        <groupId>com.mark.libraries</groupId>
        <artifactId>validation</artifactId>
        <version>0.1-SNAPSHOT</version>
    </dependency>

</dependencies>
<repositories>
    <repository>
        <snapshots>
            <enabled>true</enabled>
            <updatePolicy>never</updatePolicy>
            <checksumPolicy>fail</checksumPolicy>
        </snapshots>
        <id>apache-m2-snapshot</id>
        <name>Apache Snapshot Repository</name>
        <url>https://repository.apache.org/content/groups/snapshots</url>
    </repository>
</repositories>
</project>

output:
"C:\Program Files\Java\jdk1.8.0_172\bin\java.exe"
-Dmaven.multiModuleProjectDirectory=C:\Users\mail\Documents\dev\mark\apps\orgcust\project
"-Dmaven.home=C:\Program Files\JetBrains\IntelliJ IDEA
2018.1.2\plugins\maven\lib\maven3" "-Dclassworlds.conf=C:\Program
Files\JetBrains\IntelliJ IDEA 2018.1.2\plugins\maven\lib\maven3\bin\m2.conf"
"-javaagent:C:\Program Files\JetBrains\IntelliJ IDEA
2018.1.2\lib\idea_rt.jar=54845:C:\Program Files\JetBrains\IntelliJ IDEA
2018.1.2\bin" -Dfile.encoding=UTF-8 -classpath "C:\Program
Files\JetBrains\IntelliJ IDEA
2018.1.2\plugins\maven\lib\maven3\boot\plexus-classworlds-2.5.2.jar"
org.codehaus.classworlds.Launcher -Didea.version=2018.1.6 clean test
-DskipTests=false
[INFO] Scanning for projects...
[INFO]
------------------------------------------------------------------------
[INFO] Reactor Build Order:
[INFO] 
[INFO] front-end
[INFO] auth-server
[INFO] orgcust
[INFO] nginx
[INFO]                                                                         
[INFO]
------------------------------------------------------------------------
[INFO] Building front-end 1.0-SNAPSHOT
[INFO]
------------------------------------------------------------------------
[INFO] 
[INFO] --- maven-clean-plugin:2.5:clean (default-clean) @ front-end ---
[INFO] Deleting
C:\Users\mail\Documents\dev\mark\apps\orgcust\project\frontend\target
[INFO] 
[INFO] --- maven-resources-plugin:2.6:resources (default-resources) @
front-end ---
[INFO] Using 'UTF-8' encoding to copy filtered resources.
[INFO] Copying 1 resource
[INFO] 
[INFO] --- maven-compiler-plugin:3.7.0:compile (default-compile) @ front-end
---
[INFO] Changes detected - recompiling the module!
[INFO] Compiling 26 source files to
C:\Users\mail\Documents\dev\mark\apps\orgcust\project\frontend\target\classes
[INFO]
/C:/Users/mail/Documents/dev/mark/apps/orgcust/project/frontend/src/main/java/com/orgcust/frontend/infrastructure/exceptions/CustomExceptionHandler.java:
Some input files use or override a deprecated API.
[INFO]
/C:/Users/mail/Documents/dev/mark/apps/orgcust/project/frontend/src/main/java/com/orgcust/frontend/infrastructure/exceptions/CustomExceptionHandler.java:
Recompile with -Xlint:deprecation for details.
[INFO]
/C:/Users/mail/Documents/dev/mark/apps/orgcust/project/frontend/src/main/java/com/orgcust/frontend/infrastructure/exceptions/CMSNotifyUserStrategyType.java:
Some input files use unchecked or unsafe operations.
[INFO]
/C:/Users/mail/Documents/dev/mark/apps/orgcust/project/frontend/src/main/java/com/orgcust/frontend/infrastructure/exceptions/CMSNotifyUserStrategyType.java:
Recompile with -Xlint:unchecked for details.
[INFO] 
[INFO] --- maven-resources-plugin:2.6:testResources (default-testResources)
@ front-end ---
[INFO] Using 'UTF-8' encoding to copy filtered resources.
[INFO] Copying 1 resource
[INFO] 
[INFO] --- maven-compiler-plugin:3.7.0:testCompile (default-testCompile) @
front-end ---
[INFO] Changes detected - recompiling the module!
[INFO] Compiling 5 source files to
C:\Users\mail\Documents\dev\mark\apps\orgcust\project\frontend\target\test-classes
[INFO]
/C:/Users/mail/Documents/dev/mark/apps/orgcust/project/frontend/src/test/java/com/orgcust/frontend/backing/EnquiriesTest.java:
Some input files use or override a deprecated API.
[INFO]
/C:/Users/mail/Documents/dev/mark/apps/orgcust/project/frontend/src/test/java/com/orgcust/frontend/backing/EnquiriesTest.java:
Recompile with -Xlint:deprecation for details.
[INFO] 
[INFO] --- maven-surefire-plugin:2.17:test (default-test) @ front-end ---
[INFO] Surefire report directory:
C:\Users\mail\Documents\dev\mark\apps\orgcust\project\frontend\target\surefire-reports

-------------------------------------------------------
 T E S T S
-------------------------------------------------------
Running com.orgcust.frontend.backing.EnquiriesTest
Jul 31, 2018 12:12:46 PM org.jboss.arquillian.container.impl.MapObject
populate
WARNING: Configuration contain properties not supported by the backing
object org.apache.tomee.arquillian.webapp.TomEEWebappConfiguration
Unused property entries: {lib=src/test/tomee/lib, bin=src/test/tomee/bin,
catalina_opts=-XX:-UseParallelGC, conf=src/test/tomee/conf,
cleanOnStartUp=true, deployerProperties=
                # openejb.deployer.binaries.use=true
                # openejb.deployer.forced.appId=[name]
                # openejb.deployer.save-deployments=false
            , simpleLog=true, javaagent=
               
mvn:org.apache.sirona:sirona-javaagent:0.2-incubating:jar:shaded
            }
Supported property names: [portRange, singleDumpByArchiveName, quickSession,
groupId, keepServerXmlAsThis, type, dir, httpsPort, useInstallerServlet,
preloadClasses, stopPort, host, artifactId, singleDeploymentByArchiveName,
tomcatVersion, appWorkingDir, exportConfAsSystemProperty, ajpPort, httpPort,
providerUrlPattern, unpackWars, version, webContextToUseWithEars,
arquillianProtocol, serverXml, removeUnusedWebapps, unsafeEjbd, stopCommand,
stopHost, properties]
Jul 31, 2018 12:12:47 PM org.apache.openejb.arquillian.common.Setup findHome
INFO: Unable to find home in:
C:\Users\mail\Documents\dev\mark\apps\orgcust\project\frontend\target\apache-remote
Jul 31, 2018 12:12:47 PM org.apache.openejb.arquillian.common.MavenCache
getArtifact
INFO: Downloading org.apache.tomcat:tomcat:8.5.32:zip please wait...
Jul 31, 2018 12:12:49 PM org.apache.openejb.arquillian.common.Zips unzip
INFO: Extracting
'C:\Users\mail\Documents\dev\mark\apps\orgcust\project\frontend\target\apache-remote\tomcat-8.5.32.zip'
to
'C:\Users\mail\Documents\dev\mark\apps\orgcust\project\frontend\target\apache-remote'
Jul 31, 2018 12:12:51 PM org.apache.openejb.arquillian.common.MavenCache
getArtifact
INFO: Downloading org.apache.tomee:tomee-webapp:7.0.5:war please wait...
Jul 31, 2018 12:12:51 PM org.apache.openejb.arquillian.common.Zips unzip
INFO: Extracting
'C:\Users\mail\Documents\dev\mark\apps\orgcust\project\frontend\temp\tomee-webapp-7.0.5.war'
to
'C:\Users\mail\Documents\dev\mark\apps\orgcust\project\frontend\target\apache-remote\apache-tomcat-8.5.32\webapps\tomee'
Jul 31, 2018 12:12:51 PM org.apache.openejb.arquillian.common.Zips unzip
SEVERE: Unable to unzip
C:\Users\mail\Documents\dev\mark\apps\orgcust\project\frontend\temp\tomee-webapp-7.0.5.war
java.io.EOFException: Unexpected end of ZLIB input stream
	at java.util.zip.InflaterInputStream.fill(InflaterInputStream.java:240)
	at java.util.zip.InflaterInputStream.read(InflaterInputStream.java:158)
	at java.util.zip.ZipInputStream.read(ZipInputStream.java:194)
	at java.io.FilterInputStream.read(FilterInputStream.java:107)
	at org.apache.openejb.arquillian.common.IO.copy(IO.java:208)
	at org.apache.openejb.arquillian.common.IO.copy(IO.java:190)
	at org.apache.openejb.arquillian.common.Zips.unzip(Zips.java:63)
	at org.apache.openejb.arquillian.common.Zips.unzip(Zips.java:31)
	at
org.apache.tomee.arquillian.webapp.TomEEWebappContainer.downloadOpenEJBWebapp(TomEEWebappContainer.java:216)
	at
org.apache.tomee.arquillian.webapp.TomEEWebappContainer.start(TomEEWebappContainer.java:100)
	at
org.jboss.arquillian.container.impl.ContainerImpl.start(ContainerImpl.java:179)
	at
org.jboss.arquillian.container.impl.client.container.ContainerLifecycleController$8.perform(ContainerLifecycleController.java:137)
	at
org.jboss.arquillian.container.impl.client.container.ContainerLifecycleController$8.perform(ContainerLifecycleController.java:133)
	at
org.jboss.arquillian.container.impl.client.container.ContainerLifecycleController.forContainer(ContainerLifecycleController.java:208)
	at
org.jboss.arquillian.container.impl.client.container.ContainerLifecycleController.startContainer(ContainerLifecycleController.java:133)
	at sun.reflect.NativeMethodAccessorImpl.invoke0(Native Method)
	at
sun.reflect.NativeMethodAccessorImpl.invoke(NativeMethodAccessorImpl.java:62)
	at
sun.reflect.DelegatingMethodAccessorImpl.invoke(DelegatingMethodAccessorImpl.java:43)
	at java.lang.reflect.Method.invoke(Method.java:498)
	at org.jboss.arquillian.core.impl.ObserverImpl.invoke(ObserverImpl.java:86)
	at
org.jboss.arquillian.core.impl.EventContextImpl.invokeObservers(EventContextImpl.java:103)
	at
org.jboss.arquillian.core.impl.EventContextImpl.proceed(EventContextImpl.java:90)
	at
org.jboss.arquillian.container.impl.client.ContainerDeploymentContextHandler.createContainerContext(ContainerDeploymentContextHandler.java:54)
	at sun.reflect.NativeMethodAccessorImpl.invoke0(Native Method)
	at
sun.reflect.NativeMethodAccessorImpl.invoke(NativeMethodAccessorImpl.java:62)
	at
sun.reflect.DelegatingMethodAccessorImpl.invoke(DelegatingMethodAccessorImpl.java:43)
	at java.lang.reflect.Method.invoke(Method.java:498)
	at org.jboss.arquillian.core.impl.ObserverImpl.invoke(ObserverImpl.java:86)
	at
org.jboss.arquillian.core.impl.EventContextImpl.proceed(EventContextImpl.java:95)
	at org.jboss.arquillian.core.impl.ManagerImpl.fire(ManagerImpl.java:133)
	at org.jboss.arquillian.core.impl.ManagerImpl.fire(ManagerImpl.java:105)
	at org.jboss.arquillian.core.impl.EventImpl.fire(EventImpl.java:62)
	at
org.jboss.arquillian.container.impl.client.container.ContainerLifecycleController$2.perform(ContainerLifecycleController.java:70)
	at
org.jboss.arquillian.container.impl.client.container.ContainerLifecycleController$2.perform(ContainerLifecycleController.java:64)
	at
org.jboss.arquillian.container.impl.client.container.ContainerLifecycleController.forEachSuiteContainer(ContainerLifecycleController.java:181)
	at
org.jboss.arquillian.container.impl.client.container.ContainerLifecycleController.startSuiteContainers(ContainerLifecycleController.java:64)
	at sun.reflect.NativeMethodAccessorImpl.invoke0(Native Method)
	at
sun.reflect.NativeMethodAccessorImpl.invoke(NativeMethodAccessorImpl.java:62)
	at
sun.reflect.DelegatingMethodAccessorImpl.invoke(DelegatingMethodAccessorImpl.java:43)
	at java.lang.reflect.Method.invoke(Method.java:498)
	at org.jboss.arquillian.core.impl.ObserverImpl.invoke(ObserverImpl.java:86)
	at
org.jboss.arquillian.core.impl.EventContextImpl.invokeObservers(EventContextImpl.java:103)
	at
org.jboss.arquillian.core.impl.EventContextImpl.proceed(EventContextImpl.java:90)
	at org.jboss.arquillian.core.impl.ManagerImpl.fire(ManagerImpl.java:133)
	at org.jboss.arquillian.core.impl.ManagerImpl.fire(ManagerImpl.java:105)
	at org.jboss.arquillian.core.impl.EventImpl.fire(EventImpl.java:62)
	at
org.jboss.arquillian.container.test.impl.client.ContainerEventController.execute(ContainerEventController.java:83)
	at sun.reflect.NativeMethodAccessorImpl.invoke0(Native Method)
	at
sun.reflect.NativeMethodAccessorImpl.invoke(NativeMethodAccessorImpl.java:62)
	at
sun.reflect.DelegatingMethodAccessorImpl.invoke(DelegatingMethodAccessorImpl.java:43)
	at java.lang.reflect.Method.invoke(Method.java:498)
	at org.jboss.arquillian.core.impl.ObserverImpl.invoke(ObserverImpl.java:86)
	at
org.jboss.arquillian.core.impl.EventContextImpl.invokeObservers(EventContextImpl.java:103)
	at
org.jboss.arquillian.core.impl.EventContextImpl.proceed(EventContextImpl.java:90)
	at
org.jboss.arquillian.test.impl.TestContextHandler.createSuiteContext(TestContextHandler.java:69)
	at sun.reflect.NativeMethodAccessorImpl.invoke0(Native Method)
	at
sun.reflect.NativeMethodAccessorImpl.invoke(NativeMethodAccessorImpl.java:62)
	at
sun.reflect.DelegatingMethodAccessorImpl.invoke(DelegatingMethodAccessorImpl.java:43)
	at java.lang.reflect.Method.invoke(Method.java:498)
	at org.jboss.arquillian.core.impl.ObserverImpl.invoke(ObserverImpl.java:86)
	at
org.jboss.arquillian.core.impl.EventContextImpl.proceed(EventContextImpl.java:95)
	at org.jboss.arquillian.core.impl.ManagerImpl.fire(ManagerImpl.java:133)
	at org.jboss.arquillian.core.impl.ManagerImpl.fire(ManagerImpl.java:105)
	at
org.jboss.arquillian.test.impl.EventTestRunnerAdaptor.beforeSuite(EventTestRunnerAdaptor.java:70)
	at org.jboss.arquillian.junit.Arquillian.run(Arquillian.java:111)
	at
org.apache.maven.surefire.junit4.JUnit4Provider.execute(JUnit4Provider.java:264)
	at
org.apache.maven.surefire.junit4.JUnit4Provider.executeTestSet(JUnit4Provider.java:153)
	at
org.apache.maven.surefire.junit4.JUnit4Provider.invoke(JUnit4Provider.java:124)
	at
org.apache.maven.surefire.booter.ForkedBooter.invokeProviderInSameClassLoader(ForkedBooter.java:200)
	at
org.apache.maven.surefire.booter.ForkedBooter.runSuitesInProcess(ForkedBooter.java:153)
	at
org.apache.maven.surefire.booter.ForkedBooter.main(ForkedBooter.java:103)

Tests run: 1, Failures: 0, Errors: 1, Skipped: 0, Time elapsed: 6.53 sec <<<
FAILURE! - in com.orgcust.frontend.backing.EnquiriesTest
com.orgcust.frontend.backing.EnquiriesTest  Time elapsed: 6.529 sec  <<<
ERROR!
org.jboss.arquillian.container.spi.client.container.LifecycleException:
Unable to start remote container on port: 20001
	at
org.apache.tomee.arquillian.webapp.TomEEWebappContainer.start(TomEEWebappContainer.java:199)
	at
org.jboss.arquillian.container.impl.ContainerImpl.start(ContainerImpl.java:179)
	at
org.jboss.arquillian.container.impl.client.container.ContainerLifecycleController$8.perform(ContainerLifecycleController.java:137)
	at
org.jboss.arquillian.container.impl.client.container.ContainerLifecycleController$8.perform(ContainerLifecycleController.java:133)
	at
org.jboss.arquillian.container.impl.client.container.ContainerLifecycleController.forContainer(ContainerLifecycleController.java:208)
	at
org.jboss.arquillian.container.impl.client.container.ContainerLifecycleController.startContainer(ContainerLifecycleController.java:133)
	at sun.reflect.NativeMethodAccessorImpl.invoke0(Native Method)
	at
sun.reflect.NativeMethodAccessorImpl.invoke(NativeMethodAccessorImpl.java:62)
	at
sun.reflect.DelegatingMethodAccessorImpl.invoke(DelegatingMethodAccessorImpl.java:43)
	at java.lang.reflect.Method.invoke(Method.java:498)
	at org.jboss.arquillian.core.impl.ObserverImpl.invoke(ObserverImpl.java:86)
	at
org.jboss.arquillian.core.impl.EventContextImpl.invokeObservers(EventContextImpl.java:103)
	at
org.jboss.arquillian.core.impl.EventContextImpl.proceed(EventContextImpl.java:90)
	at
org.jboss.arquillian.container.impl.client.ContainerDeploymentContextHandler.createContainerContext(ContainerDeploymentContextHandler.java:54)
	at sun.reflect.NativeMethodAccessorImpl.invoke0(Native Method)
	at
sun.reflect.NativeMethodAccessorImpl.invoke(NativeMethodAccessorImpl.java:62)
	at
sun.reflect.DelegatingMethodAccessorImpl.invoke(DelegatingMethodAccessorImpl.java:43)
	at java.lang.reflect.Method.invoke(Method.java:498)
	at org.jboss.arquillian.core.impl.ObserverImpl.invoke(ObserverImpl.java:86)
	at
org.jboss.arquillian.core.impl.EventContextImpl.proceed(EventContextImpl.java:95)
	at org.jboss.arquillian.core.impl.ManagerImpl.fire(ManagerImpl.java:133)
	at org.jboss.arquillian.core.impl.ManagerImpl.fire(ManagerImpl.java:105)
	at org.jboss.arquillian.core.impl.EventImpl.fire(EventImpl.java:62)
	at
org.jboss.arquillian.container.impl.client.container.ContainerLifecycleController$2.perform(ContainerLifecycleController.java:70)
	at
org.jboss.arquillian.container.impl.client.container.ContainerLifecycleController$2.perform(ContainerLifecycleController.java:64)
	at
org.jboss.arquillian.container.impl.client.container.ContainerLifecycleController.forEachSuiteContainer(ContainerLifecycleController.java:181)
	at
org.jboss.arquillian.container.impl.client.container.ContainerLifecycleController.startSuiteContainers(ContainerLifecycleController.java:64)
	at sun.reflect.NativeMethodAccessorImpl.invoke0(Native Method)
	at
sun.reflect.NativeMethodAccessorImpl.invoke(NativeMethodAccessorImpl.java:62)
	at
sun.reflect.DelegatingMethodAccessorImpl.invoke(DelegatingMethodAccessorImpl.java:43)
	at java.lang.reflect.Method.invoke(Method.java:498)
	at org.jboss.arquillian.core.impl.ObserverImpl.invoke(ObserverImpl.java:86)
	at
org.jboss.arquillian.core.impl.EventContextImpl.invokeObservers(EventContextImpl.java:103)
	at
org.jboss.arquillian.core.impl.EventContextImpl.proceed(EventContextImpl.java:90)
	at org.jboss.arquillian.core.impl.ManagerImpl.fire(ManagerImpl.java:133)
	at org.jboss.arquillian.core.impl.ManagerImpl.fire(ManagerImpl.java:105)
	at org.jboss.arquillian.core.impl.EventImpl.fire(EventImpl.java:62)
	at
org.jboss.arquillian.container.test.impl.client.ContainerEventController.execute(ContainerEventController.java:83)
	at sun.reflect.NativeMethodAccessorImpl.invoke0(Native Method)
	at
sun.reflect.NativeMethodAccessorImpl.invoke(NativeMethodAccessorImpl.java:62)
	at
sun.reflect.DelegatingMethodAccessorImpl.invoke(DelegatingMethodAccessorImpl.java:43)
	at java.lang.reflect.Method.invoke(Method.java:498)
	at org.jboss.arquillian.core.impl.ObserverImpl.invoke(ObserverImpl.java:86)
	at
org.jboss.arquillian.core.impl.EventContextImpl.invokeObservers(EventContextImpl.java:103)
	at
org.jboss.arquillian.core.impl.EventContextImpl.proceed(EventContextImpl.java:90)
	at
org.jboss.arquillian.test.impl.TestContextHandler.createSuiteContext(TestContextHandler.java:69)
	at sun.reflect.NativeMethodAccessorImpl.invoke0(Native Method)
	at
sun.reflect.NativeMethodAccessorImpl.invoke(NativeMethodAccessorImpl.java:62)
	at
sun.reflect.DelegatingMethodAccessorImpl.invoke(DelegatingMethodAccessorImpl.java:43)
	at java.lang.reflect.Method.invoke(Method.java:498)
	at org.jboss.arquillian.core.impl.ObserverImpl.invoke(ObserverImpl.java:86)
	at
org.jboss.arquillian.core.impl.EventContextImpl.proceed(EventContextImpl.java:95)
	at org.jboss.arquillian.core.impl.ManagerImpl.fire(ManagerImpl.java:133)
	at org.jboss.arquillian.core.impl.ManagerImpl.fire(ManagerImpl.java:105)
	at
org.jboss.arquillian.test.impl.EventTestRunnerAdaptor.beforeSuite(EventTestRunnerAdaptor.java:70)
	at org.jboss.arquillian.junit.Arquillian.run(Arquillian.java:111)
	at
org.apache.maven.surefire.junit4.JUnit4Provider.execute(JUnit4Provider.java:264)
	at
org.apache.maven.surefire.junit4.JUnit4Provider.executeTestSet(JUnit4Provider.java:153)
	at
org.apache.maven.surefire.junit4.JUnit4Provider.invoke(JUnit4Provider.java:124)
	at
org.apache.maven.surefire.booter.ForkedBooter.invokeProviderInSameClassLoader(ForkedBooter.java:200)
	at
org.apache.maven.surefire.booter.ForkedBooter.runSuitesInProcess(ForkedBooter.java:153)
	at
org.apache.maven.surefire.booter.ForkedBooter.main(ForkedBooter.java:103)
Caused by: java.lang.IllegalStateException: Unable to unzip
C:\Users\mail\Documents\dev\mark\apps\orgcust\project\frontend\temp\tomee-webapp-7.0.5.war
	at org.apache.openejb.arquillian.common.Zips.unzip(Zips.java:76)
	at org.apache.openejb.arquillian.common.Zips.unzip(Zips.java:31)
	at
org.apache.tomee.arquillian.webapp.TomEEWebappContainer.downloadOpenEJBWebapp(TomEEWebappContainer.java:216)
	at
org.apache.tomee.arquillian.webapp.TomEEWebappContainer.start(TomEEWebappContainer.java:100)
	at
org.jboss.arquillian.container.impl.ContainerImpl.start(ContainerImpl.java:179)
	at
org.jboss.arquillian.container.impl.client.container.ContainerLifecycleController$8.perform(ContainerLifecycleController.java:137)
	at
org.jboss.arquillian.container.impl.client.container.ContainerLifecycleController$8.perform(ContainerLifecycleController.java:133)
	at
org.jboss.arquillian.container.impl.client.container.ContainerLifecycleController.forContainer(ContainerLifecycleController.java:208)
	at
org.jboss.arquillian.container.impl.client.container.ContainerLifecycleController.startContainer(ContainerLifecycleController.java:133)
	at sun.reflect.NativeMethodAccessorImpl.invoke0(Native Method)
	at
sun.reflect.NativeMethodAccessorImpl.invoke(NativeMethodAccessorImpl.java:62)
	at
sun.reflect.DelegatingMethodAccessorImpl.invoke(DelegatingMethodAccessorImpl.java:43)
	at java.lang.reflect.Method.invoke(Method.java:498)
	at org.jboss.arquillian.core.impl.ObserverImpl.invoke(ObserverImpl.java:86)
	at
org.jboss.arquillian.core.impl.EventContextImpl.invokeObservers(EventContextImpl.java:103)
	at
org.jboss.arquillian.core.impl.EventContextImpl.proceed(EventContextImpl.java:90)
	at
org.jboss.arquillian.container.impl.client.ContainerDeploymentContextHandler.createContainerContext(ContainerDeploymentContextHandler.java:54)
	at sun.reflect.NativeMethodAccessorImpl.invoke0(Native Method)
	at
sun.reflect.NativeMethodAccessorImpl.invoke(NativeMethodAccessorImpl.java:62)
	at
sun.reflect.DelegatingMethodAccessorImpl.invoke(DelegatingMethodAccessorImpl.java:43)
	at java.lang.reflect.Method.invoke(Method.java:498)
	at org.jboss.arquillian.core.impl.ObserverImpl.invoke(ObserverImpl.java:86)
	at
org.jboss.arquillian.core.impl.EventContextImpl.proceed(EventContextImpl.java:95)
	at org.jboss.arquillian.core.impl.ManagerImpl.fire(ManagerImpl.java:133)
	at org.jboss.arquillian.core.impl.ManagerImpl.fire(ManagerImpl.java:105)
	at org.jboss.arquillian.core.impl.EventImpl.fire(EventImpl.java:62)
	at
org.jboss.arquillian.container.impl.client.container.ContainerLifecycleController$2.perform(ContainerLifecycleController.java:70)
	at
org.jboss.arquillian.container.impl.client.container.ContainerLifecycleController$2.perform(ContainerLifecycleController.java:64)
	at
org.jboss.arquillian.container.impl.client.container.ContainerLifecycleController.forEachSuiteContainer(ContainerLifecycleController.java:181)
	at
org.jboss.arquillian.container.impl.client.container.ContainerLifecycleController.startSuiteContainers(ContainerLifecycleController.java:64)
	at sun.reflect.NativeMethodAccessorImpl.invoke0(Native Method)
	at
sun.reflect.NativeMethodAccessorImpl.invoke(NativeMethodAccessorImpl.java:62)
	at
sun.reflect.DelegatingMethodAccessorImpl.invoke(DelegatingMethodAccessorImpl.java:43)
	at java.lang.reflect.Method.invoke(Method.java:498)
	at org.jboss.arquillian.core.impl.ObserverImpl.invoke(ObserverImpl.java:86)
	at
org.jboss.arquillian.core.impl.EventContextImpl.invokeObservers(EventContextImpl.java:103)
	at
org.jboss.arquillian.core.impl.EventContextImpl.proceed(EventContextImpl.java:90)
	at org.jboss.arquillian.core.impl.ManagerImpl.fire(ManagerImpl.java:133)
	at org.jboss.arquillian.core.impl.ManagerImpl.fire(ManagerImpl.java:105)
	at org.jboss.arquillian.core.impl.EventImpl.fire(EventImpl.java:62)
	at
org.jboss.arquillian.container.test.impl.client.ContainerEventController.execute(ContainerEventController.java:83)
	at sun.reflect.NativeMethodAccessorImpl.invoke0(Native Method)
	at
sun.reflect.NativeMethodAccessorImpl.invoke(NativeMethodAccessorImpl.java:62)
	at
sun.reflect.DelegatingMethodAccessorImpl.invoke(DelegatingMethodAccessorImpl.java:43)
	at java.lang.reflect.Method.invoke(Method.java:498)
	at org.jboss.arquillian.core.impl.ObserverImpl.invoke(ObserverImpl.java:86)
	at
org.jboss.arquillian.core.impl.EventContextImpl.invokeObservers(EventContextImpl.java:103)
	at
org.jboss.arquillian.core.impl.EventContextImpl.proceed(EventContextImpl.java:90)
	at
org.jboss.arquillian.test.impl.TestContextHandler.createSuiteContext(TestContextHandler.java:69)
	at sun.reflect.NativeMethodAccessorImpl.invoke0(Native Method)
	at
sun.reflect.NativeMethodAccessorImpl.invoke(NativeMethodAccessorImpl.java:62)
	at
sun.reflect.DelegatingMethodAccessorImpl.invoke(DelegatingMethodAccessorImpl.java:43)
	at java.lang.reflect.Method.invoke(Method.java:498)
	at org.jboss.arquillian.core.impl.ObserverImpl.invoke(ObserverImpl.java:86)
	at
org.jboss.arquillian.core.impl.EventContextImpl.proceed(EventContextImpl.java:95)
	at org.jboss.arquillian.core.impl.ManagerImpl.fire(ManagerImpl.java:133)
	at org.jboss.arquillian.core.impl.ManagerImpl.fire(ManagerImpl.java:105)
	at
org.jboss.arquillian.test.impl.EventTestRunnerAdaptor.beforeSuite(EventTestRunnerAdaptor.java:70)
	at org.jboss.arquillian.junit.Arquillian.run(Arquillian.java:111)
	at
org.apache.maven.surefire.junit4.JUnit4Provider.execute(JUnit4Provider.java:264)
	at
org.apache.maven.surefire.junit4.JUnit4Provider.executeTestSet(JUnit4Provider.java:153)
	at
org.apache.maven.surefire.junit4.JUnit4Provider.invoke(JUnit4Provider.java:124)
	at
org.apache.maven.surefire.booter.ForkedBooter.invokeProviderInSameClassLoader(ForkedBooter.java:200)
	at
org.apache.maven.surefire.booter.ForkedBooter.runSuitesInProcess(ForkedBooter.java:153)
	at
org.apache.maven.surefire.booter.ForkedBooter.main(ForkedBooter.java:103)
Caused by: java.io.EOFException: Unexpected end of ZLIB input stream
	at java.util.zip.InflaterInputStream.fill(InflaterInputStream.java:240)
	at java.util.zip.InflaterInputStream.read(InflaterInputStream.java:158)
	at java.util.zip.ZipInputStream.read(ZipInputStream.java:194)
	at java.io.FilterInputStream.read(FilterInputStream.java:107)
	at org.apache.openejb.arquillian.common.IO.copy(IO.java:208)
	at org.apache.openejb.arquillian.common.IO.copy(IO.java:190)
	at org.apache.openejb.arquillian.common.Zips.unzip(Zips.java:63)
	at org.apache.openejb.arquillian.common.Zips.unzip(Zips.java:31)
	at
org.apache.tomee.arquillian.webapp.TomEEWebappContainer.downloadOpenEJBWebapp(TomEEWebappContainer.java:216)
	at
org.apache.tomee.arquillian.webapp.TomEEWebappContainer.start(TomEEWebappContainer.java:100)
	at
org.jboss.arquillian.container.impl.ContainerImpl.start(ContainerImpl.java:179)
	at
org.jboss.arquillian.container.impl.client.container.ContainerLifecycleController$8.perform(ContainerLifecycleController.java:137)
	at
org.jboss.arquillian.container.impl.client.container.ContainerLifecycleController$8.perform(ContainerLifecycleController.java:133)
	at
org.jboss.arquillian.container.impl.client.container.ContainerLifecycleController.forContainer(ContainerLifecycleController.java:208)
	at
org.jboss.arquillian.container.impl.client.container.ContainerLifecycleController.startContainer(ContainerLifecycleController.java:133)
	at sun.reflect.NativeMethodAccessorImpl.invoke0(Native Method)
	at
sun.reflect.NativeMethodAccessorImpl.invoke(NativeMethodAccessorImpl.java:62)
	at
sun.reflect.DelegatingMethodAccessorImpl.invoke(DelegatingMethodAccessorImpl.java:43)
	at java.lang.reflect.Method.invoke(Method.java:498)
	at org.jboss.arquillian.core.impl.ObserverImpl.invoke(ObserverImpl.java:86)
	at
org.jboss.arquillian.core.impl.EventContextImpl.invokeObservers(EventContextImpl.java:103)
	at
org.jboss.arquillian.core.impl.EventContextImpl.proceed(EventContextImpl.java:90)
	at
org.jboss.arquillian.container.impl.client.ContainerDeploymentContextHandler.createContainerContext(ContainerDeploymentContextHandler.java:54)
	at sun.reflect.NativeMethodAccessorImpl.invoke0(Native Method)
	at
sun.reflect.NativeMethodAccessorImpl.invoke(NativeMethodAccessorImpl.java:62)
	at
sun.reflect.DelegatingMethodAccessorImpl.invoke(DelegatingMethodAccessorImpl.java:43)
	at java.lang.reflect.Method.invoke(Method.java:498)
	at org.jboss.arquillian.core.impl.ObserverImpl.invoke(ObserverImpl.java:86)
	at
org.jboss.arquillian.core.impl.EventContextImpl.proceed(EventContextImpl.java:95)
	at org.jboss.arquillian.core.impl.ManagerImpl.fire(ManagerImpl.java:133)
	at org.jboss.arquillian.core.impl.ManagerImpl.fire(ManagerImpl.java:105)
	at org.jboss.arquillian.core.impl.EventImpl.fire(EventImpl.java:62)
	at
org.jboss.arquillian.container.impl.client.container.ContainerLifecycleController$2.perform(ContainerLifecycleController.java:70)
	at
org.jboss.arquillian.container.impl.client.container.ContainerLifecycleController$2.perform(ContainerLifecycleController.java:64)
	at
org.jboss.arquillian.container.impl.client.container.ContainerLifecycleController.forEachSuiteContainer(ContainerLifecycleController.java:181)
	at
org.jboss.arquillian.container.impl.client.container.ContainerLifecycleController.startSuiteContainers(ContainerLifecycleController.java:64)
	at sun.reflect.NativeMethodAccessorImpl.invoke0(Native Method)
	at
sun.reflect.NativeMethodAccessorImpl.invoke(NativeMethodAccessorImpl.java:62)
	at
sun.reflect.DelegatingMethodAccessorImpl.invoke(DelegatingMethodAccessorImpl.java:43)
	at java.lang.reflect.Method.invoke(Method.java:498)
	at org.jboss.arquillian.core.impl.ObserverImpl.invoke(ObserverImpl.java:86)
	at
org.jboss.arquillian.core.impl.EventContextImpl.invokeObservers(EventContextImpl.java:103)
	at
org.jboss.arquillian.core.impl.EventContextImpl.proceed(EventContextImpl.java:90)
	at org.jboss.arquillian.core.impl.ManagerImpl.fire(ManagerImpl.java:133)
	at org.jboss.arquillian.core.impl.ManagerImpl.fire(ManagerImpl.java:105)
	at org.jboss.arquillian.core.impl.EventImpl.fire(EventImpl.java:62)
	at
org.jboss.arquillian.container.test.impl.client.ContainerEventController.execute(ContainerEventController.java:83)
	at sun.reflect.NativeMethodAccessorImpl.invoke0(Native Method)
	at
sun.reflect.NativeMethodAccessorImpl.invoke(NativeMethodAccessorImpl.java:62)
	at
sun.reflect.DelegatingMethodAccessorImpl.invoke(DelegatingMethodAccessorImpl.java:43)
	at java.lang.reflect.Method.invoke(Method.java:498)
	at org.jboss.arquillian.core.impl.ObserverImpl.invoke(ObserverImpl.java:86)
	at
org.jboss.arquillian.core.impl.EventContextImpl.invokeObservers(EventContextImpl.java:103)
	at
org.jboss.arquillian.core.impl.EventContextImpl.proceed(EventContextImpl.java:90)
	at
org.jboss.arquillian.test.impl.TestContextHandler.createSuiteContext(TestContextHandler.java:69)
	at sun.reflect.NativeMethodAccessorImpl.invoke0(Native Method)
	at
sun.reflect.NativeMethodAccessorImpl.invoke(NativeMethodAccessorImpl.java:62)
	at
sun.reflect.DelegatingMethodAccessorImpl.invoke(DelegatingMethodAccessorImpl.java:43)
	at java.lang.reflect.Method.invoke(Method.java:498)
	at org.jboss.arquillian.core.impl.ObserverImpl.invoke(ObserverImpl.java:86)
	at
org.jboss.arquillian.core.impl.EventContextImpl.proceed(EventContextImpl.java:95)
	at org.jboss.arquillian.core.impl.ManagerImpl.fire(ManagerImpl.java:133)
	at org.jboss.arquillian.core.impl.ManagerImpl.fire(ManagerImpl.java:105)
	at
org.jboss.arquillian.test.impl.EventTestRunnerAdaptor.beforeSuite(EventTestRunnerAdaptor.java:70)
	at org.jboss.arquillian.junit.Arquillian.run(Arquillian.java:111)
	at
org.apache.maven.surefire.junit4.JUnit4Provider.execute(JUnit4Provider.java:264)
	at
org.apache.maven.surefire.junit4.JUnit4Provider.executeTestSet(JUnit4Provider.java:153)
	at
org.apache.maven.surefire.junit4.JUnit4Provider.invoke(JUnit4Provider.java:124)
	at
org.apache.maven.surefire.booter.ForkedBooter.invokeProviderInSameClassLoader(ForkedBooter.java:200)
	at
org.apache.maven.surefire.booter.ForkedBooter.runSuitesInProcess(ForkedBooter.java:153)
	at
org.apache.maven.surefire.booter.ForkedBooter.main(ForkedBooter.java:103)

Running com.orgcust.frontend.backing.EnquiryTest
Tests run: 1, Failures: 0, Errors: 1, Skipped: 0, Time elapsed: 0 sec <<<
FAILURE! - in com.orgcust.frontend.backing.EnquiryTest
com.orgcust.frontend.backing.EnquiryTest  Time elapsed: 0 sec  <<< ERROR!
java.lang.RuntimeException: Arquillian initialization has already been
attempted, but failed. See previous exceptions for cause
	at org.jboss.arquillian.junit.Arquillian.run(Arquillian.java:105)
	at
org.apache.maven.surefire.junit4.JUnit4Provider.execute(JUnit4Provider.java:264)
	at
org.apache.maven.surefire.junit4.JUnit4Provider.executeTestSet(JUnit4Provider.java:153)
	at
org.apache.maven.surefire.junit4.JUnit4Provider.invoke(JUnit4Provider.java:124)
	at
org.apache.maven.surefire.booter.ForkedBooter.invokeProviderInSameClassLoader(ForkedBooter.java:200)
	at
org.apache.maven.surefire.booter.ForkedBooter.runSuitesInProcess(ForkedBooter.java:153)
	at
org.apache.maven.surefire.booter.ForkedBooter.main(ForkedBooter.java:103)
Caused by:
org.jboss.arquillian.container.spi.client.container.LifecycleException:
Unable to start remote container on port: 20001
	at
org.apache.tomee.arquillian.webapp.TomEEWebappContainer.start(TomEEWebappContainer.java:199)
	at
org.jboss.arquillian.container.impl.ContainerImpl.start(ContainerImpl.java:179)
	at
org.jboss.arquillian.container.impl.client.container.ContainerLifecycleController$8.perform(ContainerLifecycleController.java:137)
	at
org.jboss.arquillian.container.impl.client.container.ContainerLifecycleController$8.perform(ContainerLifecycleController.java:133)
	at
org.jboss.arquillian.container.impl.client.container.ContainerLifecycleController.forContainer(ContainerLifecycleController.java:208)
	at
org.jboss.arquillian.container.impl.client.container.ContainerLifecycleController.startContainer(ContainerLifecycleController.java:133)
	at sun.reflect.NativeMethodAccessorImpl.invoke0(Native Method)
	at
sun.reflect.NativeMethodAccessorImpl.invoke(NativeMethodAccessorImpl.java:62)
	at
sun.reflect.DelegatingMethodAccessorImpl.invoke(DelegatingMethodAccessorImpl.java:43)
	at java.lang.reflect.Method.invoke(Method.java:498)
	at org.jboss.arquillian.core.impl.ObserverImpl.invoke(ObserverImpl.java:86)
	at
org.jboss.arquillian.core.impl.EventContextImpl.invokeObservers(EventContextImpl.java:103)
	at
org.jboss.arquillian.core.impl.EventContextImpl.proceed(EventContextImpl.java:90)
	at
org.jboss.arquillian.container.impl.client.ContainerDeploymentContextHandler.createContainerContext(ContainerDeploymentContextHandler.java:54)
	at sun.reflect.NativeMethodAccessorImpl.invoke0(Native Method)
	at
sun.reflect.NativeMethodAccessorImpl.invoke(NativeMethodAccessorImpl.java:62)
	at
sun.reflect.DelegatingMethodAccessorImpl.invoke(DelegatingMethodAccessorImpl.java:43)
	at java.lang.reflect.Method.invoke(Method.java:498)
	at org.jboss.arquillian.core.impl.ObserverImpl.invoke(ObserverImpl.java:86)
	at
org.jboss.arquillian.core.impl.EventContextImpl.proceed(EventContextImpl.java:95)
	at org.jboss.arquillian.core.impl.ManagerImpl.fire(ManagerImpl.java:133)
	at org.jboss.arquillian.core.impl.ManagerImpl.fire(ManagerImpl.java:105)
	at org.jboss.arquillian.core.impl.EventImpl.fire(EventImpl.java:62)
	at
org.jboss.arquillian.container.impl.client.container.ContainerLifecycleController$2.perform(ContainerLifecycleController.java:70)
	at
org.jboss.arquillian.container.impl.client.container.ContainerLifecycleController$2.perform(ContainerLifecycleController.java:64)
	at
org.jboss.arquillian.container.impl.client.container.ContainerLifecycleController.forEachSuiteContainer(ContainerLifecycleController.java:181)
	at
org.jboss.arquillian.container.impl.client.container.ContainerLifecycleController.startSuiteContainers(ContainerLifecycleController.java:64)
	at sun.reflect.NativeMethodAccessorImpl.invoke0(Native Method)
	at
sun.reflect.NativeMethodAccessorImpl.invoke(NativeMethodAccessorImpl.java:62)
	at
sun.reflect.DelegatingMethodAccessorImpl.invoke(DelegatingMethodAccessorImpl.java:43)
	at java.lang.reflect.Method.invoke(Method.java:498)
	at org.jboss.arquillian.core.impl.ObserverImpl.invoke(ObserverImpl.java:86)
	at
org.jboss.arquillian.core.impl.EventContextImpl.invokeObservers(EventContextImpl.java:103)
	at
org.jboss.arquillian.core.impl.EventContextImpl.proceed(EventContextImpl.java:90)
	at org.jboss.arquillian.core.impl.ManagerImpl.fire(ManagerImpl.java:133)
	at org.jboss.arquillian.core.impl.ManagerImpl.fire(ManagerImpl.java:105)
	at org.jboss.arquillian.core.impl.EventImpl.fire(EventImpl.java:62)
	at
org.jboss.arquillian.container.test.impl.client.ContainerEventController.execute(ContainerEventController.java:83)
	at sun.reflect.NativeMethodAccessorImpl.invoke0(Native Method)
	at
sun.reflect.NativeMethodAccessorImpl.invoke(NativeMethodAccessorImpl.java:62)
	at
sun.reflect.DelegatingMethodAccessorImpl.invoke(DelegatingMethodAccessorImpl.java:43)
	at java.lang.reflect.Method.invoke(Method.java:498)
	at org.jboss.arquillian.core.impl.ObserverImpl.invoke(ObserverImpl.java:86)
	at
org.jboss.arquillian.core.impl.EventContextImpl.invokeObservers(EventContextImpl.java:103)
	at
org.jboss.arquillian.core.impl.EventContextImpl.proceed(EventContextImpl.java:90)
	at
org.jboss.arquillian.test.impl.TestContextHandler.createSuiteContext(TestContextHandler.java:69)
	at sun.reflect.NativeMethodAccessorImpl.invoke0(Native Method)
	at
sun.reflect.NativeMethodAccessorImpl.invoke(NativeMethodAccessorImpl.java:62)
	at
sun.reflect.DelegatingMethodAccessorImpl.invoke(DelegatingMethodAccessorImpl.java:43)
	at java.lang.reflect.Method.invoke(Method.java:498)
	at org.jboss.arquillian.core.impl.ObserverImpl.invoke(ObserverImpl.java:86)
	at
org.jboss.arquillian.core.impl.EventContextImpl.proceed(EventContextImpl.java:95)
	at org.jboss.arquillian.core.impl.ManagerImpl.fire(ManagerImpl.java:133)
	at org.jboss.arquillian.core.impl.ManagerImpl.fire(ManagerImpl.java:105)
	at
org.jboss.arquillian.test.impl.EventTestRunnerAdaptor.beforeSuite(EventTestRunnerAdaptor.java:70)
	at org.jboss.arquillian.junit.Arquillian.run(Arquillian.java:111)
	at
org.apache.maven.surefire.junit4.JUnit4Provider.execute(JUnit4Provider.java:264)
	at
org.apache.maven.surefire.junit4.JUnit4Provider.executeTestSet(JUnit4Provider.java:153)
	at
org.apache.maven.surefire.junit4.JUnit4Provider.invoke(JUnit4Provider.java:124)
	at
org.apache.maven.surefire.booter.ForkedBooter.invokeProviderInSameClassLoader(ForkedBooter.java:200)
	at
org.apache.maven.surefire.booter.ForkedBooter.runSuitesInProcess(ForkedBooter.java:153)
	at
org.apache.maven.surefire.booter.ForkedBooter.main(ForkedBooter.java:103)
Caused by: java.lang.IllegalStateException: Unable to unzip
C:\Users\mail\Documents\dev\mark\apps\orgcust\project\frontend\temp\tomee-webapp-7.0.5.war
	at org.apache.openejb.arquillian.common.Zips.unzip(Zips.java:76)
	at org.apache.openejb.arquillian.common.Zips.unzip(Zips.java:31)
	at
org.apache.tomee.arquillian.webapp.TomEEWebappContainer.downloadOpenEJBWebapp(TomEEWebappContainer.java:216)
	at
org.apache.tomee.arquillian.webapp.TomEEWebappContainer.start(TomEEWebappContainer.java:100)
	at
org.jboss.arquillian.container.impl.ContainerImpl.start(ContainerImpl.java:179)
	at
org.jboss.arquillian.container.impl.client.container.ContainerLifecycleController$8.perform(ContainerLifecycleController.java:137)
	at
org.jboss.arquillian.container.impl.client.container.ContainerLifecycleController$8.perform(ContainerLifecycleController.java:133)
	at
org.jboss.arquillian.container.impl.client.container.ContainerLifecycleController.forContainer(ContainerLifecycleController.java:208)
	at
org.jboss.arquillian.container.impl.client.container.ContainerLifecycleController.startContainer(ContainerLifecycleController.java:133)
	at sun.reflect.NativeMethodAccessorImpl.invoke0(Native Method)
	at
sun.reflect.NativeMethodAccessorImpl.invoke(NativeMethodAccessorImpl.java:62)
	at
sun.reflect.DelegatingMethodAccessorImpl.invoke(DelegatingMethodAccessorImpl.java:43)
	at java.lang.reflect.Method.invoke(Method.java:498)
	at org.jboss.arquillian.core.impl.ObserverImpl.invoke(ObserverImpl.java:86)
	at
org.jboss.arquillian.core.impl.EventContextImpl.invokeObservers(EventContextImpl.java:103)
	at
org.jboss.arquillian.core.impl.EventContextImpl.proceed(EventContextImpl.java:90)
	at
org.jboss.arquillian.container.impl.client.ContainerDeploymentContextHandler.createContainerContext(ContainerDeploymentContextHandler.java:54)
	at sun.reflect.NativeMethodAccessorImpl.invoke0(Native Method)
	at
sun.reflect.NativeMethodAccessorImpl.invoke(NativeMethodAccessorImpl.java:62)
	at
sun.reflect.DelegatingMethodAccessorImpl.invoke(DelegatingMethodAccessorImpl.java:43)
	at java.lang.reflect.Method.invoke(Method.java:498)
	at org.jboss.arquillian.core.impl.ObserverImpl.invoke(ObserverImpl.java:86)
	at
org.jboss.arquillian.core.impl.EventContextImpl.proceed(EventContextImpl.java:95)
	at org.jboss.arquillian.core.impl.ManagerImpl.fire(ManagerImpl.java:133)
	at org.jboss.arquillian.core.impl.ManagerImpl.fire(ManagerImpl.java:105)
	at org.jboss.arquillian.core.impl.EventImpl.fire(EventImpl.java:62)
	at
org.jboss.arquillian.container.impl.client.container.ContainerLifecycleController$2.perform(ContainerLifecycleController.java:70)
	at
org.jboss.arquillian.container.impl.client.container.ContainerLifecycleController$2.perform(ContainerLifecycleController.java:64)
	at
org.jboss.arquillian.container.impl.client.container.ContainerLifecycleController.forEachSuiteContainer(ContainerLifecycleController.java:181)
	at
org.jboss.arquillian.container.impl.client.container.ContainerLifecycleController.startSuiteContainers(ContainerLifecycleController.java:64)
	at sun.reflect.NativeMethodAccessorImpl.invoke0(Native Method)
	at
sun.reflect.NativeMethodAccessorImpl.invoke(NativeMethodAccessorImpl.java:62)
	at
sun.reflect.DelegatingMethodAccessorImpl.invoke(DelegatingMethodAccessorImpl.java:43)
	at java.lang.reflect.Method.invoke(Method.java:498)
	at org.jboss.arquillian.core.impl.ObserverImpl.invoke(ObserverImpl.java:86)
	at
org.jboss.arquillian.core.impl.EventContextImpl.invokeObservers(EventContextImpl.java:103)
	at
org.jboss.arquillian.core.impl.EventContextImpl.proceed(EventContextImpl.java:90)
	at org.jboss.arquillian.core.impl.ManagerImpl.fire(ManagerImpl.java:133)
	at org.jboss.arquillian.core.impl.ManagerImpl.fire(ManagerImpl.java:105)
	at org.jboss.arquillian.core.impl.EventImpl.fire(EventImpl.java:62)
	at
org.jboss.arquillian.container.test.impl.client.ContainerEventController.execute(ContainerEventController.java:83)
	at sun.reflect.NativeMethodAccessorImpl.invoke0(Native Method)
	at
sun.reflect.NativeMethodAccessorImpl.invoke(NativeMethodAccessorImpl.java:62)
	at
sun.reflect.DelegatingMethodAccessorImpl.invoke(DelegatingMethodAccessorImpl.java:43)
	at java.lang.reflect.Method.invoke(Method.java:498)
	at org.jboss.arquillian.core.impl.ObserverImpl.invoke(ObserverImpl.java:86)
	at
org.jboss.arquillian.core.impl.EventContextImpl.invokeObservers(EventContextImpl.java:103)
	at
org.jboss.arquillian.core.impl.EventContextImpl.proceed(EventContextImpl.java:90)
	at
org.jboss.arquillian.test.impl.TestContextHandler.createSuiteContext(TestContextHandler.java:69)
	at sun.reflect.NativeMethodAccessorImpl.invoke0(Native Method)
	at
sun.reflect.NativeMethodAccessorImpl.invoke(NativeMethodAccessorImpl.java:62)
	at
sun.reflect.DelegatingMethodAccessorImpl.invoke(DelegatingMethodAccessorImpl.java:43)
	at java.lang.reflect.Method.invoke(Method.java:498)
	at org.jboss.arquillian.core.impl.ObserverImpl.invoke(ObserverImpl.java:86)
	at
org.jboss.arquillian.core.impl.EventContextImpl.proceed(EventContextImpl.java:95)
	at org.jboss.arquillian.core.impl.ManagerImpl.fire(ManagerImpl.java:133)
	at org.jboss.arquillian.core.impl.ManagerImpl.fire(ManagerImpl.java:105)
	at
org.jboss.arquillian.test.impl.EventTestRunnerAdaptor.beforeSuite(EventTestRunnerAdaptor.java:70)
	at org.jboss.arquillian.junit.Arquillian.run(Arquillian.java:111)
	at
org.apache.maven.surefire.junit4.JUnit4Provider.execute(JUnit4Provider.java:264)
	at
org.apache.maven.surefire.junit4.JUnit4Provider.executeTestSet(JUnit4Provider.java:153)
	at
org.apache.maven.surefire.junit4.JUnit4Provider.invoke(JUnit4Provider.java:124)
	at
org.apache.maven.surefire.booter.ForkedBooter.invokeProviderInSameClassLoader(ForkedBooter.java:200)
	at
org.apache.maven.surefire.booter.ForkedBooter.runSuitesInProcess(ForkedBooter.java:153)
	at
org.apache.maven.surefire.booter.ForkedBooter.main(ForkedBooter.java:103)
Caused by: java.io.EOFException: Unexpected end of ZLIB input stream
	at java.util.zip.InflaterInputStream.fill(InflaterInputStream.java:240)
	at java.util.zip.InflaterInputStream.read(InflaterInputStream.java:158)
	at java.util.zip.ZipInputStream.read(ZipInputStream.java:194)
	at java.io.FilterInputStream.read(FilterInputStream.java:107)
	at org.apache.openejb.arquillian.common.IO.copy(IO.java:208)
	at org.apache.openejb.arquillian.common.IO.copy(IO.java:190)
	at org.apache.openejb.arquillian.common.Zips.unzip(Zips.java:63)
	at org.apache.openejb.arquillian.common.Zips.unzip(Zips.java:31)
	at
org.apache.tomee.arquillian.webapp.TomEEWebappContainer.downloadOpenEJBWebapp(TomEEWebappContainer.java:216)
	at
org.apache.tomee.arquillian.webapp.TomEEWebappContainer.start(TomEEWebappContainer.java:100)
	at
org.jboss.arquillian.container.impl.ContainerImpl.start(ContainerImpl.java:179)
	at
org.jboss.arquillian.container.impl.client.container.ContainerLifecycleController$8.perform(ContainerLifecycleController.java:137)
	at
org.jboss.arquillian.container.impl.client.container.ContainerLifecycleController$8.perform(ContainerLifecycleController.java:133)
	at
org.jboss.arquillian.container.impl.client.container.ContainerLifecycleController.forContainer(ContainerLifecycleController.java:208)
	at
org.jboss.arquillian.container.impl.client.container.ContainerLifecycleController.startContainer(ContainerLifecycleController.java:133)
	at sun.reflect.NativeMethodAccessorImpl.invoke0(Native Method)
	at
sun.reflect.NativeMethodAccessorImpl.invoke(NativeMethodAccessorImpl.java:62)
	at
sun.reflect.DelegatingMethodAccessorImpl.invoke(DelegatingMethodAccessorImpl.java:43)
	at java.lang.reflect.Method.invoke(Method.java:498)
	at org.jboss.arquillian.core.impl.ObserverImpl.invoke(ObserverImpl.java:86)
	at
org.jboss.arquillian.core.impl.EventContextImpl.invokeObservers(EventContextImpl.java:103)
	at
org.jboss.arquillian.core.impl.EventContextImpl.proceed(EventContextImpl.java:90)
	at
org.jboss.arquillian.container.impl.client.ContainerDeploymentContextHandler.createContainerContext(ContainerDeploymentContextHandler.java:54)
	at sun.reflect.NativeMethodAccessorImpl.invoke0(Native Method)
	at
sun.reflect.NativeMethodAccessorImpl.invoke(NativeMethodAccessorImpl.java:62)
	at
sun.reflect.DelegatingMethodAccessorImpl.invoke(DelegatingMethodAccessorImpl.java:43)
	at java.lang.reflect.Method.invoke(Method.java:498)
	at org.jboss.arquillian.core.impl.ObserverImpl.invoke(ObserverImpl.java:86)
	at
org.jboss.arquillian.core.impl.EventContextImpl.proceed(EventContextImpl.java:95)
	at org.jboss.arquillian.core.impl.ManagerImpl.fire(ManagerImpl.java:133)
	at org.jboss.arquillian.core.impl.ManagerImpl.fire(ManagerImpl.java:105)
	at org.jboss.arquillian.core.impl.EventImpl.fire(EventImpl.java:62)
	at
org.jboss.arquillian.container.impl.client.container.ContainerLifecycleController$2.perform(ContainerLifecycleController.java:70)
	at
org.jboss.arquillian.container.impl.client.container.ContainerLifecycleController$2.perform(ContainerLifecycleController.java:64)
	at
org.jboss.arquillian.container.impl.client.container.ContainerLifecycleController.forEachSuiteContainer(ContainerLifecycleController.java:181)
	at
org.jboss.arquillian.container.impl.client.container.ContainerLifecycleController.startSuiteContainers(ContainerLifecycleController.java:64)
	at sun.reflect.NativeMethodAccessorImpl.invoke0(Native Method)
	at
sun.reflect.NativeMethodAccessorImpl.invoke(NativeMethodAccessorImpl.java:62)
	at
sun.reflect.DelegatingMethodAccessorImpl.invoke(DelegatingMethodAccessorImpl.java:43)
	at java.lang.reflect.Method.invoke(Method.java:498)
	at org.jboss.arquillian.core.impl.ObserverImpl.invoke(ObserverImpl.java:86)
	at
org.jboss.arquillian.core.impl.EventContextImpl.invokeObservers(EventContextImpl.java:103)
	at
org.jboss.arquillian.core.impl.EventContextImpl.proceed(EventContextImpl.java:90)
	at org.jboss.arquillian.core.impl.ManagerImpl.fire(ManagerImpl.java:133)
	at org.jboss.arquillian.core.impl.ManagerImpl.fire(ManagerImpl.java:105)
	at org.jboss.arquillian.core.impl.EventImpl.fire(EventImpl.java:62)
	at
org.jboss.arquillian.container.test.impl.client.ContainerEventController.execute(ContainerEventController.java:83)
	at sun.reflect.NativeMethodAccessorImpl.invoke0(Native Method)
	at
sun.reflect.NativeMethodAccessorImpl.invoke(NativeMethodAccessorImpl.java:62)
	at
sun.reflect.DelegatingMethodAccessorImpl.invoke(DelegatingMethodAccessorImpl.java:43)
	at java.lang.reflect.Method.invoke(Method.java:498)
	at org.jboss.arquillian.core.impl.ObserverImpl.invoke(ObserverImpl.java:86)
	at
org.jboss.arquillian.core.impl.EventContextImpl.invokeObservers(EventContextImpl.java:103)
	at
org.jboss.arquillian.core.impl.EventContextImpl.proceed(EventContextImpl.java:90)
	at
org.jboss.arquillian.test.impl.TestContextHandler.createSuiteContext(TestContextHandler.java:69)
	at sun.reflect.NativeMethodAccessorImpl.invoke0(Native Method)
	at
sun.reflect.NativeMethodAccessorImpl.invoke(NativeMethodAccessorImpl.java:62)
	at
sun.reflect.DelegatingMethodAccessorImpl.invoke(DelegatingMethodAccessorImpl.java:43)
	at java.lang.reflect.Method.invoke(Method.java:498)
	at org.jboss.arquillian.core.impl.ObserverImpl.invoke(ObserverImpl.java:86)
	at
org.jboss.arquillian.core.impl.EventContextImpl.proceed(EventContextImpl.java:95)
	at org.jboss.arquillian.core.impl.ManagerImpl.fire(ManagerImpl.java:133)
	at org.jboss.arquillian.core.impl.ManagerImpl.fire(ManagerImpl.java:105)
	at
org.jboss.arquillian.test.impl.EventTestRunnerAdaptor.beforeSuite(EventTestRunnerAdaptor.java:70)
	at org.jboss.arquillian.junit.Arquillian.run(Arquillian.java:111)
	at
org.apache.maven.surefire.junit4.JUnit4Provider.execute(JUnit4Provider.java:264)
	at
org.apache.maven.surefire.junit4.JUnit4Provider.executeTestSet(JUnit4Provider.java:153)
	at
org.apache.maven.surefire.junit4.JUnit4Provider.invoke(JUnit4Provider.java:124)
	at
org.apache.maven.surefire.booter.ForkedBooter.invokeProviderInSameClassLoader(ForkedBooter.java:200)
	at
org.apache.maven.surefire.booter.ForkedBooter.runSuitesInProcess(ForkedBooter.java:153)
	at
org.apache.maven.surefire.booter.ForkedBooter.main(ForkedBooter.java:103)

Running
com.orgcust.frontend.infrastructure.exceptions.NotifyUserJSFPageStrategyTest
34r3
Tests run: 2, Failures: 0, Errors: 0, Skipped: 0, Time elapsed: 0 sec - in
com.orgcust.frontend.infrastructure.exceptions.NotifyUserJSFPageStrategyTest

Results :

Tests in error: 
  EnquiriesTest.com.orgcust.frontend.backing.EnquiriesTest » Lifecycle
Unable to...
  EnquiryTest.com.orgcust.frontend.backing.EnquiryTest » Runtime Arquillian
init...

Tests run: 4, Failures: 0, Errors: 2, Skipped: 0

[INFO]
------------------------------------------------------------------------
[INFO] Reactor Summary:
[INFO] 
[INFO] front-end .......................................... FAILURE [ 14.591
s]
[INFO] auth-server ........................................ SKIPPED
[INFO] orgcust ............................................ SKIPPED
[INFO] nginx .............................................. SKIPPED
[INFO]
------------------------------------------------------------------------
[INFO] BUILD FAILURE
[INFO]
------------------------------------------------------------------------
[INFO] Total time: 14.794 s
[INFO] Finished at: 2018-07-31T12:12:53+01:00
[INFO] Final Memory: 39M/331M
[INFO]
------------------------------------------------------------------------
[ERROR] Failed to execute goal
org.apache.maven.plugins:maven-surefire-plugin:2.17:test (default-test) on
project front-end: There are test failures.
[ERROR] 
[ERROR] Please refer to
C:\Users\mail\Documents\dev\mark\apps\orgcust\project\frontend\target\surefire-reports
for the individual test results.
[ERROR] -> [Help 1]
[ERROR] 
[ERROR] To see the full stack trace of the errors, re-run Maven with the -e
switch.
[ERROR] Re-run Maven using the -X switch to enable full debug logging.
[ERROR] 
[ERROR] For more information about the errors and possible solutions, please
read the following articles:
[ERROR] [Help 1]
http://cwiki.apache.org/confluence/display/MAVEN/MojoFailureException

Process finished with exit code 1





--
Sent from: http://tomee-openejb.979440.n4.nabble.com/TomEE-Users-f979441.html

Mime
View raw message