trafficserver-users mailing list archives

Site index · List index
Message view « Date » · « Thread »
Top « Date » · « Thread »
From Anderson Brown <andersonbro...@gmail.com>
Subject Compiling on RHEL 5.3 (Tikanga) - configure: error: check for sqlite3 failed. Have you installed sqlite3-devel?
Date Tue, 22 Jun 2010 02:44:20 GMT
Hi -

Trying to compile traffic server with sqlite3, but for some reason it
wasn't able to detect it.

Error Message:
configure: error: in `/home/brown/trafficserver-2.0.0':
configure: error: check for sqlite3 failed. Have you installed sqlite3-devel?

YUM output:
python-sqlite.x86_64                       1.1.7-1.2.1                
installed
sqlite.i386                                3.3.6-2                    
installed
sqlite.x86_64                              3.3.6-2                    
installed
sqlite-devel.i386                          3.3.6-2                    
installed
sqlite-devel.x86_64                        3.3.6-2                    
installed

I'm currently using libdb just to get it to compile for now, but would
probably prefer sqlite.  Thoughts?

Thanks!
Mime
View raw message