trafficserver-users mailing list archives

Site index · List index
Message view « Date » · « Thread »
Top « Date » · « Thread »
From Reindl Harald <h.rei...@thelounge.net>
Subject build with jemalloc support fails on Fedora 18
Date Wed, 19 Jun 2013 23:36:16 GMT
because current dbmail-snapshots are supporting "jemalloc"
and so "jemalloc-devel-3.4.0-1.fc18.x86_64" is present on
my build-systems i tried to build trafficserver-3.2.4
by adding --with-jemalloc but this fails as you can see
below

from what i read jemalloc provides better performance at
concurrent load and it would be fine to get this working
sooner or later.............

http://people.freebsd.org/~jasone/jemalloc/bsdcan2006/jemalloc.pdf

ink_memory.cc: In function 'void* ats_malloc(size_t)':
ink_memory.cc:51:9: error: 'JEMALLOC_P' was not declared in this scope
ink_memory.cc: In function 'void* ats_calloc(size_t, size_t)':
ink_memory.cc:66:32: error: 'JEMALLOC_P' was not declared in this scope
ink_memory.cc: In function 'void* ats_realloc(void*, size_t)':
ink_memory.cc:81:36: error: 'JEMALLOC_P' was not declared in this scope
ink_memory.cc: In function 'void* ats_memalign(size_t, size_t)':
ink_memory.cc:109:42: error: 'JEMALLOC_P' was not declared in this scope
ink_memory.cc: In function 'void ats_free(void*)':
ink_memory.cc:140:20: error: 'JEMALLOC_P' was not declared in this scope
ink_memory.cc: In function 'void* ats_free_null(void*)':
ink_memory.cc:151:20: error: 'JEMALLOC_P' was not declared in this scope
ink_memory.cc: In function 'void ats_memalign_free(void*)':
ink_memory.cc:163:20: error: 'JEMALLOC_P' was not declared in this scope
  CXX    ink_res_init.lo
make[3]: *** [ink_memory.lo] Error 1
make[3]: *** Waiting for unfinished jobs....
make[3]: Leaving directory `/home/builduser/rpmbuild/BUILD/trafficserver-3.2.4/lib/ts'
make[2]: *** [all] Error 2
make[2]: Leaving directory `/home/builduser/rpmbuild/BUILD/trafficserver-3.2.4/lib/ts'
make[1]: *** [all-recursive] Error 1
make[1]: Leaving directory `/home/builduser/rpmbuild/BUILD/trafficserver-3.2.4/lib'
make: *** [all-recursive] Error 1
Fehler: Fehler-Status beim Beenden von /var/tmp/rpm-tmp.h3zkvW (%build)


Mime
View raw message