trafodion-dev mailing list archives

Site index · List index
Message view « Date » · « Thread »
Top « Date » · « Thread »
From traf-jenk...@trafodion.org
Subject Build failed in Jenkins: Check-Daily #14
Date Wed, 01 Jul 2015 13:31:55 GMT
See <https://jenkins02.trafodion.org/job/Check-Daily/14/changes>

Changes:

[adriana.fuentes] TM Support for DDL Alter Table

[qifan.chen] ESP-colocation fixes (Ravisha and Qifan)

[selva.ganesean] Changes related to JIRA [TRAFODION-14]

------------------------------------------
Started by timer
[EnvInject] - Loading node environment variables.
Building on master in workspace <https://jenkins02.trafodion.org/job/Check-Daily/ws/>
 > git rev-parse --is-inside-work-tree # timeout=10
Fetching changes from the remote Git repository
 > git config remote.origin.url https://github.com/apache/incubator-trafodion # timeout=10
Fetching upstream changes from https://github.com/apache/incubator-trafodion
 > git --version # timeout=10
 > git -c core.askpass=true fetch --tags --progress https://github.com/apache/incubator-trafodion
+refs/heads/*:refs/remotes/origin/*
 > git rev-parse refs/remotes/origin/master^{commit} # timeout=10
 > git rev-parse refs/remotes/origin/remotes/origin/master^{commit} # timeout=10
Checking out Revision 102970ca79f3f0fb079a53675f7ee2b561528eef (refs/remotes/origin/master)
 > git config core.sparsecheckout # timeout=10
 > git checkout -f 102970ca79f3f0fb079a53675f7ee2b561528eef
 > git rev-list 8de8d02d8042853db4667f4bc53f08becc181afb # timeout=10
[Check-Daily] $ /bin/sh /tmp/hudson4473747892860877763.sh
Detailed logs: http://logs.trafodion.org/Daily/2015-07-01_08-30-59/
Jenkins build: https://jenkins02.trafodion.org/job/Check-Daily/14/
Starting build job core-regress-hive-cm5.3.
Starting build job jdbc_test-cm5.3.
Starting build job core-regress-core-ahw2.2.
Starting build job core-regress-qat-ahw2.2.
Starting build job build-debug.
Starting build job phoenix_part2_T4-cm5.3.
Starting build job core-regress-udr-cm5.3.
Starting build job phoenix_part1_T4-ahw2.2.
Starting build job core-regress-core-cm5.3.
Starting build job pyodbc_test-cm5.3.
Starting build job phoenix_part1_T2-ahw2.2.
Starting build job pyodbc_test-ahw2.2.
Starting build job build-release.
Starting build job phoenix_part1_T2-cm5.3.
Starting build job core-regress-compGeneral-ahw2.2.
Starting build job core-regress-catman1-ahw2.2.
Starting build job phoenix_part2_T4-ahw2.2.
Starting build job core-regress-seabase-cm5.3.
Starting build job phoenix_part1_T4-cm5.3.
Starting build job phoenix_part2_T2-ahw2.2.
Starting build job core-regress-seabase-ahw2.2.
Starting build job core-regress-fullstack2-cm5.3.
Starting build job core-regress-hive-ahw2.2.
Starting build job phoenix_part2_T2-cm5.3.
Starting build job jdbc_test-ahw2.2.
Starting build job core-regress-fullstack2-ahw2.2.
Starting build job core-regress-executor-cm5.3.
Starting build job core-regress-compGeneral-cm5.3.
Starting build job core-regress-charsets-ahw2.2.
Starting build job core-regress-charsets-cm5.3.
Starting build job core-regress-catman1-cm5.3.
Starting build job core-regress-executor-ahw2.2.
Starting build job core-regress-udr-ahw2.2.
Starting build job core-regress-qat-cm5.3.
Finished Build : #40 of Job : build-debug with status : SUCCESS
java.lang.NullPointerExceptionFinished Build : #41 of Job : build-release with status : SUCCESS
java.lang.NullPointerExceptionFinished Build : #42 of Job : pyodbc_test-cm5.3 with status
: SUCCESS
java.lang.NullPointerExceptionFinished Build : #41 of Job : pyodbc_test-ahw2.2 with status
: SUCCESS
java.lang.NullPointerExceptionFinished Build : #14 of Job : core-regress-udr-cm5.3 with status
: SUCCESS
java.lang.NullPointerExceptionFinished Build : #14 of Job : core-regress-qat-ahw2.2 with status
: SUCCESS
java.lang.NullPointerExceptionFinished Build : #42 of Job : jdbc_test-cm5.3 with status :
SUCCESS
java.lang.NullPointerExceptionFinished Build : #14 of Job : core-regress-core-cm5.3 with status
: SUCCESS
java.lang.NullPointerExceptionFinished Build : #14 of Job : core-regress-hive-cm5.3 with status
: SUCCESS
java.lang.NullPointerExceptionFinished Build : #14 of Job : phoenix_part2_T4-cm5.3 with status
: SUCCESS
java.lang.NullPointerExceptionFinished Build : #14 of Job : core-regress-fullstack2-cm5.3
with status : SUCCESS
java.lang.NullPointerExceptionFinished Build : #48 of Job : core-regress-core-ahw2.2 with
status : SUCCESS
java.lang.NullPointerExceptionFinished Build : #14 of Job : core-regress-compGeneral-ahw2.2
with status : FAILURE
java.lang.NullPointerExceptionFinished Build : #14 of Job : core-regress-seabase-cm5.3 with
status : SUCCESS
java.lang.NullPointerExceptionFinished Build : #14 of Job : core-regress-catman1-ahw2.2 with
status : SUCCESS
java.lang.NullPointerExceptionFinished Build : #14 of Job : phoenix_part2_T4-ahw2.2 with status
: SUCCESS
java.lang.NullPointerExceptionFinished Build : #14 of Job : core-regress-fullstack2-ahw2.2
with status : SUCCESS
java.lang.NullPointerExceptionFinished Build : #14 of Job : phoenix_part1_T4-cm5.3 with status
: SUCCESS
java.lang.NullPointerExceptionFinished Build : #14 of Job : phoenix_part1_T2-cm5.3 with status
: SUCCESS
java.lang.NullPointerExceptionFinished Build : #14 of Job : core-regress-charsets-cm5.3 with
status : SUCCESS
java.lang.NullPointerExceptionFinished Build : #14 of Job : core-regress-compGeneral-cm5.3
with status : FAILURE
java.lang.NullPointerExceptionFinished Build : #14 of Job : phoenix_part1_T2-ahw2.2 with status
: SUCCESS
java.lang.NullPointerExceptionFinished Build : #14 of Job : core-regress-executor-cm5.3 with
status : SUCCESS
java.lang.NullPointerExceptionFinished Build : #14 of Job : core-regress-qat-cm5.3 with status
: SUCCESS
java.lang.NullPointerExceptionFinished Build : #14 of Job : phoenix_part2_T2-cm5.3 with status
: SUCCESS
java.lang.NullPointerExceptionFinished Build : #14 of Job : core-regress-charsets-ahw2.2 with
status : SUCCESS
java.lang.NullPointerExceptionFinished Build : #14 of Job : phoenix_part2_T2-ahw2.2 with status
: SUCCESS
java.lang.NullPointerExceptionFinished Build : #14 of Job : jdbc_test-ahw2.2 with status :
SUCCESS
java.lang.NullPointerExceptionFinished Build : #48 of Job : core-regress-seabase-ahw2.2 with
status : SUCCESS
java.lang.NullPointerExceptionFinished Build : #14 of Job : core-regress-catman1-cm5.3 with
status : SUCCESS
java.lang.NullPointerExceptionFinished Build : #14 of Job : core-regress-hive-ahw2.2 with
status : SUCCESS
java.lang.NullPointerExceptionFinished Build : #14 of Job : core-regress-udr-ahw2.2 with status
: SUCCESS
java.lang.NullPointerExceptionFinished Build : #14 of Job : core-regress-executor-ahw2.2 with
status : SUCCESS
java.lang.NullPointerExceptionFinished Build : #14 of Job : phoenix_part1_T4-ahw2.2 with status
: FAILURE
java.lang.NullPointerExceptionBuild step 'MultiJob Phase' marked build as failure
[SCP] Copying console log.

Mime
View raw message