trafodion-dev mailing list archives

Site index · List index
Message view « Date » · « Thread »
Top « Date » · « Thread »
From Selva Govindarajan <selva.govindara...@esgyn.com>
Subject RE: Trafodion master Daily Test Result - 168 - Still Failing
Date Thu, 07 Apr 2016 15:26:32 GMT
Steve,

The hive test failures are already analyzed. I am waiting for the community
input about the change in sqenvcom.sh.  Please feel free to make the change
if it looks appropriate for you.  The change is

The line 351 is added to sqenvcom.sh.

    347   # directories with jar files and list of jar files
    348   # (could try to reduce the number of jars in the classpath)
    349   export HADOOP_JAR_DIRS="/usr/lib/hadoop
    350                           /usr/lib/hadoop/lib
    351                           /usr/lib/hadoop-0.20-mapreduce"

Selva

-----Original Message-----
From: steve.varnau@esgyn.com [mailto:steve.varnau@esgyn.com]
Sent: Thursday, April 7, 2016 4:03 AM
To: dev@trafodion.incubator.apache.org
Subject: Trafodion master Daily Test Result - 168 - Still Failing

Daily Automated Testing master

Jenkins Job:   https://jenkins.esgyn.com/job/Check-Daily-master/168/
Archived Logs: http://traf-testlogs.esgyn.com/Daily-master/168
Bld Downloads: http://traf-builds.esgyn.com

Changes since previous daily build:
[amanda] Fixing merge error

[amanda] [[ TRAFODION 1919 ]] Needs -u -p for config.sh

[narain.arvind] [TRAFODION-1473] T4 support for new sqltypecode BLOB(-602)
and



Test Job Results:

FAILURE core-regress-core-cdh (40 min)
FAILURE core-regress-hive-cdh (55 min)
FAILURE core-regress-privs1-cdh (36 min) FAILURE jdbc_test-hdp (1 hr 22 min)
FAILURE phoenix_part1_T2-cdh (11 min) FAILURE phoenix_part1_T2-hdp (1 hr 6
min) FAILURE phoenix_part2_T2-cdh (10 min) FAILURE phoenix_part2_T2-hdp (16
min) SUCCESS build-master-debug (22 min) SUCCESS build-master-release (29
min) SUCCESS core-regress-charsets-cdh (56 min) SUCCESS
core-regress-charsets-hdp (1 hr 11 min) SUCCESS core-regress-compGeneral-cdh
(1 hr 0 min) SUCCESS core-regress-compGeneral-hdp (46 min) SUCCESS
core-regress-core-hdp (1 hr 28 min) SUCCESS core-regress-executor-cdh (47
min) SUCCESS core-regress-executor-hdp (1 hr 3 min) SUCCESS
core-regress-fullstack2-cdh (37 min) SUCCESS core-regress-fullstack2-hdp (41
min) SUCCESS core-regress-hive-hdp (1 hr 10 min) SUCCESS
core-regress-privs1-hdp (46 min) SUCCESS core-regress-privs2-cdh (1 hr 3
min) SUCCESS core-regress-privs2-hdp (46 min) SUCCESS core-regress-qat-cdh
(43 min) SUCCESS core-regress-qat-hdp (48 min) SUCCESS
core-regress-seabase-cdh (52 min) SUCCESS core-regress-seabase-hdp (1 hr 45
min) SUCCESS core-regress-udr-cdh (19 min) SUCCESS core-regress-udr-hdp (27
min) SUCCESS jdbc_test-cdh (29 min) SUCCESS phoenix_part1_T4-cdh (47 min)
SUCCESS phoenix_part1_T4-hdp (1 hr 9 min) SUCCESS phoenix_part2_T4-cdh (1 hr
34 min) SUCCESS phoenix_part2_T4-hdp (1 hr 1 min) SUCCESS pyodbc_test-cdh
(10 min) SUCCESS pyodbc_test-hdp (15 min)

Mime
View raw message