trafodion-dev mailing list archives

Site index · List index
Message view « Date » · « Thread »
Top « Date » · « Thread »
From Sandhya Sundaresan <sandhya.sundare...@esgyn.com>
Subject RE: Trafodion master Daily Test Result - 165
Date Mon, 04 Apr 2016 14:56:19 GMT
 RE: Trafodion master Daily Test Result - 165

We might need Ming's change (attached) checked in before we proceed . He
said it’s a workaround but perhaps that is the fix ?  Need Hans, Prashanth
to chime in here to verify.

The build failed just like a few others said it did for them .  I saw this
same error(below)  in the make.log for the Sat build and today's build.

Sandhya

<<...>>

[ERROR] Failed to execute goal on project hbase-trx-hdp2_3: Could not
resolve dependencies for project org.apache:hbase-trx-hdp2_3:jar:2.0.0:
Failed to collect dependencies for
[org.apache.hbase:hbase-common:jar:1.1.2.2.3.2.0-2950 (compile),
org.apache.hbase:hbase-protocol:jar:1.1.2.2.3.2.0-2950 (compile),
org.apache.hbase:hbase-client:jar:1.1.2.2.3.2.0-2950 (compile),
org.apache.hbase:hbase-server:jar:1.1.2.2.3.2.0-2950 (compile),
org.apache.hbase:hbase-thrift:jar:1.1.2.2.3.2.0-2950 (compile),
org.apache.hbase:hbase-testing-util:jar:1.1.2.2.3.2.0-2950 (test),
org.apache.thrift:libthrift:jar:0.9.1 (compile),
commons-logging:commons-logging:jar:1.1.3 (compile),
org.apache.zookeeper:zookeeper:jar:3.4.6 (compile),
com.google.protobuf:protobuf-java:jar:2.5.0 (compile),
org.apache.hadoop:hadoop-mapreduce-client-core:jar:2.7.1.2.3.2.0-2950
(compile), org.apache.hadoop:hadoop-common:jar:2.7.1.2.3.2.0-2950
(compile)]: Failed to read artifact descriptor for
org.apache.hbase:hbase-common:jar:1.1.2.2.3.2.0-2950: Could not transfer
artifact org.apache.hbase:hbase-common:pom:1.1.2.2.3.2.0-2950 from/to
HDPReleases (http://repo.hortonworks.com/content/repositories/releases/):
Failed to transfer file:
http://repo.hortonworks.com/content/repositories/releases/org/apache/hbase/hbase-common/1.1.2.2.3.2.0-2950/hbase-common-1.1.2.2.3.2.0-2950.pom.
Return code is: 500 , ReasonPhrase:Server Error. -> [Help 1]       ##(SQF)

[ERROR]         ##(SQF)

[ERROR] To see the full stack trace of the errors, re-run Maven with the -e
switch.     ##(SQF)

[ERROR] Re-run Maven using the -X switch to enable full debug logging.
##(SQF)

[ERROR]         ##(SQF)

[ERROR] For more information about the errors and possible solutions,
please read the following articles:       ##(SQF)

[ERROR] [Help 1]
http://cwiki.apache.org/confluence/display/MAVEN/DependencyResolutionException
##(SQF)

make[3]: *** [jdk_1_7_hdp] Error 1      ##(SQF)

make[3]: Leaving directory
`/home/jenkins/workspace/build-master-debug/trafodion/core/sqf/src/seatrans/hbase-trx'
##(SQF)

make[2]: *** [cp_trx_jar] Error 2       ##(SQF)

make[2]: Leaving directory
`/home/jenkins/workspace/build-master-debug/trafodion/core/sqf/src/tm'
##(SQF)

make[1]: *** [tm] Error 2

make[1]: *** Waiting for unfinished jobs....

ude/log4cxx/log4cxx -c -o Linux-x86_64/64/dbg/reqqueue.o reqqueue.cxx
##(SQF)

Finished building target: Linux-x86_64/64/dbg/reqqueue.o        ##(SQF)

        ##(SQF)

Building target: Linux-x86_64/64/dbg/reqattstartup.o    ##(SQF)

Invoking: C++ Compiler  ##(SQF)

/opt/traf/tools/dest-mpich-3.0.4/bin/mpicxx
-Wp,-MD,Linux-x86_64/64/dbg/depend/reqattstartup.cxx.dep
-Wp,-MT,Linux-x86_64/64/dbg/reqattstartup.o -Wno-long-long
-fmessage-length=0 -g -Wno-deprecated -fmessage-length=0 -DDMALLOC
-DUSE_MON_LOGGING -D_MPICC_H -UNDEBUG -Wall -Wextra -DMON_DEBUG
-DUSE_TESTPOINTS
-I/home/jenkins/workspace/build-master-debug/trafodion/core/sqf/export/include
-I -I../../inc -I../../commonLogger -I/usr/include/log4cxx
-I/usr/include/log4cxx/log4cxx -c -o Linux-x86_64/64/dbg/reqattstartup.o
reqattstartup.cxx        ##(SQF)

Finished building target: Linux-x86_64/64/dbg/reqattstartup.o   ##(SQF)

        ##(SQF)

-----Original Message-----
From: Anoop Sharma [mailto:anoop.sharma@esgyn.com <anoop.sharma@esgyn.com>]
Sent: Monday, April 4, 2016 7:19 AM
To: dev@trafodion.incubator.apache.org
Subject: RE: Trafodion master Daily Test Result - 165

tests have not been running since saturday.

Whats causing it?

-----Original Message-----

From: steve.varnau@esgyn.com [mailto:steve.varnau@esgyn.com
<steve.varnau@esgyn.com>]

Sent: Monday, April 4, 2016 1:44 AM

To: dev@trafodion.incubator.apache.org

Subject: Trafodion master Daily Test Result - 165

Daily Automated Testing master

Jenkins Job:   https://jenkins.esgyn.com/job/Check-Daily-master/165/

Archived Logs: http://traf-testlogs.esgyn.com/Daily-master/165

Bld Downloads: http://traf-builds.esgyn.com

Changes since previous daily build:

No changes

Test Job Results:

FAILURE build-master-debug (2 min 46 sec) FAILURE build-master-release (4
min 13 sec) FAILURE core-regress-charsets-cdh (1 min 36 sec) FAILURE
core-regress-charsets-hdp (8 min 20 sec) FAILURE
core-regress-compGeneral-cdh (1 min 40 sec) FAILURE
core-regress-compGeneral-hdp (8 min 45 sec) FAILURE core-regress-core-cdh
(1 min 37 sec) FAILURE core-regress-core-hdp (1 min 26 sec) FAILURE
core-regress-executor-cdh (1 min 35 sec) FAILURE core-regress-executor-hdp
(8 min 48 sec) FAILURE core-regress-fullstack2-cdh (6 min 1 sec) FAILURE
core-regress-fullstack2-hdp (9 min 10 sec) FAILURE core-regress-hive-cdh (1
min 38 sec) FAILURE core-regress-hive-hdp (9 min 19 sec) FAILURE
core-regress-privs1-cdh (1 min 36 sec) FAILURE core-regress-privs1-hdp (7
min 17 sec) FAILURE core-regress-privs2-cdh (1 min 38 sec) FAILURE
core-regress-privs2-hdp (1 min 33 sec) FAILURE core-regress-qat-cdh (1 min
37 sec) FAILURE core-regress-qat-hdp (1 min 33 sec) FAILURE
core-regress-seabase-cdh (6 min 1 sec) FAILURE core-regress-seabase-hdp (9
min 14 sec) FAILURE core-regress-udr-cdh (1 min 38 sec) FAILURE
core-regress-udr-hdp (9 min 29 sec) FAILURE jdbc_test-cdh (7 min 59 sec)
FAILURE jdbc_test-hdp (1 min 26 sec) FAILURE phoenix_part1_T2-cdh (1 min 37
sec) FAILURE phoenix_part1_T2-hdp (1 min 33 sec) FAILURE
phoenix_part1_T4-cdh (8 min 2 sec) FAILURE phoenix_part1_T4-hdp (1 min 32
sec) FAILURE phoenix_part2_T2-cdh (1 min 36 sec) FAILURE
phoenix_part2_T2-hdp (1 min 33 sec) FAILURE phoenix_part2_T4-cdh (5 min 41
sec) FAILURE phoenix_part2_T4-hdp (1 min 21 sec) FAILURE pyodbc_test-cdh (5
min 44 sec) FAILURE pyodbc_test-hdp (1 min 34 sec)

Mime
View raw message