trafodion-dev mailing list archives

Site index · List index
Message view « Date » · « Thread »
Top « Date » · « Thread »
From Stack <st...@duboce.net>
Subject Log from failed 2.0.1 build
Date Wed, 06 Jul 2016 17:12:42 GMT
Below is from my screen of my attempt at building 2.0.1. Robera asked for
it over on general@incubator (I've since let the machine go since it was a
rented cenos 6.6):

M

[stack@trafodion2 apache-trafodion-2.0.1-incubating]$ make all
Building all Trafodion components
Building all Trafodion components
cd core && make all
make[1]: Entering directory
`/home/stack/apache-trafodion-2.0.1-incubating/core'
./bldenvchk.sh;
cd sqf && make genverhdr
cd sql/lib_mgmt && make all
make[2]: Entering directory
`/home/stack/apache-trafodion-2.0.1-incubating/core/sql/lib_mgmt'
make[2]: Entering directory
`/home/stack/apache-trafodion-2.0.1-incubating/core/sqf'
Building Apache Trafodion Version 2.0.1 debug

*** Warning: QT_TOOLKIT does not point to an existing directory.
*** Warning: SQL Compiler Debugger will not be built.
cd sqf && make setupdir 2>&1 | sed -e "s/$/     ##(setupdir)/";exit
${PIPESTATUS[0]}
make[2]: Entering directory
`/home/stack/apache-trafodion-2.0.1-incubating/core/sqf'    ##(setupdir)
mkdir -p export/bin64d  ##(setupdir)
mkdir -p export/lib64d  ##(setupdir)
mkdir -p export/include/sql     ##(setupdir)
mkdir -p export/include ##(setupdir)
cd monitor/linux; make setup    ##(setupdir)
cd build-scripts && ./genverhdr.ksh -major "2" \
                                        -minor "0" \
                                        -update "1" \
                                        -build "stack" \
                                        -flavor "debug" \
                                        -funbranch "_dh_" \
                                        -branch "-" \
                                        -date "05Jul16"
make[3]: Entering directory
`/home/stack/apache-trafodion-2.0.1-incubating/core/sqf/monitor/linux'
 ##(setupdir)
make[3]: Leaving directory
`/home/stack/apache-trafodion-2.0.1-incubating/core/sqf/monitor/linux'
  ##(setupdir)
cd src/win; make setup  ##(setupdir)
make[2]: Leaving directory
`/home/stack/apache-trafodion-2.0.1-incubating/core/sqf'
cd conn/jdbc_type4 && ant deploy 2>&1 | sed -e "s/$/    ##(JDBCT4)/";exit
${PIPESTATUS[0]}
make[3]: Entering directory
`/home/stack/apache-trafodion-2.0.1-incubating/core/sqf/src/win'
 ##(setupdir)
make[3]: Leaving directory
`/home/stack/apache-trafodion-2.0.1-incubating/core/sqf/src/win'
##(setupdir)
cd src/seabed; make setup       ##(setupdir)
make[3]: Entering directory
`/home/stack/apache-trafodion-2.0.1-incubating/core/sqf/src/seabed'
##(setupdir)
make[3]: Leaving directory
`/home/stack/apache-trafodion-2.0.1-incubating/core/sqf/src/seabed'
 ##(setupdir)
cd src/tm; make setup   ##(setupdir)
make[3]: Entering directory
`/home/stack/apache-trafodion-2.0.1-incubating/core/sqf/src/tm'
##(setupdir)
cd tools; make setup    ##(setupdir)
make[4]: Entering directory
`/home/stack/apache-trafodion-2.0.1-incubating/core/sqf/src/tm/tools'
##(setupdir)
OUTDIR = Linux-x86_64/64/dbg    ##(setupdir)
LIBEXPDIR =
/home/stack/apache-trafodion-2.0.1-incubating/core/sqf/export/lib64d
 ##(setupdir)
LIBSTM =
-L/home/stack/apache-trafodion-2.0.1-incubating/core/sqf/export/lib64d
-lutil -lsbms -lsbfs -levlsq -lstmlib -lreadline -lcurses
-L../../seabed/test -L../../seabed/test -L../../seabed/test   ##(setupdir)
make[4]: Leaving directory
`/home/stack/apache-trafodion-2.0.1-incubating/core/sqf/src/tm/tools'
 ##(setupdir)
HBASETMLIB =
 /home/stack/apache-trafodion-2.0.1-incubating/core/sqf/src/seatrans/tm/hbasetmlib2
       ##(setupdir)
cd
/home/stack/apache-trafodion-2.0.1-incubating/core/sqf/src/seatrans/tm/hbasetmlib2;
make setup       ##(setupdir)
make[4]: Entering directory
`/home/stack/apache-trafodion-2.0.1-incubating/core/sqf/src/seatrans/tm/hbasetmlib2'
       ##(setupdir)
OUTDIR = Linux-x86_64/64/dbg    ##(setupdir)
TMOBJLOC =
/home/stack/apache-trafodion-2.0.1-incubating/core/sqf/src/tm/Linux-x86_64/64/dbg
   ##(setupdir)
LIBSTMOBJS = Linux-x86_64/64/dbg/hbasetm.o
Linux-x86_64/64/dbg/javaobjectinterfacetm.o
Linux-x86_64/64/dbg/vershbasetmlib.o     ##(setupdir)
JAVA_HOME = /usr/lib/jvm/java-1.7.0-openjdk.x86_64      ##(setupdir)
INCLUDES =
 -I/home/stack/apache-trafodion-2.0.1-incubating/core/sqf/export/include
-I../../monitor/linux
-I/home/stack/apache-trafodion-2.0.1-incubating/core/sqf/src/tm
-I/home/stack/apache-trafodion-2.0.1-incubating/core/sqf/export/include
-I/export/include -I/source/pu
blications -I/usr/include -I/usr/lib/jvm/java-1.7.0-openjdk.x86_64/include
-I/usr/lib/jvm/java-1.7.0-openjdk.x86_64/include/linux   ##(setupdir)
CDEP_DIR =  Linux-x86_64/64/dbg/depend  ##(setupdir)
make[4]: Leaving directory
`/home/stack/apache-trafodion-2.0.1-incubating/core/sqf/src/seatrans/tm/hbasetmlib2'
##(setupdir)
make[3]: Leaving directory
`/home/stack/apache-trafodion-2.0.1-incubating/core/sqf/src/tm'
 ##(setupdir)
cd sqevlog; make setup  ##(setupdir)
make[3]: Entering directory
`/home/stack/apache-trafodion-2.0.1-incubating/core/sqf/sqevlog'
 ##(setupdir)
cd sq_evl_libs; make setup      ##(setupdir)
make[4]: Entering directory
`/home/stack/apache-trafodion-2.0.1-incubating/core/sqf/sqevlog/sq_evl_libs'
       ##(setupdir)
cd sq_evl_lib; make setup       ##(setupdir)
Buildfile: build.xml    ##(JDBCT4)
make[5]: Entering directory
`/home/stack/apache-trafodion-2.0.1-incubating/core/sqf/sqevlog/sq_evl_libs/sq_evl_lib'
    ##(setupdir)
Directory is created    ##(setupdir)
make[5]: Leaving directory
`/home/stack/apache-trafodion-2.0.1-incubating/core/sqf/sqevlog/sq_evl_libs/sq_evl_lib'
     ##(setupdir)
make[4]: Leaving directory
`/home/stack/apache-trafodion-2.0.1-incubating/core/sqf/sqevlog/sq_evl_libs'
##(setupdir)
make[3]: Leaving directory
`/home/stack/apache-trafodion-2.0.1-incubating/core/sqf/sqevlog'
##(setupdir)
cd sql; make
WROOT=/home/stack/apache-trafodion-2.0.1-incubating/core/sqf/../sql setup
 ##(setupdir)
make[3]: Entering directory
`/home/stack/apache-trafodion-2.0.1-incubating/core/sqf/sql'
 ##(setupdir)k
cd stublibs; make setup ##(setupdir)
make[4]: Entering directory
`/home/stack/apache-trafodion-2.0.1-incubating/core/sqf/sql/stublibs'
##(setupdir)
make[4]: Leaving directory
`/home/stack/apache-trafodion-2.0.1-incubating/core/sqf/sql/stublibs'
 ##(setupdir)
cd /home/stack/apache-trafodion-2.0.1-incubating/core/sqf/../sql/nskgmake;
make linuxmklinksdebug       ##(setupdir)
Loading component makefiles ... ##(setupdir)
make[4]: Entering directory
`/home/stack/apache-trafodion-2.0.1-incubating/core/sql/nskgmake'
##(setupdir)
mkdir -p
/home/stack/apache-trafodion-2.0.1-incubating/core/sqf/export/lib64d
##(setupdir)
# these must be found   ##(setupdir)
cp -Pf
/home/stack/trafodion-build-tools/apache-log4cxx-0.10.0/lib/liblog4cxx*.so*
/home/stack/apache-trafodion-2.0.1-incubating/core/sqf/export/lib64d
##(setupdir)
cp -Pf /home/stack/trafodion-build-tools/thrift-0.9.0/lib/libthrift-*.so*
/home/stack/apache-trafodion-2.0.1-incubating/core/sqf/export/lib64d
 ##(setupdir)
     [exec] Result: 128 ##(JDBCT4)
        ##(JDBCT4)
init:   ##(JDBCT4)
cp -Pf /home/stack/trafodion-build-tools/thrift-0.9.0/lib/libthrift.so
/home/stack/apache-trafodion-2.0.1-incubating/core/sqf/export/lib64d
##(setupdir)
        ##(JDBCT4)
compile:        ##(JDBCT4)
# if these are not found, then...       ##(setupdir)
cp -Pf
/home/stack/trafodion-build-tools/hadoop-2.6.0/lib/native/libhdfs.so*
/home/stack/apache-trafodion-2.0.1-incubating/core/sqf/export/lib64d
##(setupdir)
cp -Pf
/home/stack/trafodion-build-tools/hadoop-2.6.0/lib/native/libhadoop.so*
/home/stack/apache-trafodion-2.0.1-incubating/core/sqf/export/lib64d
##(setupdir)
cp -Pf /home/stack/trafodion-build-tools/hadoop-2.6.0/include/hdfs.h
/home/stack/apache-trafodion-2.0.1-incubating/core/sqf/export/include
 ##(setupdir)
# download Hadoop-common distro ##(setupdir)
get_libhdfs_files --verbose     ##(setupdir)
(OUTDIR=/home/stack/apache-trafodion-2.0.1-incubating/core/sql/lib/linux/64bit/debug;\
 ##(setupdir)
         for i in libcomexe.so libcommon.so libexecutor.so libsort.so
libsqlmsg.so libtdm_sqlcli.so libtdm_sqlcli_globals.so libtdm_sqlexp.so
libtdm_sqlexport.so libtdm_sqlmxevents.so libtdm_sqlshare.so
libtdm_sqlerrormsg.so libeh.so liblmcomp.so libsqlcilib.so libcli.so
libporting_layer.so libtdm_sqlmxmsg_intl.so libarkcmp_dll.so libsmdio.so
libudr_predef.so libclitest.so libsqlcomp.so libustat.so libsqlcat.so
libparser.so liboptimizer.so libgenerator.so libtdm_sqllangman.so
libarkcmplib.so libqmscommon.so libSqlCompilerDebugger.so;\
##(setupdir)
         do \   ##(setupdir)
           echo ln -sf $OUTDIR/$i
/home/stack/apache-trafodion-2.0.1-incubating/core/sqf/export/lib64d;\
   ##(setupdir)
           ln -sf $OUTDIR/$i
/home/stack/apache-trafodion-2.0.1-incubating/core/sqf/export/lib64d;\
##(setupdir)
         done;\ ##(setupdir)
         for i in tdm_arkcmp sqlci tdm_arkesp tdm_udrserv mxlobsrvr mxsscp
mxssmp clitestdriver;\       ##(setupdir)
         do \   ##(setupdir)
           echo ln -sf $OUTDIR/$i
/home/stack/apache-trafodion-2.0.1-incubating/core/sqf/export/bin64d;\
   ##(setupdir)
           ln -sf $OUTDIR/$i
/home/stack/apache-trafodion-2.0.1-incubating/core/sqf/export/bin64d;\
##(setupdir)
         done;\ ##(setupdir)
         for i in ;\    ##(setupdir)
         do \   ##(setupdir)
           echo ln -sf $OUTDIR/$i ../regress/tools/$i; \        ##(setupdir)
           ln -sf $OUTDIR/$i ../regress/tools/$i; \     ##(setupdir)
         done\  ##(setupdir)
        )       ##(setupdir)
ln -sf
/home/stack/apache-trafodion-2.0.1-incubating/core/sql/lib/linux/64bit/debug/libcomexe.so
/home/stack/apache-trafodion-2.0.1-incubating/core/sqf/export/lib64d
##(setupdir)
ln -sf
/home/stack/apache-trafodion-2.0.1-incubating/core/sql/lib/linux/64bit/debug/libcommon.so
/home/stack/apache-trafodion-2.0.1-incubating/core/sqf/export/lib64d
##(setupdir)
ln -sf
/home/stack/apache-trafodion-2.0.1-incubating/core/sql/lib/linux/64bit/debug/libexecutor.so
/home/stack/apache-trafodion-2.0.1-incubating/core/sqf/export/lib64d
##(setupdir)
ln -sf
/home/stack/apache-trafodion-2.0.1-incubating/core/sql/lib/linux/64bit/debug/libsort.so
/home/stack/apache-trafodion-2.0.1-incubating/core/sqf/export/lib64d
##(setupdir)
ln -sf
/home/stack/apache-trafodion-2.0.1-incubating/core/sql/lib/linux/64bit/debug/libsqlmsg.so
/home/stack/apache-trafodion-2.0.1-incubating/core/sqf/export/lib64d
##(setupdir)
ln -sf
/home/stack/apache-trafodion-2.0.1-incubating/core/sql/lib/linux/64bit/debug/libtdm_sqlcli.so
/home/stack/apache-trafodion-2.0.1-incubating/core/sqf/export/lib64d
##(setupdir)
ln -sf
/home/stack/apache-trafodion-2.0.1-incubating/core/sql/lib/linux/64bit/debug/libtdm_sqlcli_globals.so
/home/stack/apache-trafodion-2.0.1-incubating/core/sqf/export/lib64d
##(setupdir)
ln -sf
/home/stack/apache-trafodion-2.0.1-incubating/core/sql/lib/linux/64bit/debug/libtdm_sqlexp.so
/home/stack/apache-trafodion-2.0.1-incubating/core/sqf/export/lib64d
##(setupdir)
ln -sf
/home/stack/apache-trafodion-2.0.1-incubating/core/sql/lib/linux/64bit/debug/libtdm_sqlexport.so
/home/stack/apache-trafodion-2.0.1-incubating/core/sqf/export/lib64d
 ##(setupdir)
ln -sf
/home/stack/apache-trafodion-2.0.1-incubating/core/sql/lib/linux/64bit/debug/libtdm_sqlmxevents.so
/home/stack/apache-trafodion-2.0.1-incubating/core/sqf/export/lib64d
 ##(setupdir)
ln -sf
/home/stack/apache-trafodion-2.0.1-incubating/core/sql/lib/linux/64bit/debug/libtdm_sqlshare.so
/home/stack/apache-trafodion-2.0.1-incubating/core/sqf/export/lib64d
##(setupdir)
ln -sf
/home/stack/apache-trafodion-2.0.1-incubating/core/sql/lib/linux/64bit/debug/libtdm_sqlerrormsg.so
/home/stack/apache-trafodion-2.0.1-incubating/core/sqf/export/lib64d
 ##(setupdir)
ln -sf
/home/stack/apache-trafodion-2.0.1-incubating/core/sql/lib/linux/64bit/debug/libeh.so
/home/stack/apache-trafodion-2.0.1-incubating/core/sqf/export/lib64d
##(setupdir)
ln -sf
/home/stack/apache-trafodion-2.0.1-incubating/core/sql/lib/linux/64bit/debug/liblmcomp.so
/home/stack/apache-trafodion-2.0.1-incubating/core/sqf/export/lib64d
##(setupdir)
ln -sf
/home/stack/apache-trafodion-2.0.1-incubating/core/sql/lib/linux/64bit/debug/libsqlcilib.so
/home/stack/apache-trafodion-2.0.1-incubating/core/sqf/export/lib64d
##(setupdir)
ln -sf
/home/stack/apache-trafodion-2.0.1-incubating/core/sql/lib/linux/64bit/debug/libcli.so
/home/stack/apache-trafodion-2.0.1-incubating/core/sqf/export/lib64d
 ##(setupdir)
ln -sf
/home/stack/apache-trafodion-2.0.1-incubating/core/sql/lib/linux/64bit/debug/libporting_layer.so
/home/stack/apache-trafodion-2.0.1-incubating/core/sqf/export/lib64d
 ##(setupdir)
ln -sf
/home/stack/apache-trafodion-2.0.1-incubating/core/sql/lib/linux/64bit/debug/libtdm_sqlmxmsg_intl.so
/home/stack/apache-trafodion-2.0.1-incubating/core/sqf/export/lib64d
 ##(setupdir)
ln -sf
/home/stack/apache-trafodion-2.0.1-incubating/core/sql/lib/linux/64bit/debug/libarkcmp_dll.so
/home/stack/apache-trafodion-2.0.1-incubating/core/sqf/export/lib64d
##(setupdir)
ln -sf
/home/stack/apache-trafodion-2.0.1-incubating/core/sql/lib/linux/64bit/debug/libsmdio.so
/home/stack/apache-trafodion-2.0.1-incubating/core/sqf/export/lib64d
 ##(setupdir)
ln -sf
/home/stack/apache-trafodion-2.0.1-incubating/core/sql/lib/linux/64bit/debug/libudr_predef.so
/home/stack/apache-trafodion-2.0.1-incubating/core/sqf/export/lib64d
##(setupdir)
ln -sf
/home/stack/apache-trafodion-2.0.1-incubating/core/sql/lib/linux/64bit/debug/libclitest.so
/home/stack/apache-trafodion-2.0.1-incubating/core/sqf/export/lib64d
 ##(setupdir)
ln -sf
/home/stack/apache-trafodion-2.0.1-incubating/core/sql/lib/linux/64bit/debug/libsqlcomp.so
/home/stack/apache-trafodion-2.0.1-incubating/core/sqf/export/lib64d
 ##(setupdir)
ln -sf
/home/stack/apache-trafodion-2.0.1-incubating/core/sql/lib/linux/64bit/debug/libustat.so
/home/stack/apache-trafodion-2.0.1-incubating/core/sqf/export/lib64d
 ##(setupdir)
ln -sf
/home/stack/apache-trafodion-2.0.1-incubating/core/sql/lib/linux/64bit/debug/libsqlcat.so
/home/stack/apache-trafodion-2.0.1-incubating/core/sqf/export/lib64d
##(setupdir)
ln -sf
/home/stack/apache-trafodion-2.0.1-incubating/core/sql/lib/linux/64bit/debug/libparser.so
/home/stack/apache-trafodion-2.0.1-incubating/core/sqf/export/lib64d
##(setupdir)
ln -sf
/home/stack/apache-trafodion-2.0.1-incubating/core/sql/lib/linux/64bit/debug/liboptimizer.so
/home/stack/apache-trafodion-2.0.1-incubating/core/sqf/export/lib64d
 ##(setupdir)
ln -sf
/home/stack/apache-trafodion-2.0.1-incubating/core/sql/lib/linux/64bit/debug/libgenerator.so
/home/stack/apache-trafodion-2.0.1-incubating/core/sqf/export/lib64d
 ##(setupdir)
ln -sf
/home/stack/apache-trafodion-2.0.1-incubating/core/sql/lib/linux/64bit/debug/libtdm_sqllangman.so
/home/stack/apache-trafodion-2.0.1-incubating/core/sqf/export/lib64d
##(setupdir)
[INFO] --- maven-resources-plugin:2.6:testResources (default-testResources)
@ lib_mgmt ---
ln -sf
/home/stack/apache-trafodion-2.0.1-incubating/core/sql/lib/linux/64bit/debug/libparser.so
/home/stack/apache-trafodion-2.0.1-incubating/core/sqf/export/lib64d
##(setupdir)
ln -sf
/home/stack/apache-trafodion-2.0.1-incubating/core/sql/lib/linux/64bit/debug/liboptimizer.so
/home/stack/apache-trafodion-2.0.1-incubating/core/sqf/export/lib64d
 ##(setupdir)
ln -sf
/home/stack/apache-trafodion-2.0.1-incubating/core/sql/lib/linux/64bit/debug/libgenerator.so
/home/stack/apache-trafodion-2.0.1-incubating/core/sqf/export/lib64d
 ##(setupdir)
ln -sf
/home/stack/apache-trafodion-2.0.1-incubating/core/sql/lib/linux/64bit/debug/libtdm_sqllangman.so
/home/stack/apache-trafodion-2.0.1-incubating/core/sqf/export/lib64d
##(setupdir)
ln -sf
/home/stack/apache-trafodion-2.0.1-incubating/core/sql/lib/linux/64bit/debug/libarkcmplib.so
/home/stack/apache-trafodion-2.0.1-incubating/core/sqf/export/lib64d
 ##(setupdir)
ln -sf
/home/stack/apache-trafodion-2.0.1-incubating/core/sql/lib/linux/64bit/debug/libqmscommon.so
/home/stack/apache-trafodion-2.0.1-incubating/core/sqf/export/lib64d
 ##(setupdir)
ln -sf
/home/stack/apache-trafodion-2.0.1-incubating/core/sql/lib/linux/64bit/debug/libSqlCompilerDebugger.so
/home/stack/apache-trafodion-2.0.1-incubating/core/sqf/export/lib64d
 ##(setupdir)
ln -sf
/home/stack/apache-trafodion-2.0.1-incubating/core/sql/lib/linux/64bit/debug/tdm_arkcmp
/home/stack/apache-trafodion-2.0.1-incubating/core/sqf/export/bin64d
##(setupdir)
ln -sf
/home/stack/apache-trafodion-2.0.1-incubating/core/sql/lib/linux/64bit/debug/sqlci
/home/stack/apache-trafodion-2.0.1-incubating/core/sqf/export/bin64d
 ##(setupdir)
ln -sf
/home/stack/apache-trafodion-2.0.1-incubating/core/sql/lib/linux/64bit/debug/tdm_arkesp
/home/stack/apache-trafodion-2.0.1-incubating/core/sqf/export/bin64d
##(setupdir)
ln -sf
/home/stack/apache-trafodion-2.0.1-incubating/core/sql/lib/linux/64bit/debug/tdm_udrserv
/home/stack/apache-trafodion-2.0.1-incubating/core/sqf/export/bin64d
 ##(setupdir)
ln -sf
/home/stack/apache-trafodion-2.0.1-incubating/core/sql/lib/linux/64bit/debug/mxlobsrvr
/home/stack/apache-trafodion-2.0.1-incubating/core/sqf/export/bin64d
 ##(setupdir)
ln -sf
/home/stack/apache-trafodion-2.0.1-incubating/core/sql/lib/linux/64bit/debug/mxsscp
/home/stack/apache-trafodion-2.0.1-incubating/core/sqf/export/bin64d
##(setupdir)
ln -sf
/home/stack/apache-trafodion-2.0.1-incubating/core/sql/lib/linux/64bit/debug/mxssmp
/home/stack/apache-trafodion-2.0.1-incubating/core/sqf/export/bin64d
##(setupdir)
ln -sf
/home/stack/apache-trafodion-2.0.1-incubating/core/sql/lib/linux/64bit/debug/clitestdriver
/home/stack/apache-trafodion-2.0.1-incubating/core/sqf/export/bin64d
 ##(setupdir)
make[4]: Leaving directory
`/home/stack/apache-trafodion-2.0.1-incubating/core/sql/nskgmake'
 ##(setupdir)
make[3]: Leaving directory
`/home/stack/apache-trafodion-2.0.1-incubating/core/sqf/sql' ##(setupdir)
ln -sf ../../mondump export/bin64d      ##(setupdir)
ln -sf ../../sqid export/bin64d ##(setupdir)
ln -sf ../../sqinfo export/bin64d       ##(setupdir)
ln -sf ../../sqvers export/bin64d       ##(setupdir)
ln -sf
/home/stack/apache-trafodion-2.0.1-incubating/core/sqf/../sql/bin/SqlciErrors.txt
export/include/sql     ##(setupdir)
ln -sf
/home/stack/apache-trafodion-2.0.1-incubating/core/sqf/../sql/cli/sqlcli.h
export/include/sql    ##(setupdir)
ln -sf
/home/stack/apache-trafodion-2.0.1-incubating/core/sqf/../sql/sqludr/sqludr.h
export/include/sql ##(setupdir)
mkdir -p export/include/nsk     ##(setupdir)
ln -sf
/home/stack/apache-trafodion-2.0.1-incubating/core/sqf/inc/cextdecs/cextdecs.h
export/include/nsk        ##(setupdir)
mkdir -p export/lib/mx_ustat    ##(setupdir)
ln -sf
/home/stack/apache-trafodion-2.0.1-incubating/core/sqf/../sql/ustat/USAS.sh
export/lib/mx_ustat  ##(setupdir)
        ##(JDBCT4)
lib:    ##(JDBCT4)
ln -sf
/home/stack/apache-trafodion-2.0.1-incubating/core/sqf/../sql/ustat/FillAutoTbl.sh
export/lib/mx_ustat   ##(setupdir)
ln -sf
/home/stack/apache-trafodion-2.0.1-incubating/core/sqf/../sql/ustat/RunLogUstats.sh
export/lib/mx_ustat  ##(setupdir)
ln -sf
/home/stack/apache-trafodion-2.0.1-incubating/core/sqf/../sql/ustat/StopAutoStats.sh
export/lib/mx_ustat ##(setupdir)
ln -sf
/home/stack/apache-trafodion-2.0.1-incubating/core/sqf/../sql/ustat/stats_profile
export/lib/mx_ustat    ##(setupdir)
make[2]: Leaving directory
`/home/stack/apache-trafodion-2.0.1-incubating/core/sqf'     ##(setupdir)
echo "Building MPI"
Building MPI
cd mpi && make sq-local 2>&1 | sed -e "s/$/     ##(MPI)/";exit
${PIPESTATUS[0]}
make[2]: Entering directory
`/home/stack/apache-trafodion-2.0.1-incubating/core/mpi'    ##(MPI)
make[2]: Nothing to be done for `sq-local'.     ##(MPI)
make[2]: Leaving directory
`/home/stack/apache-trafodion-2.0.1-incubating/core/mpi'     ##(MPI)
cd dbsecurity && make all 2>&1 | sed -e "s/$/   ##(Security)/";exit
${PIPESTATUS[0]}
echo "Building SM"
Building SM
cd seamonster/src; make all 2>&1 | sed -e "s/$/ ##(SEAMONSTER)/" ; exit
${PIPESTATUS[0]}
make[2]: Entering directory
`/home/stack/apache-trafodion-2.0.1-incubating/core/dbsecurity'
##(Security)
cd /home/stack/apache-trafodion-2.0.1-incubating/core/sqf; make genverhdr;
     ##(Security)
make[3]: Entering directory
`/home/stack/apache-trafodion-2.0.1-incubating/core/sqf'    ##(Security)
make[2]: Entering directory
`/home/stack/apache-trafodion-2.0.1-incubating/core/seamonster/src'
##(SEAMONSTER)
make[2]: Nothing to be done for `all'.  ##(SEAMONSTER)
make[2]: Leaving directory
`/home/stack/apache-trafodion-2.0.1-incubating/core/seamonster/src'
 ##(SEAMONSTER)
/bin/cp -p scripts/sqcertgen
/home/stack/apache-trafodion-2.0.1-incubating/core/sqf/sql/scripts
##(Security)
Building Apache Trafodion Version 2.0.1 debug   ##(Security)
/bin/cp -p scripts/update_auth
/home/stack/apache-trafodion-2.0.1-incubating/core/sqf/sql/scripts
##(Security)
        ##(Security)
        ##(JDBCT4)
deploy: ##(JDBCT4)
        ##(JDBCT4)
BUILD SUCCESSFUL        ##(JDBCT4)
Total time: 1 second    ##(JDBCT4)
mvn install:install-file -Dfile=conn/jdbc_type4/lib/jdbcT4.jar \
            -DgroupId=org.trafodion.jdbc.t4.T4Driver -DartifactId=t4driver
-Dversion="$TRAFODION_VER" \
            -Dpackaging=jar -DgeneratePom=true | sed -e "s/$/
 ##(JDBCT4)/";exit ${PIPESTATUS[0]}
cd build-scripts && ./genverhdr.ksh -major "2" \        ##(Security)
                                        -minor "0" \    ##(Security)
                                        -update "1" \   ##(Security)
                                        -build "stack" \        ##(Security)
                                        -flavor "debug" \       ##(Security)
                                        -funbranch "_dh_" \     ##(Security)
                                        -branch "-" \   ##(Security)
                                        -date "05Jul16" ##(Security)
make[3]: Leaving directory
`/home/stack/apache-trafodion-2.0.1-incubating/core/sqf'     ##(Security)
cd auth; make   ##(Security)
make[3]: Entering directory
`/home/stack/apache-trafodion-2.0.1-incubating/core/dbsecurity/auth'
 ##(Security)
make[3]: Nothing to be done for `all'.  ##(Security)
make[3]: Leaving directory
`/home/stack/apache-trafodion-2.0.1-incubating/core/dbsecurity/auth'
##(Security)
cd cert; make   ##(Security)
make[3]: Entering directory
`/home/stack/apache-trafodion-2.0.1-incubating/core/dbsecurity/cert'
 ##(Security)
make[3]: `libsqcert.so' is up to date.  ##(Security)
make[3]: Leaving directory
`/home/stack/apache-trafodion-2.0.1-incubating/core/dbsecurity/cert'
##(Security)
make[2]: Leaving directory
`/home/stack/apache-trafodion-2.0.1-incubating/core/dbsecurity'
 ##(Security)
cd sqf && make all
make[2]: Entering directory
`/home/stack/apache-trafodion-2.0.1-incubating/core/sqf'
cd sqevlog; make 2>&1 | sed -e "s/$/    ##(SQF)/" ; exit ${PIPESTATUS[0]}
Building Apache Trafodion Version 2.0.1 debug
make[3]: Entering directory
`/home/stack/apache-trafodion-2.0.1-incubating/core/sqf/sqevlog'    ##(SQF)
cd sq_evl_libs; make    ##(SQF)
make[4]: Entering directory
`/home/stack/apache-trafodion-2.0.1-incubating/core/sqf/sqevlog/sq_evl_libs'
       ##(SQF)
cd sq_evl_lib; make     ##(SQF)

make[5]: Entering directory
`/home/stack/apache-trafodion-2.0.1-incubating/core/sqf/sqevlog/sq_evl_libs/sq_evl_lib'
    ##(SQF)
make[5]: Nothing to be done for `all'.  ##(SQF)
make[5]: Leaving directory
`/home/stack/apache-trafodion-2.0.1-incubating/core/sqf/sqevlog/sq_evl_libs/sq_evl_lib'
     ##(SQF)
make[4]: Leaving directory
`/home/stack/apache-trafodion-2.0.1-incubating/core/sqf/sqevlog/sq_evl_libs'
##(SQF)
make[3]: Leaving directory
`/home/stack/apache-trafodion-2.0.1-incubating/core/sqf/sqevlog'     ##(SQF)
cd build-scripts && ./genverhdr.ksh -major "2" \
                                        -minor "0" \
                                        -update "1" \
                                        -build "stack" \
                                        -flavor "debug" \
                                        -funbranch "_dh_" \
                                        -branch "-" \
                                        -date "05Jul16"
cd src/seabed; make 2>&1 | sed -e "s/$/ ##(SQF)/" ; exit ${PIPESTATUS[0]}
make[3]: Entering directory
`/home/stack/apache-trafodion-2.0.1-incubating/core/sqf/src/seabed' ##(SQF)
cd src; make    ##(SQF)
cd src/stfs; make -f Makefile.stub  2>&1 | sed -e "s/$/ ##(SQF)/" ; exit
${PIPESTATUS[0]}
make[4]: Entering directory
`/home/stack/apache-trafodion-2.0.1-incubating/core/sqf/src/seabed/src'
##(SQF)
make[4]: Nothing to be done for `all'.  ##(SQF)
make[4]: Leaving directory
`/home/stack/apache-trafodion-2.0.1-incubating/core/sqf/src/seabed/src'
 ##(SQF)
cd tools; make  ##(SQF)
make[3]: Entering directory
`/home/stack/apache-trafodion-2.0.1-incubating/core/sqf/src/stfs'   ##(SQF)
make[3]: Nothing to be done for `all'.  ##(SQF)
make[3]: Leaving directory
`/home/stack/apache-trafodion-2.0.1-incubating/core/sqf/src/stfs'    ##(SQF)
make[4]: Entering directory
`/home/stack/apache-trafodion-2.0.1-incubating/core/sqf/src/seabed/tools'
##(SQF)
make[4]: Nothing to be done for `all'.  ##(SQF)
make[4]: Leaving directory
`/home/stack/apache-trafodion-2.0.1-incubating/core/sqf/src/seabed/tools'
 ##(SQF)
make[3]: Leaving directory
`/home/stack/apache-trafodion-2.0.1-incubating/core/sqf/src/seabed'  ##(SQF)
cd src/win; make 2>&1 | sed -e "s/$/    ##(SQF)/" ; exit ${PIPESTATUS[0]}
cd src/tm; make 2>&1 | sed -e "s/$/     ##(SQF)/" ; exit ${PIPESTATUS[0]}
make[3]: Entering directory
`/home/stack/apache-trafodion-2.0.1-incubating/core/sqf/src/win'    ##(SQF)
make[3]: Nothing to be done for `all'.  ##(SQF)
make[3]: Leaving directory
`/home/stack/apache-trafodion-2.0.1-incubating/core/sqf/src/win'     ##(SQF)
cd ../seamonster/src; make 2>&1 | sed -e "s/$/  ##(SEAMONSTER)/" ; exit
${PIPESTATUS[0]}
make[3]: Entering directory
`/home/stack/apache-trafodion-2.0.1-incubating/core/seamonster/src'
##(SEAMONSTER)
make[3]: Nothing to be done for `all'.  ##(SEAMONSTER)
make[3]: Leaving directory
`/home/stack/apache-trafodion-2.0.1-incubating/core/seamonster/src'
 ##(SEAMONSTER)
cd monitor/linux; make 2>&1 | sed -e "s/$/      ##(SQF)/" ; exit
${PIPESTATUS[0]}
make[3]: Entering directory
`/home/stack/apache-trafodion-2.0.1-incubating/core/sqf/src/tm'     ##(SQF)
cd
/home/stack/apache-trafodion-2.0.1-incubating/core/sqf/src/seatrans/hbase-trx;
make  ##(SQF)
make[3]: Circular Linux-x86_64/64/dbg/tm <- Linux-x86_64/64/dbg/tm
dependency dropped.  ##(SQF)
make[4]: Entering directory
`/home/stack/apache-trafodion-2.0.1-incubating/core/sqf/src/seatrans/hbase-trx'
    ##(SQF)
make[4]: warning: jobserver unavailable: using -j1.  Add `+' to parent make
rule.       ##(SQF)
./genvers > hbase-trx.jar.versions      ##(SQF)
./reinstate_orig        ##(SQF)
make[3]: Entering directory
`/home/stack/apache-trafodion-2.0.1-incubating/core/sqf/monitor/linux'
 ##(SQF)
Building target:
/home/stack/apache-trafodion-2.0.1-incubating/core/sqf/export/bin64d/monitor
  ##(SQF)
Invoking: Linker        ##(SQF)
/home/stack/trafodion-build-tools/dest-mpich-3.0.4/bin/mpicxx
-o/home/stack/apache-trafodion-2.0.1-incubating/core/sqf/export/bin64d/monitor
Linux-x86_64/64/dbg/versmon.o Linux-x86_64/64/dbg/monitor.o
Linux-x86_64/64/dbg/cluster.o Linux-x86_64/64/dbg/open.o Linux-x86_64/6
4/dbg/process.o Linux-x86_64/64/dbg/notice.o Linux-x86_64/64/dbg/props.o
Linux-x86_64/64/dbg/config.o Linux-x86_64/64/dbg/monlogging.o
Linux-x86_64/64/dbg/tmsync.o Linux-x86_64/64/dbg/device.o
Linux-x86_64/64/dbg/mlio.o Linux-x86_64/64/dbg/monprof.o
Linux-x86_64/64/dbg/mo
ntrace.o Linux-x86_64/64/dbg/monsonar.o Linux-x86_64/64/dbg/threadtls.o
Linux-x86_64/64/dbg/trace.o Linux-x86_64/64/dbg/otrace.o
Linux-x86_64/64/dbg/redirector.o Linux-x86_64/64/dbg/lock.o
Linux-x86_64/64/dbg/clusterconf.o Linux-x86_64/64/dbg/lnodeconfig.o
Linux-x86_64/64
/dbg/pnodeconfig.o Linux-x86_64/64/dbg/lnode.o Linux-x86_64/64/dbg/pnode.o
Linux-x86_64/64/dbg/intprocess.o Linux-x86_64/64/dbg/healthcheck.o
Linux-x86_64/64/dbg/commaccept.o Linux-x86_64/64/dbg/dm.o
Linux-x86_64/64/dbg/reqworker.o Linux-x86_64/64/dbg/reqqueue.o Linux-x86
_64/64/dbg/reqattstartup.o Linux-x86_64/64/dbg/reqdump.o
Linux-x86_64/64/dbg/reqevent.o Linux-x86_64/64/dbg/reqexit.o
Linux-x86_64/64/dbg/reqget.o Linux-x86_64/64/dbg/reqkill.o
Linux-x86_64/64/dbg/reqmonstats.o Linux-x86_64/64/dbg/reqmount.o
Linux-x86_64/64/dbg/reqnewproc
.o Linux-x86_64/64/dbg/reqnodedown.o Linux-x86_64/64/dbg/reqnodeinfo.o
Linux-x86_64/64/dbg/reqnodename.o Linux-x86_64/64/dbg/reqpnodeinfo.o
Linux-x86_64/64/dbg/reqnodeup.o Linux-x86_64/64/dbg/reqnotify.o
Linux-x86_64/64/dbg/reqopen.o Linux-x86_64/64/dbg/reqprocinfo.o Linu
x-x86_64/64/dbg/reqset.o Linux-x86_64/64/dbg/reqshutdown.o
Linux-x86_64/64/dbg/reqstartup.o Linux-x86_64/64/dbg/reqtmleader.o
Linux-x86_64/64/dbg/reqtmready.o Linux-x86_64/64/dbg/reqtmseqnum.o
Linux-x86_64/64/dbg/reqtmsync.o Linux-x86_64/64/dbg/reqzoneinfo.o
Linux-x86_64/
64/dbg/replicate.o Linux-x86_64/64/dbg/gentrap.o
Linux-x86_64/64/dbg/monrobsem.o Linux-x86_64/64/dbg/CommonLogger.o
-L/home/stack/apache-trafodion-2.0.1-incubating/core/sqf/export/lib64d -lrt
-lsblogalt -lmpich -L -ldmalloc -lsqlite3 -llog4cxx -ldl -lz    ##(SQF)
Deleting generated file
./src/main/java/org/apache/hadoop/hbase/client/TrafParallelClientScanner.java
  ##(SQF)
Deleting generated file
./src/main/java/org/apache/hadoop/hbase/client/ClientScanner98.java
##(SQF)
Deleting generated file
./src/main/java/org/apache/hadoop/hbase/client/PatchClientScanner.java
 ##(SQF)
Deleting generated file
./src/main/java/org/apache/hadoop/hbase/client/transactional/TransactionalScanner.java
 ##(SQF)
Deleting generated file
./src/main/java/org/apache/hadoop/hbase/client/transactional/SsccTransactionalScanner.java
     ##(SQF)
Deleting generated file
./src/main/java/org/apache/hadoop/hbase/coprocessor/transactional/TrxRegionObserver.java
       ##(SQF)
Deleting generated file
./src/main/java/org/apache/hadoop/hbase/coprocessor/transactional/TrxRegionEndpoint.java
       ##(SQF)
Deleting generated file
./src/main/java/org/apache/hadoop/hbase/coprocessor/transactional/SsccRegionEndpoint.java
      ##(SQF)
Deleting generated file
./src/main/java/org/apache/hadoop/hbase/regionserver/transactional/TrxTransactionState.java
    ##(SQF)
Deleting generated file
./src/main/java/org/apache/hadoop/hbase/regionserver/transactional/KeyValueListScanner.java
    ##(SQF)
Deleting generated file
./src/main/java/org/apache/hadoop/hbase/regionserver/transactional/CleanOldTransactionsChore.java
      ##(SQF)
Deleting generated file
./src/main/java/org/apache/hadoop/hbase/regionserver/transactional/MemoryUsageChore.java
       ##(SQF)
./uncomment_string APACHE       ##(SQF)
preprocess for distro: APACHE   ##(SQF)
preprocessing APACHE and generating file
./src/main/java/org/apache/hadoop/hbase/client/TrafParallelClientScanner.java
 ##(SQF)
[INFO] Scanning for projects...
preprocessing APACHE and generating file
./src/main/java/org/apache/hadoop/hbase/client/ClientScanner98.java
 ##(SQF)
preprocessing APACHE and generating file
./src/main/java/org/apache/hadoop/hbase/client/PatchClientScanner.java
##(SQF)
preprocessing APACHE and generating file
./src/main/java/org/apache/hadoop/hbase/client/transactional/TransactionalScanner.java
##(SQF)
preprocessing APACHE and generating file
./src/main/java/org/apache/hadoop/hbase/client/transactional/SsccTransactionalScanner.java
    ##(SQF)
preprocessing APACHE and generating file
./src/main/java/org/apache/hadoop/hbase/coprocessor/transactional/TrxRegionObserver.java
      ##(SQF)
preprocessing APACHE and generating file
./src/main/java/org/apache/hadoop/hbase/coprocessor/transactional/TrxRegionEndpoint.java
      ##(SQF)
preprocessing APACHE and generating file
./src/main/java/org/apache/hadoop/hbase/coprocessor/transactional/SsccRegionEndpoint.java
     ##(SQF)
[WARNING]
[WARNING] Some problems were encountered while building the effective model
for org.trafodion:lib_mgmt:jar:2.0.1
[WARNING] 'version' contains an expression but should be a constant. @
org.trafodion:lib_mgmt:${env.TRAFODION_VER},
/home/stack/apache-trafodion-2.0.1-incubating/core/sql/lib_mgmt/pom.xml,
line 29, column 11
[WARNING]
[WARNING] It is highly recommended to fix these problems because they
threaten the stability of your build.
[WARNING]
[WARNING] For this reason, future Maven versions might no longer support
building such malformed projects.
[WARNING]
[INFO]
[INFO]
------------------------------------------------------------------------
[INFO] Building lib_mgmt 2.0.1
[INFO]
------------------------------------------------------------------------
preprocessing APACHE and generating file
./src/main/java/org/apache/hadoop/hbase/regionserver/transactional/TrxTransactionState.java
   ##(SQF)
preprocessing APACHE and generating file
./src/main/java/org/apache/hadoop/hbase/regionserver/transactional/KeyValueListScanner.java
   ##(SQF)
preprocessing APACHE and generating file
./src/main/java/org/apache/hadoop/hbase/regionserver/transactional/CleanOldTransactionsChore.java
     ##(SQF)
preprocessing APACHE and generating file
./src/main/java/org/apache/hadoop/hbase/regionserver/transactional/MemoryUsageChore.java
      ##(SQF)
make build_chk_apache   ##(SQF)
make[5]: Entering directory
`/home/stack/apache-trafodion-2.0.1-incubating/core/sqf/src/seatrans/hbase-trx'
    ##(SQF)
./genvers > hbase-trx.jar.versions      ##(SQF)
/usr/bin/ld: cannot find -lmpich        ##(SQF)
collect2: ld returned 1 exit status     ##(SQF)
make[3]: ***
[/home/stack/apache-trafodion-2.0.1-incubating/core/sqf/export/bin64d/monitor]
Error 1     ##(SQF)
make[3]: Leaving directory
`/home/stack/apache-trafodion-2.0.1-incubating/core/sqf/monitor/linux'
  ##(SQF)
make[2]: *** [make_monitor] Error 2
make[2]: *** Waiting for unfinished jobs....
make[5]: Leaving directory
`/home/stack/apache-trafodion-2.0.1-incubating/core/sqf/src/seatrans/hbase-trx'
     ##(SQF)
echo "mvn package -DskipTests"  ##(SQF)
mvn package -DskipTests ##(SQF)
echo "### For full Maven output, see file build_trx.log"        ##(SQF)
### For full Maven output, see file build_trx.log       ##(SQF)
set -o pipefail && mvn -f pom.xml.apache package -DskipTests | tee
build_trx.log        ##(SQF)
[INFO]
[INFO] --- maven-antrun-plugin:1.6:run (generate) @ lib_mgmt ---
[INFO] Executing tasks

main:
[INFO] Scanning for projects...        ##(JDBCT4)
[INFO]
------------------------------------------------------------------------
     ##(JDBCT4)
[INFO] Building Maven Stub Project (No POM) 1        ##(JDBCT4)
[INFO]
------------------------------------------------------------------------
     ##(JDBCT4)
[INFO]         ##(JDBCT4)
[INFO] --- maven-install-plugin:2.4:install-file (default-cli) @
standalone-pom ---        ##(JDBCT4)
     [exec] Result: 128
     [copy] Copying 1 file to
/home/stack/apache-trafodion-2.0.1-incubating/core/sql/lib_mgmt/src/main/java/org/trafodion/libmgmt
[INFO] Executed tasks
[INFO]
[INFO] --- maven-resources-plugin:2.6:resources (default-resources) @
lib_mgmt ---
[INFO] Installing
/home/stack/apache-trafodion-2.0.1-incubating/core/conn/jdbc_type4/lib/jdbcT4.jar
to
/home/stack/.m2/repository/org/trafodion/jdbc/t4/T4Driver/t4driver/2.0.1/t4driver-2.0.1.jar
       ##(JDBCT4)
[INFO] Installing /tmp/mvninstall3109229053232183733.pom to
/home/stack/.m2/repository/org/trafodion/jdbc/t4/T4Driver/t4driver/2.0.1/t4driver-2.0.1.pom
       ##(JDBCT4)
[INFO]
------------------------------------------------------------------------
     ##(JDBCT4)
[INFO] BUILD SUCCESS        ##(JDBCT4)
[INFO]
------------------------------------------------------------------------
     ##(JDBCT4)
[INFO] Total time: 0.883 s        ##(JDBCT4)
[INFO] Finished at: 2016-07-05T21:48:12-07:00        ##(JDBCT4)
[WARNING] Using platform encoding (UTF-8 actually) to copy filtered
resources, i.e. build is platform dependent!
[INFO] Copying 2 resources
[INFO] Final Memory: 8M/281M        ##(JDBCT4)
[INFO]
------------------------------------------------------------------------
     ##(JDBCT4)
[INFO]
[INFO] --- maven-compiler-plugin:3.1:compile (default-compile) @ lib_mgmt
---
cd conn/trafci && ant dist 2>&1 | sed -e "s/$/  ##(TRAFCI)/" ; exit
${PIPESTATUS[0]}
cd rest && make 2>&1 | sed -e "s/$/  ##(REST)/" ; exit ${PIPESTATUS[0]}
make[2]: Entering directory
`/home/stack/apache-trafodion-2.0.1-incubating/core/rest'  ##(REST)
./genvers > trafodion-rest.jar.versions  ##(REST)
update manifest  ##(REST)
update manifest  ##(REST)
echo "mvn site package -DskipTests"  ##(REST)
mvn site package -DskipTests  ##(REST)
echo "### For full Maven output, see file build_rest.log"  ##(REST)
### For full Maven output, see file build_rest.log  ##(REST)
set -o pipefail && mvn site package -DskipTests | tee build_rest.log | grep
--line-buffered -E -e '^\[[^WId]' -e '^\[INFO\] B[Uu][Ii][Ll][Dd]' -e 'to
compile'  ##(REST)
Buildfile: build.xml    ##(TRAFCI)
[INFO] Changes detected - recompiling the module!
[WARNING] File encoding has not been set, using platform encoding UTF-8,
i.e. build is platform dependent!
[INFO] Compiling 2 source files to
/home/stack/apache-trafodion-2.0.1-incubating/core/sql/lib_mgmt/target/classes
     [exec] ../../sqf/build-scripts/build.id: line 42: svn: command not
found   ##(TRAFCI)
        ##(TRAFCI)
init:   ##(TRAFCI)
        ##(TRAFCI)
compile:        ##(TRAFCI)
[INFO] Scanning for projects... ##(SQF)
[WARNING]       ##(SQF)
[WARNING] Some problems were encountered while building the effective model
for org.apache:hbase-trx-apache1_0_2:jar:2.0.1      ##(SQF)
[WARNING] 'version' contains an expression but should be a constant. @
org.apache:hbase-trx-apache1_0_2:${env.TRAFODION_VER},
/home/stack/apache-trafodion-2.0.1-incubating/core/sqf/src/seatrans/hbase-trx/pom.xml.apache,
line 43, column 12      ##(SQF)
[WARNING] 'build.plugins.plugin.version' for
org.apache.maven.plugins:maven-jar-plugin is missing. @
org.apache:hbase-trx-apache1_0_2:${env.TRAFODION_VER},
/home/stack/apache-trafodion-2.0.1-incubating/core/sqf/src/seatrans/hbase-trx/pom.xml.apache,
line 80, column 17        ##(SQF)
[WARNING]       ##(SQF)
[WARNING] It is highly recommended to fix these problems because they
threaten the stability of your build.     ##(SQF)
[WARNING]       ##(SQF)
[WARNING] For this reason, future Maven versions might no longer support
building such malformed projects.      ##(SQF)
[WARNING]       ##(SQF)
     [echo] BUILD Vproc version TrafCI_Build_   ##(TRAFCI)
[INFO]
[INFO]
------------------------------------------------------------------------
##(SQF)
[INFO] Building HBase - Trx 2.0.1       ##(SQF)
[INFO]
------------------------------------------------------------------------
##(SQF)
[INFO]  ##(SQF)
[INFO] --- maven-resources-plugin:2.6:resources (default-resources) @
hbase-trx-cdh5_4 ---      ##(SQF)
[INFO] Using 'UTF-8' encoding to copy filtered resources.       ##(SQF)
[INFO] skip non existing resourceDirectory
/home/stack/apache-trafodion-2.0.1-incubating/core/sqf/src/seatrans/hbase-trx/src/main/resources
    ##(SQF)
[INFO]  ##(SQF)
[INFO] --- maven-compiler-plugin:3.1:compile (default-compile) @
hbase-trx-cdh5_4 ---   ##(SQF)
[INFO] Changes detected - recompiling the module!       ##(SQF)
[INFO] Compiling 64 source files to
/home/stack/apache-trafodion-2.0.1-incubating/core/sqf/src/seatrans/hbase-trx/target/classes_cdh5_4
##(SQF)
[WARNING]
/home/stack/apache-trafodion-2.0.1-incubating/core/sqf/src/seatrans/hbase-trx/src/main/java/org/apache/hadoop/hbase/client/transactional/TransactionManager.java:
Some input files use or override a deprecated API.      ##(SQF)
[WARNING]
/home/stack/apache-trafodion-2.0.1-incubating/core/sqf/src/seatrans/hbase-trx/src/main/java/org/apache/hadoop/hbase/client/transactional/TransactionManager.java:
Recompile with -Xlint:deprecation for details.  ##(SQF)
[WARNING]
/home/stack/apache-trafodion-2.0.1-incubating/core/sqf/src/seatrans/hbase-trx/src/main/java/org/apache/hadoop/hbase/coprocessor/transactional/TrxRegionEndpoint.java:
Some input files use unchecked or unsafe operations.        ##(SQF)
[WARNING]
/home/stack/apache-trafodion-2.0.1-incubating/core/sqf/src/seatrans/hbase-trx/src/main/java/org/apache/hadoop/hbase/coprocessor/transactional/TrxRegionEndpoint.java:
Recompile with -Xlint:unchecked for details.        ##(SQF)
[INFO]  ##(SQF)
[INFO] --- maven-dependency-plugin:2.8:build-classpath
(create-mrapp-generated-classpath) @ hbase-trx-cdh5_4 ---        ##(SQF)
[INFO] Wrote classpath file
'/home/stack/apache-trafodion-2.0.1-incubating/core/sqf/src/seatrans/hbase-trx/target/test-classes/mrapp-generated-classpath'.
     ##(SQF)
[INFO]  ##(SQF)
[INFO] --- maven-resources-plugin:2.6:testResources (default-testResources)
@ hbase-trx-cdh5_4 ---      ##(SQF)
[INFO] Using 'UTF-8' encoding to copy filtered resources.       ##(SQF)
[INFO] skip non existing resourceDirectory
/home/stack/apache-trafodion-2.0.1-incubating/core/sqf/src/seatrans/hbase-trx/src/test/resources
    ##(SQF)
[INFO]  ##(SQF)
[INFO] --- maven-compiler-plugin:3.1:testCompile (default-testCompile) @
hbase-trx-cdh5_4 ---   ##(SQF)
[INFO] No sources to compile    ##(SQF)
[INFO]  ##(SQF)
[INFO] --- maven-surefire-plugin:2.5:test (default-test) @ hbase-trx-cdh5_4
--- ##(SQF)
[INFO] Tests are skipped.       ##(SQF)
[INFO]  ##(SQF)
[INFO] --- maven-jar-plugin:2.4:jar (default-jar) @ hbase-trx-cdh5_4 ---
     ##(SQF)
[INFO] Building jar:
/home/stack/apache-trafodion-2.0.1-incubating/core/sqf/src/seatrans/hbase-trx/target/hbase-trx-cdh5_4-2.0.1.jar
   ##(SQF)
[INFO]  ##(SQF)
[INFO] --- maven-resources-plugin:2.6:resources (default-resources) @
hbase-trx-cdh5_4 ---      ##(SQF)
[INFO] Using 'UTF-8' encoding to copy filtered resources.       ##(SQF)
[INFO] skip non existing resourceDirectory
/home/stack/apache-trafodion-2.0.1-incubating/core/sqf/src/seatrans/hbase-trx/src/main/resources
    ##(SQF)
[INFO]  ##(SQF)
[INFO] --- maven-compiler-plugin:3.1:compile (default-compile) @
hbase-trx-cdh5_4 ---   ##(SQF)
[INFO] Nothing to compile - all classes are up to date  ##(SQF)
[INFO]  ##(SQF)
[INFO] --- maven-dependency-plugin:2.8:build-classpath
(create-mrapp-generated-classpath) @ hbase-trx-cdh5_4 ---        ##(SQF)
[INFO] Skipped writing classpath file
'/home/stack/apache-trafodion-2.0.1-incubating/core/sqf/src/seatrans/hbase-trx/target/test-classes/mrapp-generated-classpath'.
No changes found. ##(SQF)
[INFO]  ##(SQF)
[INFO] --- maven-resources-plugin:2.6:testResources (default-testResources)
@ hbase-trx-cdh5_4 ---      ##(SQF)
[INFO] Using 'UTF-8' encoding to copy filtered resources.       ##(SQF)
[INFO] skip non existing resourceDirectory
/home/stack/apache-trafodion-2.0.1-incubating/core/sqf/src/seatrans/hbase-trx/src/test/resources
    ##(SQF)
[INFO]  ##(SQF)
[INFO] --- maven-compiler-plugin:3.1:testCompile (default-testCompile) @
hbase-trx-cdh5_4 ---   ##(SQF)
[INFO] No sources to compile    ##(SQF)
[INFO]  ##(SQF)
[INFO] --- maven-surefire-plugin:2.5:test (default-test) @ hbase-trx-cdh5_4
--- ##(SQF)
[INFO] Tests are skipped.       ##(SQF)
[INFO]  ##(SQF)
[INFO] --- maven-jar-plugin:2.4:jar (default-jar) @ hbase-trx-cdh5_4 ---
     ##(SQF)
[INFO]  ##(SQF)
[INFO] --- maven-install-plugin:2.4:install (default-install) @
hbase-trx-cdh5_4 ---    ##(SQF)
[INFO] Installing
/home/stack/apache-trafodion-2.0.1-incubating/core/sqf/src/seatrans/hbase-trx/target/hbase-trx-cdh5_4-2.0.1.jar
to
/home/stack/.m2/repository/org/apache/hbase-trx-cdh5_4/2.0.1/hbase-trx-cdh5_4-2.0.1.jar
       ##(SQF)
[INFO] Installing
/home/stack/apache-trafodion-2.0.1-incubating/core/sqf/src/seatrans/hbase-trx/pom.xml.cdh
to
/home/stack/.m2/repository/org/apache/hbase-trx-cdh5_4/2.0.1/hbase-trx-cdh5_4-2.0.1.pom
 ##(SQF)
[INFO]
------------------------------------------------------------------------
##(SQF)
[INFO] BUILD SUCCESS    ##(SQF)
[INFO]
------------------------------------------------------------------------
##(SQF)
[INFO] Total time: 15.795 s     ##(SQF)
[INFO] Finished at: 2016-07-05T21:49:20-07:00   ##(SQF)
[INFO] Final Memory: 44M/648M   ##(SQF)
[INFO]
------------------------------------------------------------------------
##(SQF)
mkdir -p /home/stack/apache-trafodion-2.0.1-incubating/core/sqf/export/lib
     ##(SQF)
cp -pf target/hbase-trx-cdh5_4-2.0.1.jar
/home/stack/apache-trafodion-2.0.1-incubating/core/sqf/export/lib
 ##(SQF)
rm -f hbase-trx.jar.versions    ##(SQF)
make[4]: Leaving directory
`/home/stack/apache-trafodion-2.0.1-incubating/core/sqf/src/seatrans/hbase-trx'
     ##(SQF)
cd
/home/stack/apache-trafodion-2.0.1-incubating/core/sqf/src/seatrans/tm/hbasetmlib2;
make     ##(SQF)
make[4]: Entering directory
`/home/stack/apache-trafodion-2.0.1-incubating/core/sqf/src/seatrans/tm/hbasetmlib2'
       ##(SQF)
# create a jar manifest file with the correct version information
##(SQF)
mkdir -p src/main/resources     ##(SQF)
/home/stack/apache-trafodion-2.0.1-incubating/core/sqf/export/include/SCMBuildJava.sh
1.0.1 >src/main/resources/trafodion-dtm.jar.mf    ##(SQF)
# run maven     ##(SQF)
set -o pipefail; mvn package -DskipTests | tee maven_build.log | grep -e
'\[INFO\] Building' -e '\[INFO\] BUILD SUCCESS' -e 'ERROR'     ##(SQF)
[INFO] Building trafodion-dtm 2.0.1     ##(SQF)
[INFO] Building jar:
/home/stack/apache-trafodion-2.0.1-incubating/core/sqf/src/seatrans/tm/hbasetmlib2/target/trafodion-dtm-2.0.1.jar
 ##(SQF)
[INFO] BUILD SUCCESS    ##(SQF)
set -o pipefail; mvn -f pom.xml.apache package -DskipTests | tee
maven_build_apache.log | grep -e '\[INFO\] Building' -e '\[INFO\] BUILD
SUCCESS' -e 'ERROR'    ##(SQF)
[INFO] Building trafodion-dtm 2.0.1     ##(SQF)
[INFO] Building jar:
/home/stack/apache-trafodion-2.0.1-incubating/core/sqf/src/seatrans/tm/hbasetmlib2/target/trafodion-dtm-apache1_0_2-2.0.1.jar
     ##(SQF)
[INFO] BUILD SUCCESS    ##(SQF)
set -o pipefail; mvn -f pom.xml.hdp package -DskipTests | tee
maven_build_hdp.log | grep -e '\[INFO\] Building' -e '\[INFO\] BUILD
SUCCESS' -e 'ERROR'          ##(SQF)
[INFO] Building trafodion-dtm 2.0.1     ##(SQF)
[INFO] Building jar:
/home/stack/apache-trafodion-2.0.1-incubating/core/sqf/src/seatrans/tm/hbasetmlib2/target/trafodion-dtm-hdp2_3-2.0.1.jar
  ##(SQF)
[INFO] BUILD SUCCESS    ##(SQF)
cp -pf target/trafodion-dtm-*.jar
/home/stack/apache-trafodion-2.0.1-incubating/core/sqf/export/lib
##(SQF)
make[4]: Leaving directory
`/home/stack/apache-trafodion-2.0.1-incubating/core/sqf/src/seatrans/tm/hbasetmlib2'
##(SQF)
USE_THREADED_IO =  1    ##(SQF)
/usr/bin/g++  -DSQ_PHANDLE_VERIFIER -m64  -Xlinker --copy-dt-needed-entries
-I. -I/usr/lib/jvm/java-1.7.0-openjdk.x86_64/include
-I/usr/lib/jvm/java-1.7.0-openjdk.x86_64/include/linux
-L/usr/lib/jvm/java-1.7.0-openjdk.x86_64/jre/lib/amd64/server -ljvm -o
Linux-x86_64/64/dbg/tm Linux-x86_64/64/dbg/tmregistry.o
Linux-x86_64/64/dbg/tmlogging.o Linux-x86_64/64/dbg/tmmap.o
Linux-x86_64/64/dbg/tmmutex.o Linux-x86_64/64/dbg/tmdeque.o
Linux-x86_64/64/dbg/tmsync.o Linux-x86_64/64/dbg/tmtxkey.o
Linux-x86_64/64/dbg/tmrecovstate.o Linux-x86_64/64/dbg/tmpoolelement.o
Linux-x86_64/64/dbg/tmtxbase.o Linux-x86_64/64/dbg/tmtx.o
Linux-x86_64/64/dbg/tmxatxn.o Linux-x86_64/64/dbg/tmtxmsg.o
Linux-x86_64/64/dbg/tminfo.o Linux-x86_64/64/dbg/tmaudit.o
Linux-x86_64/64/dbg/tmrecov.o Linux-x86_64/64/dbg/tmshutdown.o
Linux-x86_64/64/dbg/tmrm.o Linux-x86_64/64/dbg/tmrmtse.o
Linux-x86_64/64/dbg/tmrmtsebranch.o Linux-x86_64/64/dbg/tmrmhbase.o
Linux-x86_64/64/dbg/tmtxbranches.o Linux-x86_64/64/dbg/tmevent.o
Linux-x86_64/64/dbg/tmeventq.o Linux-x86_64/64/dbg/tmthread.o
Linux-x86_64/64/dbg/tmauditobj.o Linux-x86_64/64/dbg/tmtxthread.o
Linux-x86_64/64/dbg/tmtimermain.o Linux-x86_64/64/dbg/tmmmap.o
Linux-x86_64/64/dbg/tmtxstats.o Linux-x86_64/64/dbg/tmstats.o
Linux-x86_64/64/dbg/tmthreadeg.o Linux-x86_64/64/dbg/verstm.o
Linux-x86_64/64/dbg/xaglob.o Linux-x86_64/64/dbg/tmxidmap.o
Linux-x86_64/64/dbg/tmxarmmain.o Linux-x86_64/64/dbg/tm.o
Linux-x86_64/64/dbg/CommonLogger.o
-L/home/stack/apache-trafodion-2.0.1-incubating/core/sqf/export/lib64d
-lutil -lsbms -lsxatmlib -lshbasetmlib    -pthread
-L/home/stack/apache-trafodion-2.0.1-incubating/core/sqf/export/lib64d
-llog4cxx -DTM_BUILD_     ##(SQF)
cp -fup Linux-x86_64/64/dbg/tm
/home/stack/apache-trafodion-2.0.1-incubating/core/sqf/export/bin64d
##(SQF)
cd tools; make  ##(SQF)
make[4]: Entering directory
`/home/stack/apache-trafodion-2.0.1-incubating/core/sqf/src/tm/tools'
##(SQF)
make[4]: Nothing to be done for `all'.  ##(SQF)
make[4]: Leaving directory
`/home/stack/apache-trafodion-2.0.1-incubating/core/sqf/src/tm/tools'
 ##(SQF)
make[3]: Leaving directory
`/home/stack/apache-trafodion-2.0.1-incubating/core/sqf/src/tm'      ##(SQF)
make[2]: Leaving directory
`/home/stack/apache-trafodion-2.0.1-incubating/core/sqf'
make[1]: *** [foundation] Error 2
make[1]: Leaving directory
`/home/stack/apache-trafodion-2.0.1-incubating/core'
make: *** [all] Error 2
[stack@trafodion2 apache-trafodion-2.0.1-incubating]$
[stack@trafodion2 apache-trafodion-2.0.1-incubating]$
[stack@trafodion2 apache-trafodion-2.0.1-incubating]$ more /etc/issue
CentOS release 6.6 (Final)
Kernel \r on an \m

[stack@trafodion2 apache-trafodion-2.0.1-incubating]$
Broadcast message from root@trafodion2.vpc.cloudera.com
        (unknown) at 21:53 ...

The system is going down for power off NOW!
Connection to trafodion2.vpc.cloudera.com closed by remote host.
Connection to trafodion2.vpc.cloudera.com closed.

Mime
  • Unnamed multipart/alternative (inline, None, 0 bytes)
View raw message