trafodion-dev mailing list archives

Site index · List index
Message view « Date » · « Thread »
Top « Date » · « Thread »
From Sandhya Sundaresan <sandhya.sundare...@esgyn.com>
Subject RE: Trafodion master rh6 Daily Test Result - 71 - Still Failing
Date Tue, 09 May 2017 15:48:42 GMT
I'm looking at the hive test failures. Looks like some old directories may be left over  and
the location isn't beng picked up. I'll check.
The executor suite hangs with a similar symptom with UKNOWN_TRANSACTION excpetion which will
hopefully be solved with a pending PR 1075.

Sandhya

-----Original Message-----
From: steve.varnau@esgyn.com [mailto:steve.varnau@esgyn.com] 
Sent: Tuesday, May 9, 2017 6:03 AM
To: dev@trafodion.incubator.apache.org
Subject: Trafodion master rh6 Daily Test Result - 71 - Still Failing

Daily Automated Testing master rh6

Jenkins Job:   https://jenkins.esgyn.com/job/Check-Daily-master-rh6/71/
Archived Logs: http://traf-testlogs.esgyn.com/Daily-master/71
Bld Downloads: http://traf-builds.esgyn.com

Changes since previous daily build:
[sandhyasun] Changes to move all Trafodion created hdfs files under /user/trafodion

[prashanth.vasudev] [TRAFODION-2604] sort merge phase memory pool improvements

[sandhyasun] Expected file change for TEST130

[prashanth.vasudev] fix to address review comments. NADELETE used where needed.



Test Job Results:

FAILURE core-regress-executor-cdh (2 hr 40 min) FAILURE core-regress-executor-hdp (2 hr 40
min) FAILURE core-regress-hive-cdh (58 min) FAILURE core-regress-hive-hdp (1 hr 6 min) FAILURE
core-regress-seabase-cdh (1 hr 26 min) SUCCESS build-rh6-master-debug (33 min) SUCCESS build-rh6-master-release
(39 min) SUCCESS core-regress-charsets-cdh (45 min) SUCCESS core-regress-charsets-hdp (43
min) SUCCESS core-regress-compGeneral-cdh (1 hr 4 min) SUCCESS core-regress-compGeneral-hdp
(1 hr 21 min) SUCCESS core-regress-core-cdh (1 hr 3 min) SUCCESS core-regress-core-hdp (1
hr 34 min) SUCCESS core-regress-fullstack2-cdh (9 min 27 sec) SUCCESS core-regress-fullstack2-hdp
(31 min) SUCCESS core-regress-privs1-cdh (53 min) SUCCESS core-regress-privs1-hdp (1 hr 9
min) SUCCESS core-regress-privs2-cdh (1 hr 10 min) SUCCESS core-regress-privs2-hdp (1 hr 9
min) SUCCESS core-regress-qat-cdh (23 min) SUCCESS core-regress-qat-hdp (23 min) SUCCESS core-regress-seabase-hdp
(2 hr 9 min) SUCCESS core-regress-udr-cdh (27 min) SUCCESS core-regress-udr-hdp (46 min) SUCCESS
jdbc_test-cdh (31 min) SUCCESS jdbc_test-hdp (41 min) SUCCESS phoenix_part1_T2-cdh (1 hr 6
min) SUCCESS phoenix_part1_T2-hdp (1 hr 38 min) SUCCESS phoenix_part1_T4-cdh (1 hr 14 min)
SUCCESS phoenix_part1_T4-hdp (1 hr 15 min) SUCCESS phoenix_part2_T2-cdh (1 hr 6 min) SUCCESS
phoenix_part2_T2-hdp (1 hr 19 min) SUCCESS phoenix_part2_T4-cdh (1 hr 8 min) SUCCESS phoenix_part2_T4-hdp
(1 hr 29 min) SUCCESS pyodbc_test-cdh (15 min) SUCCESS pyodbc_test-hdp (14 min)

Mime
View raw message