tuscany-commits mailing list archives

Site index · List index
Message view « Date » · « Thread »
Top « Date » · « Thread »
From Apache Hudson Server <hud...@hudson.zones.apache.org>
Subject Build failed in Hudson: Tuscany-2x » Apache Tuscany SCA Sample Calculator OSGi #367
Date Sun, 03 Jan 2010 00:11:54 GMT
See <http://hudson.zones.apache.org/hudson/job/Tuscany-2x/org.apache.tuscany.sca$sample-calculator-osgi/367/>

------------------------------------------
[INFO] ------------------------------------------------------------------------
[INFO] Building Apache Tuscany SCA Sample Calculator OSGi
[INFO]    task-segment: [clean, install]
[INFO] ------------------------------------------------------------------------
[INFO] [clean:clean {execution: default-clean}]
[INFO] Deleting directory <http://hudson.zones.apache.org/hudson/job/Tuscany-2x/org.apache.tuscany.sca$sample-calculator-osgi/ws/target>
[INFO] [resources:resources {execution: default-resources}]
[WARNING] Using platform encoding (UTF-8 actually) to copy filtered resources, i.e. build
is platform dependent!
[INFO] Copying 1 resource
[INFO] Copying 2 resources
[INFO] [compiler:compile {execution: default-compile}]
[INFO] Invoking Tuscany Eclipse JDT compiler
[INFO] Compiling 12 to <http://hudson.zones.apache.org/hudson/job/Tuscany-2x/org.apache.tuscany.sca$sample-calculator-osgi/ws/target/classes>
[INFO] Resolving OSGi bundle: sample-calculator-osgi
[INFO] OSGi bundle is resolved: sample-calculator-osgi
[INFO] [resources:testResources {execution: default-testResources}]
[WARNING] Using platform encoding (UTF-8 actually) to copy filtered resources, i.e. build
is platform dependent!
[INFO] skip non existing resourceDirectory <http://hudson.zones.apache.org/hudson/job/Tuscany-2x/org.apache.tuscany.sca$sample-calculator-osgi/ws/src/test/resources>
[INFO] [compiler:testCompile {execution: default-testCompile}]
[INFO] Invoking Tuscany Eclipse JDT compiler
[INFO] Compiling 1 to <http://hudson.zones.apache.org/hudson/job/Tuscany-2x/org.apache.tuscany.sca$sample-calculator-osgi/ws/target/test-classes>
[INFO] [surefire:test {execution: default-test}]
[INFO] Surefire report directory: <http://hudson.zones.apache.org/hudson/job/Tuscany-2x/org.apache.tuscany.sca$sample-calculator-osgi/ws/target/surefire-reports>

-------------------------------------------------------
 T E S T S
-------------------------------------------------------
Running calculator.CalculatorTestCase
SCA Node API ClassLoader: sun.misc.Launcher$AppClassLoader@360be0
Jan 3, 2010 12:17:03 AM org.apache.tuscany.sca.node.impl.NodeImpl start
INFO: Starting node: http://tuscany.apache.org/sca/1.1/nodes/default0 domain: tuscany.apache.org
Jan 3, 2010 12:17:03 AM org.apache.tuscany.sca.node.impl.NodeFactoryImpl loadContributions
INFO: Loading contribution: <http://hudson.zones.apache.org/hudson/job/Tuscany-2x/org.apache.tuscany.sca$sample-calculator-osgi/ws/target/classes/>
Jan 3, 2010 12:17:04 AM org.apache.tuscany.sca.core.assembly.impl.EndpointRegistryImpl addEndpoint
INFO: Add endpoint - (@13359324)Endpoint:  URI = CalculatorServiceComponent#service-binding(CalculatorServiceImpl/CalculatorServiceImpl)
Jan 3, 2010 12:17:04 AM org.apache.tuscany.sca.core.assembly.impl.EndpointRegistryImpl addEndpoint
INFO: Add endpoint - (@17456161)Endpoint:  URI = AddServiceComponent#service-binding(AddServiceImpl/AddServiceImpl)
Jan 3, 2010 12:17:04 AM org.apache.tuscany.sca.core.assembly.impl.EndpointRegistryImpl addEndpoint
INFO: Add endpoint - (@19306178)Endpoint:  URI = SubtractServiceComponent#service-binding(SubtractServiceImpl/SubtractServiceImpl)
Jan 3, 2010 12:17:04 AM org.apache.tuscany.sca.core.assembly.impl.EndpointRegistryImpl addEndpoint
INFO: Add endpoint - (@7577407)Endpoint:  URI = MultiplyServiceComponent#service-binding(MultiplyServiceImpl/MultiplyServiceImpl)
Jan 3, 2010 12:17:04 AM org.apache.tuscany.sca.core.assembly.impl.EndpointRegistryImpl addEndpoint
INFO: Add endpoint - (@14418997)Endpoint:  URI = DivideServiceComponent#service-binding(DivideServiceImpl/DivideServiceImpl)
SCA API ClassLoader: sun.misc.Launcher$AppClassLoader@360be0
3 + 2=5.0
3 - 2=1.0
3 * 2=6.0
3 / 2=1.5
Jan 3, 2010 12:17:04 AM org.apache.tuscany.sca.core.assembly.impl.EndpointRegistryImpl addEndpoint
INFO: Add endpoint - (@11555382)Endpoint:  URI = CalculatorClient#service-binding(CalculatorClient/CalculatorClient)
Jan 3, 2010 12:17:04 AM org.apache.tuscany.sca.node.impl.NodeImpl stop
INFO: Stopping node: http://tuscany.apache.org/sca/1.1/nodes/default0
Jan 3, 2010 12:17:04 AM org.apache.tuscany.sca.core.assembly.impl.EndpointRegistryImpl endpointRemoved
INFO: Remove endpoint - (@13359324)Endpoint:  URI = CalculatorServiceComponent#service-binding(CalculatorServiceImpl/CalculatorServiceImpl)
Jan 3, 2010 12:17:04 AM org.apache.tuscany.sca.core.assembly.impl.EndpointRegistryImpl endpointRemoved
INFO: Remove endpoint - (@17456161)Endpoint:  URI = AddServiceComponent#service-binding(AddServiceImpl/AddServiceImpl)
Jan 3, 2010 12:17:04 AM org.apache.tuscany.sca.core.assembly.impl.EndpointRegistryImpl endpointRemoved
INFO: Remove endpoint - (@19306178)Endpoint:  URI = SubtractServiceComponent#service-binding(SubtractServiceImpl/SubtractServiceImpl)
Jan 3, 2010 12:17:04 AM org.apache.tuscany.sca.core.assembly.impl.EndpointRegistryImpl endpointRemoved
INFO: Remove endpoint - (@7577407)Endpoint:  URI = MultiplyServiceComponent#service-binding(MultiplyServiceImpl/MultiplyServiceImpl)
Jan 3, 2010 12:17:04 AM org.apache.tuscany.sca.core.assembly.impl.EndpointRegistryImpl endpointRemoved
INFO: Remove endpoint - (@14418997)Endpoint:  URI = DivideServiceComponent#service-binding(DivideServiceImpl/DivideServiceImpl)
Jan 3, 2010 12:17:04 AM org.apache.tuscany.sca.core.assembly.impl.EndpointRegistryImpl endpointRemoved
INFO: Remove endpoint - (@11555382)Endpoint:  URI = CalculatorClient#service-binding(CalculatorClient/CalculatorClient)
Tests run: 1, Failures: 0, Errors: 0, Skipped: 0, Time elapsed: 1.35 sec

Results :

Tests run: 1, Failures: 0, Errors: 0, Skipped: 0

[HUDSON] Recording test results
[INFO] [osgi-junit:test {execution: osgi-test}]
[INFO] snapshot org.apache.tuscany.sca:tuscany-extensibility-equinox:2.0-SNAPSHOT: checking
for updates from apache.snapshots
[INFO] snapshot org.apache.tuscany.sca:tuscany-extensibility-equinox:2.0-SNAPSHOT: checking
for updates from codehaus-snapshot
[INFO] snapshot org.apache.tuscany.sca:tuscany-contribution-osgi:2.0-SNAPSHOT: checking for
updates from apache.snapshots
[INFO] snapshot org.apache.tuscany.sca:tuscany-contribution-osgi:2.0-SNAPSHOT: checking for
updates from codehaus-snapshot
[INFO] Generating <http://hudson.zones.apache.org/hudson/job/Tuscany-2x/org.apache.tuscany.sca$sample-calculator-osgi/ws/target/sample-calculator-osgi-osgi.jar>
[INFO] Generating <http://hudson.zones.apache.org/hudson/job/Tuscany-2x/org.apache.tuscany.sca$sample-calculator-osgi/ws/target/sample-calculator-osgi-osgi-tests.jar>
[INFO] Surefire report directory: <http://hudson.zones.apache.org/hudson/job/Tuscany-2x/org.apache.tuscany.sca$sample-calculator-osgi/ws/target/surefire-osgi-reports>
!SESSION 2010-01-03 00:17:07.719 -----------------------------------------------
eclipse.buildId=unknown
java.version=1.6.0_11
java.vendor=Sun Microsystems Inc.
BootLoader constants: OS=linux, ARCH=x86, WS=gtk, NL=en_US

!ENTRY org.eclipse.osgi 4 0 2010-01-03 00:17:07.725
!MESSAGE Error reading configuration: /tmp/hudson/.tuscany/equinox/9aa655ac-46d0-4ac4-aaa7-15040ce9a2a7/config/org.eclipse.osgi/.manager/.fileTableLock
(No such file or directory)
!STACK 0
java.io.FileNotFoundException: /tmp/hudson/.tuscany/equinox/9aa655ac-46d0-4ac4-aaa7-15040ce9a2a7/config/org.eclipse.osgi/.manager/.fileTableLock
(No such file or directory)
	at java.io.RandomAccessFile.open(Native Method)
	at java.io.RandomAccessFile.<init>(RandomAccessFile.java:212)
	at org.eclipse.core.runtime.internal.adaptor.Locker_JavaNio.lock(Locker_JavaNio.java:32)
	at org.eclipse.osgi.storagemanager.StorageManager.lock(StorageManager.java:388)
	at org.eclipse.osgi.storagemanager.StorageManager.open(StorageManager.java:686)
	at org.eclipse.osgi.internal.baseadaptor.BaseStorage.initFileManager(BaseStorage.java:213)
	at org.eclipse.osgi.internal.baseadaptor.BaseStorage.initialize(BaseStorage.java:147)
	at org.eclipse.osgi.baseadaptor.BaseAdaptor.initializeStorage(BaseAdaptor.java:121)
	at org.eclipse.osgi.framework.internal.core.Framework.initialize(Framework.java:185)
	at org.eclipse.osgi.framework.internal.core.Framework.<init>(Framework.java:157)
	at org.eclipse.osgi.framework.internal.core.EquinoxLauncher.internalInit(EquinoxLauncher.java:68)
	at org.eclipse.osgi.framework.internal.core.EquinoxLauncher.internalStart(EquinoxLauncher.java:274)
	at org.eclipse.osgi.framework.internal.core.EquinoxLauncher.start(EquinoxLauncher.java:251)
	at org.eclipse.osgi.launch.Equinox.start(Equinox.java:169)
	at org.apache.tuscany.sca.node.equinox.launcher.EquinoxHost.startFramework(EquinoxHost.java:636)
	at org.apache.tuscany.sca.node.equinox.launcher.EquinoxHost.start(EquinoxHost.java:190)
	at sun.reflect.NativeMethodAccessorImpl.invoke0(Native Method)
	at sun.reflect.NativeMethodAccessorImpl.invoke(NativeMethodAccessorImpl.java:39)
	at sun.reflect.DelegatingMethodAccessorImpl.invoke(DelegatingMethodAccessorImpl.java:25)
	at java.lang.reflect.Method.invoke(Method.java:597)
	at org.apache.tuscany.maven.plugin.surefire.OSGiSurefireBooter.startEquinox(OSGiSurefireBooter.java:973)
	at org.apache.tuscany.maven.plugin.surefire.OSGiSurefireBooter.start(OSGiSurefireBooter.java:927)
	at org.apache.tuscany.maven.plugin.surefire.OSGiSurefireBooter.runSuitesInProcess(OSGiSurefireBooter.java:322)
	at org.apache.tuscany.maven.plugin.surefire.OSGiSurefireBooter.main(OSGiSurefireBooter.java:852)
[HUDSON] Archiving <http://hudson.zones.apache.org/hudson/job/Tuscany-2x/org.apache.tuscany.sca$sample-calculator-osgi/ws/pom.xml>
to /export/home/hudson/hudson/jobs/Tuscany-2x/modules/org.apache.tuscany.sca$sample-calculator-osgi/builds/2010-01-03_00-05-04/archive/org.apache.tuscany.sca/sample-calculator-osgi/2.0-SNAPSHOT/pom.xml
[INFO] ------------------------------------------------------------------------
[ERROR] BUILD FAILURE
[INFO] ------------------------------------------------------------------------
[INFO] There are test failures.

Please refer to <http://hudson.zones.apache.org/hudson/job/Tuscany-2x/org.apache.tuscany.sca$sample-calculator-osgi/ws/target/surefire-osgi-reports>
for the individual test results.
[INFO] ------------------------------------------------------------------------
[INFO] For more information, run Maven with the -e switch
[INFO] ------------------------------------------------------------------------
[INFO] Total time: 6 minutes 18 seconds
[INFO] Finished at: Sun Jan 03 00:17:08 UTC 2010
[INFO] Final Memory: 72M/747M
[INFO] ------------------------------------------------------------------------


Mime
View raw message